%YAML 1.1
%TAG !u! tag:unity3d.com,2011:
--- !u!1 &1609154778634451295
GameObject:
  m_ObjectHideFlags: 0
  m_CorrespondingSourceObject: {fileID: 0}
  m_PrefabInstance: {fileID: 0}
  m_PrefabAsset: {fileID: 0}
  serializedVersion: 6
  m_Component:
  - component: {fileID: 373818716021896514}
  - component: {fileID: 7598707788163446489}
  - component: {fileID: 8888696257626799952}
  - component: {fileID: 4779038341357509831}
  - component: {fileID: 5565538001507931830}
  - component: {fileID: 2663824396696379256}
  m_Layer: 2
  m_Name: LeftHand
  m_TagString: Untagged
  m_Icon: {fileID: 0}
  m_NavMeshLayer: 0
  m_StaticEditorFlags: 0
  m_IsActive: 1
--- !u!4 &373818716021896514
Transform:
  m_ObjectHideFlags: 0
  m_CorrespondingSourceObject: {fileID: 0}
  m_PrefabInstance: {fileID: 0}
  m_PrefabAsset: {fileID: 0}
  m_GameObject: {fileID: 1609154778634451295}
  m_LocalRotation: {x: -0.7071068, y: -0, z: -0, w: 0.7071067}
  m_LocalPosition: {x: 0, y: 1.7, z: 0}
  m_LocalScale: {x: 1, y: 1, z: 1}
  m_ConstrainProportionsScale: 0
  m_Children: []
  m_Father: {fileID: 5950070210003632203}
  m_RootOrder: 2
  m_LocalEulerAnglesHint: {x: 0, y: 0, z: 0}
--- !u!33 &7598707788163446489
MeshFilter:
  m_ObjectHideFlags: 0
  m_CorrespondingSourceObject: {fileID: 0}
  m_PrefabInstance: {fileID: 0}
  m_PrefabAsset: {fileID: 0}
  m_GameObject: {fileID: 1609154778634451295}
  m_Mesh: {fileID: -4299625302041532480, guid: 53122722bfc830744aa2b1717c4403a9, type: 3}
--- !u!23 &8888696257626799952
MeshRenderer:
  m_ObjectHideFlags: 0
  m_CorrespondingSourceObject: {fileID: 0}
  m_PrefabInstance: {fileID: 0}
  m_PrefabAsset: {fileID: 0}
  m_GameObject: {fileID: 1609154778634451295}
  m_Enabled: 1
  m_CastShadows: 1
  m_ReceiveShadows: 1
  m_DynamicOccludee: 1
  m_StaticShadowCaster: 0
  m_MotionVectors: 1
  m_LightProbeUsage: 1
  m_ReflectionProbeUsage: 1
  m_RayTracingMode: 2
  m_RayTraceProcedural: 0
  m_RenderingLayerMask: 1
  m_RendererPriority: 0
  m_Materials:
  - {fileID: 2100000, guid: 1f503b5dcc3049f47af65fbfa0800a78, type: 2}
  - {fileID: 2100000, guid: eb2cb51f63c47d04f8513186584eb54f, type: 2}
  m_StaticBatchInfo:
    firstSubMesh: 0
    subMeshCount: 0
  m_StaticBatchRoot: {fileID: 0}
  m_ProbeAnchor: {fileID: 0}
  m_LightProbeVolumeOverride: {fileID: 0}
  m_ScaleInLightmap: 1
  m_ReceiveGI: 1
  m_PreserveUVs: 0
  m_IgnoreNormalsForChartDetection: 0
  m_ImportantGI: 0
  m_StitchLightmapSeams: 1
  m_SelectedEditorRenderState: 3
  m_MinimumChartSize: 4
  m_AutoUVMaxDistance: 0.5
  m_AutoUVMaxAngle: 89
  m_LightmapParameters: {fileID: 0}
  m_SortingLayerID: 0
  m_SortingLayer: 0
  m_SortingOrder: 0
  m_AdditionalVertexStreams: {fileID: 0}
--- !u!114 &4779038341357509831
MonoBehaviour:
  m_ObjectHideFlags: 0
  m_CorrespondingSourceObject: {fileID: 0}
  m_PrefabInstance: {fileID: 0}
  m_PrefabAsset: {fileID: 0}
  m_GameObject: {fileID: 1609154778634451295}
  m_Enabled: 1
  m_EditorHideFlags: 0
  m_Script: {fileID: 11500000, guid: 894d40bc8f6190849b61bf814e0781d3, type: 3}
  m_Name: 
  m_EditorClassIdentifier: 
  RotationOffset: {x: 0.70710677, y: -0.00000003090862, z: -0.70710677, w: 0.00000003090862}
  PositionOffset: {x: 0, y: 0, z: 0}
--- !u!135 &5565538001507931830
SphereCollider:
  m_ObjectHideFlags: 0
  m_CorrespondingSourceObject: {fileID: 0}
  m_PrefabInstance: {fileID: 0}
  m_PrefabAsset: {fileID: 0}
  m_GameObject: {fileID: 1609154778634451295}
  m_Material: {fileID: 0}
  m_IsTrigger: 1
  m_Enabled: 1
  serializedVersion: 2
  m_Radius: 0.1
  m_Center: {x: 0.07892751, y: -0.019418372, z: -0.015771482}
--- !u!114 &2663824396696379256
MonoBehaviour:
  m_ObjectHideFlags: 0
  m_CorrespondingSourceObject: {fileID: 0}
  m_PrefabInstance: {fileID: 0}
  m_PrefabAsset: {fileID: 0}
  m_GameObject: {fileID: 1609154778634451295}
  m_Enabled: 1
  m_EditorHideFlags: 0
  m_Script: {fileID: 11500000, guid: f4b4d4862bca40f087d7054f128b2f8d, type: 3}
  m_Name: 
  m_EditorClassIdentifier: 
--- !u!1 &2989326492025230220
GameObject:
  m_ObjectHideFlags: 0
  m_CorrespondingSourceObject: {fileID: 0}
  m_PrefabInstance: {fileID: 0}
  m_PrefabAsset: {fileID: 0}
  serializedVersion: 6
  m_Component:
  - component: {fileID: 4059183515433976520}
  - component: {fileID: 5038002259126068172}
  - component: {fileID: 1393263619226509307}
  - component: {fileID: 2225768182269661191}
  m_Layer: 2
  m_Name: Head
  m_TagString: Untagged
  m_Icon: {fileID: 0}
  m_NavMeshLayer: 0
  m_StaticEditorFlags: 0
  m_IsActive: 1
--- !u!4 &4059183515433976520
Transform:
  m_ObjectHideFlags: 0
  m_CorrespondingSourceObject: {fileID: 0}
  m_PrefabInstance: {fileID: 0}
  m_PrefabAsset: {fileID: 0}
  m_GameObject: {fileID: 2989326492025230220}
  m_LocalRotation: {x: -0.7071068, y: 0, z: -0, w: 0.7071067}
  m_LocalPosition: {x: -0, y: 1.7, z: 0}
  m_LocalScale: {x: 1, y: 1, z: 1}
  m_ConstrainProportionsScale: 0
  m_Children: []
  m_Father: {fileID: 5950070210003632203}
  m_RootOrder: 0
  m_LocalEulerAnglesHint: {x: 0, y: 0, z: 0}
--- !u!33 &5038002259126068172
MeshFilter:
  m_ObjectHideFlags: 0
  m_CorrespondingSourceObject: {fileID: 0}
  m_PrefabInstance: {fileID: 0}
  m_PrefabAsset: {fileID: 0}
  m_GameObject: {fileID: 2989326492025230220}
  m_Mesh: {fileID: -8839368762345780380, guid: 53122722bfc830744aa2b1717c4403a9, type: 3}
--- !u!23 &1393263619226509307
MeshRenderer:
  m_ObjectHideFlags: 0
  m_CorrespondingSourceObject: {fileID: 0}
  m_PrefabInstance: {fileID: 0}
  m_PrefabAsset: {fileID: 0}
  m_GameObject: {fileID: 2989326492025230220}
  m_Enabled: 1
  m_CastShadows: 1
  m_ReceiveShadows: 1
  m_DynamicOccludee: 1
  m_StaticShadowCaster: 0
  m_MotionVectors: 1
  m_LightProbeUsage: 1
  m_ReflectionProbeUsage: 1
  m_RayTracingMode: 2
  m_RayTraceProcedural: 0
  m_RenderingLayerMask: 1
  m_RendererPriority: 0
  m_Materials:
  - {fileID: 2100000, guid: 1f503b5dcc3049f47af65fbfa0800a78, type: 2}
  m_StaticBatchInfo:
    firstSubMesh: 0
    subMeshCount: 0
  m_StaticBatchRoot: {fileID: 0}
  m_ProbeAnchor: {fileID: 0}
  m_LightProbeVolumeOverride: {fileID: 0}
  m_ScaleInLightmap: 1
  m_ReceiveGI: 1
  m_PreserveUVs: 0
  m_IgnoreNormalsForChartDetection: 0
  m_ImportantGI: 0
  m_StitchLightmapSeams: 1
  m_SelectedEditorRenderState: 3
  m_MinimumChartSize: 4
  m_AutoUVMaxDistance: 0.5
  m_AutoUVMaxAngle: 89
  m_LightmapParameters: {fileID: 0}
  m_SortingLayerID: 0
  m_SortingLayer: 0
  m_SortingOrder: 0
  m_AdditionalVertexStreams: {fileID: 0}
--- !u!114 &2225768182269661191
MonoBehaviour:
  m_ObjectHideFlags: 0
  m_CorrespondingSourceObject: {fileID: 0}
  m_PrefabInstance: {fileID: 0}
  m_PrefabAsset: {fileID: 0}
  m_GameObject: {fileID: 2989326492025230220}
  m_Enabled: 1
  m_EditorHideFlags: 0
  m_Script: {fileID: 11500000, guid: 894d40bc8f6190849b61bf814e0781d3, type: 3}
  m_Name: 
  m_EditorClassIdentifier: 
  RotationOffset: {x: -0.70710677, y: 0, z: 0, w: 0.70710677}
  PositionOffset: {x: 0, y: -0.125, z: 0}
--- !u!1 &4577590731010377410
GameObject:
  m_ObjectHideFlags: 0
  m_CorrespondingSourceObject: {fileID: 0}
  m_PrefabInstance: {fileID: 0}
  m_PrefabAsset: {fileID: 0}
  serializedVersion: 6
  m_Component:
  - component: {fileID: 5425750904615919227}
  - component: {fileID: 5956921167739124805}
  - component: {fileID: 5990771076698188056}
  - component: {fileID: 1357179976377392458}
  - component: {fileID: 6046183915081542068}
  - component: {fileID: 3184397568665997811}
  m_Layer: 2
  m_Name: RightHand
  m_TagString: Untagged
  m_Icon: {fileID: 0}
  m_NavMeshLayer: 0
  m_StaticEditorFlags: 0
  m_IsActive: 1
--- !u!4 &5425750904615919227
Transform:
  m_ObjectHideFlags: 0
  m_CorrespondingSourceObject: {fileID: 0}
  m_PrefabInstance: {fileID: 0}
  m_PrefabAsset: {fileID: 0}
  m_GameObject: {fileID: 4577590731010377410}
  m_LocalRotation: {x: -0.7071068, y: -0, z: -0, w: 0.7071067}
  m_LocalPosition: {x: 0, y: 1.7, z: 0}
  m_LocalScale: {x: 1, y: 1, z: 1}
  m_ConstrainProportionsScale: 0
  m_Children: []
  m_Father: {fileID: 5950070210003632203}
  m_RootOrder: 3
  m_LocalEulerAnglesHint: {x: 0, y: 0, z: 0}
--- !u!33 &5956921167739124805
MeshFilter:
  m_ObjectHideFlags: 0
  m_CorrespondingSourceObject: {fileID: 0}
  m_PrefabInstance: {fileID: 0}
  m_PrefabAsset: {fileID: 0}
  m_GameObject: {fileID: 4577590731010377410}
  m_Mesh: {fileID: -4179581466302418777, guid: 53122722bfc830744aa2b1717c4403a9, type: 3}
--- !u!23 &5990771076698188056
MeshRenderer:
  m_ObjectHideFlags: 0
  m_CorrespondingSourceObject: {fileID: 0}
  m_PrefabInstance: {fileID: 0}
  m_PrefabAsset: {fileID: 0}
  m_GameObject: {fileID: 4577590731010377410}
  m_Enabled: 1
  m_CastShadows: 1
  m_ReceiveShadows: 1
  m_DynamicOccludee: 1
  m_StaticShadowCaster: 0
  m_MotionVectors: 1
  m_LightProbeUsage: 1
  m_ReflectionProbeUsage: 1
  m_RayTracingMode: 2
  m_RayTraceProcedural: 0
  m_RenderingLayerMask: 1
  m_RendererPriority: 0
  m_Materials:
  - {fileID: 2100000, guid: 1f503b5dcc3049f47af65fbfa0800a78, type: 2}
  - {fileID: 2100000, guid: eb2cb51f63c47d04f8513186584eb54f, type: 2}
  m_StaticBatchInfo:
    firstSubMesh: 0
    subMeshCount: 0
  m_StaticBatchRoot: {fileID: 0}
  m_ProbeAnchor: {fileID: 0}
  m_LightProbeVolumeOverride: {fileID: 0}
  m_ScaleInLightmap: 1
  m_ReceiveGI: 1
  m_PreserveUVs: 0
  m_IgnoreNormalsForChartDetection: 0
  m_ImportantGI: 0
  m_StitchLightmapSeams: 1
  m_SelectedEditorRenderState: 3
  m_MinimumChartSize: 4
  m_AutoUVMaxDistance: 0.5
  m_AutoUVMaxAngle: 89
  m_LightmapParameters: {fileID: 0}
  m_SortingLayerID: 0
  m_SortingLayer: 0
  m_SortingOrder: 0
  m_AdditionalVertexStreams: {fileID: 0}
--- !u!114 &1357179976377392458
MonoBehaviour:
  m_ObjectHideFlags: 0
  m_CorrespondingSourceObject: {fileID: 0}
  m_PrefabInstance: {fileID: 0}
  m_PrefabAsset: {fileID: 0}
  m_GameObject: {fileID: 4577590731010377410}
  m_Enabled: 1
  m_EditorHideFlags: 0
  m_Script: {fileID: 11500000, guid: 894d40bc8f6190849b61bf814e0781d3, type: 3}
  m_Name: 
  m_EditorClassIdentifier: 
  RotationOffset: {x: 0.70710677, y: -0.00000003090862, z: 0.70710677, w: -0.00000003090862}
  PositionOffset: {x: 0, y: 0, z: 0}
--- !u!135 &6046183915081542068
SphereCollider:
  m_ObjectHideFlags: 0
  m_CorrespondingSourceObject: {fileID: 0}
  m_PrefabInstance: {fileID: 0}
  m_PrefabAsset: {fileID: 0}
  m_GameObject: {fileID: 4577590731010377410}
  m_Material: {fileID: 0}
  m_IsTrigger: 1
  m_Enabled: 1
  serializedVersion: 2
  m_Radius: 0.1
  m_Center: {x: -0.07892676, y: -0.019197932, z: -0.015781393}
--- !u!114 &3184397568665997811
MonoBehaviour:
  m_ObjectHideFlags: 0
  m_CorrespondingSourceObject: {fileID: 0}
  m_PrefabInstance: {fileID: 0}
  m_PrefabAsset: {fileID: 0}
  m_GameObject: {fileID: 4577590731010377410}
  m_Enabled: 1
  m_EditorHideFlags: 0
  m_Script: {fileID: 11500000, guid: f4b4d4862bca40f087d7054f128b2f8d, type: 3}
  m_Name: 
  m_EditorClassIdentifier: 
--- !u!1 &6474265280155933425
GameObject:
  m_ObjectHideFlags: 0
  m_CorrespondingSourceObject: {fileID: 0}
  m_PrefabInstance: {fileID: 0}
  m_PrefabAsset: {fileID: 0}
  serializedVersion: 6
  m_Component:
  - component: {fileID: 5950070210003632203}
  - component: {fileID: 7795551144158044188}
  - component: {fileID: 2822595259016746041}
  - component: {fileID: 4006249158582513331}
  - component: {fileID: 8839896854183285726}
  - component: {fileID: 2419900373640356349}
  - component: {fileID: 6642982558310532708}
  - component: {fileID: 3186991782894522023}
  - component: {fileID: 4169101970918342921}
  - component: {fileID: 3648248907280197463}
  m_Layer: 2
  m_Name: NetworkAvatar
  m_TagString: Untagged
  m_Icon: {fileID: 0}
  m_NavMeshLayer: 0
  m_StaticEditorFlags: 0
  m_IsActive: 1
--- !u!4 &5950070210003632203
Transform:
  m_ObjectHideFlags: 0
  m_CorrespondingSourceObject: {fileID: 0}
  m_PrefabInstance: {fileID: 0}
  m_PrefabAsset: {fileID: 0}
  m_GameObject: {fileID: 6474265280155933425}
  m_LocalRotation: {x: 0, y: 0, z: 0, w: 1}
  m_LocalPosition: {x: 0, y: 0, z: 0}
  m_LocalScale: {x: 1, y: 1, z: 1}
  m_ConstrainProportionsScale: 0
  m_Children:
  - {fileID: 4059183515433976520}
  - {fileID: 7840058764765195674}
  - {fileID: 373818716021896514}
  - {fileID: 5425750904615919227}
  m_Father: {fileID: 0}
  m_RootOrder: 0
  m_LocalEulerAnglesHint: {x: 0, y: 0, z: 0}
--- !u!114 &7795551144158044188
MonoBehaviour:
  m_ObjectHideFlags: 0
  m_CorrespondingSourceObject: {fileID: 0}
  m_PrefabInstance: {fileID: 0}
  m_PrefabAsset: {fileID: 0}
  m_GameObject: {fileID: 6474265280155933425}
  m_Enabled: 1
  m_EditorHideFlags: 0
  m_Script: {fileID: 11500000, guid: b079a3bc564e4cc40a8be68c82bb6604, type: 3}
  m_Name: 
  m_EditorClassIdentifier: 
  PlatformMode:
    m_InternalValue: 0
  HeadPosition:
    m_InternalValue: {x: 0, y: 0, z: 0}
  HeadRotation:
    m_InternalValue: {x: 0, y: 0, z: 0, w: 0}
  LeftHandPosition:
    m_InternalValue: {x: 0, y: 0, z: 0}
  LeftHandRotation:
    m_InternalValue: {x: 0, y: 0, z: 0, w: 0}
  RightHandPosition:
    m_InternalValue: {x: 0, y: 0, z: 0}
  RightHandRotation:
    m_InternalValue: {x: 0, y: 0, z: 0, w: 0}
  RigPosition:
    m_InternalValue: {x: 0, y: 0, z: 0}
  RigRotation:
    m_InternalValue: {x: 0, y: 0, z: 0, w: 0}
  HandColliderRadius:
    m_InternalValue: 0
  Head: {fileID: 2225768182269661191}
  Body: {fileID: 1606266406833650716}
  LeftHand: {fileID: 4779038341357509831}
  RightHand: {fileID: 1357179976377392458}
  Rig: {fileID: 4006249158582513331}
--- !u!114 &2822595259016746041
MonoBehaviour:
  m_ObjectHideFlags: 0
  m_CorrespondingSourceObject: {fileID: 0}
  m_PrefabInstance: {fileID: 0}
  m_PrefabAsset: {fileID: 0}
  m_GameObject: {fileID: 6474265280155933425}
  m_Enabled: 1
  m_EditorHideFlags: 0
  m_Script: {fileID: 11500000, guid: d5a57f767e5e46a458fc5d3c628d0cbb, type: 3}
  m_Name: 
  m_EditorClassIdentifier: 
  GlobalObjectIdHash: 951099334
  AlwaysReplicateAsRoot: 0
  DontDestroyWithOwner: 0
  AutoObjectParentSync: 1
--- !u!114 &4006249158582513331
MonoBehaviour:
  m_ObjectHideFlags: 0
  m_CorrespondingSourceObject: {fileID: 0}
  m_PrefabInstance: {fileID: 0}
  m_PrefabAsset: {fileID: 0}
  m_GameObject: {fileID: 6474265280155933425}
  m_Enabled: 1
  m_EditorHideFlags: 0
  m_Script: {fileID: 11500000, guid: 894d40bc8f6190849b61bf814e0781d3, type: 3}
  m_Name: 
  m_EditorClassIdentifier: 
  RotationOffset: {x: 0, y: 0, z: 0, w: 0}
  PositionOffset: {x: 0, y: 0, z: 0}
--- !u!114 &8839896854183285726
MonoBehaviour:
  m_ObjectHideFlags: 0
  m_CorrespondingSourceObject: {fileID: 0}
  m_PrefabInstance: {fileID: 0}
  m_PrefabAsset: {fileID: 0}
  m_GameObject: {fileID: 6474265280155933425}
  m_Enabled: 1
  m_EditorHideFlags: 0
  m_Script: {fileID: 11500000, guid: c04621832404465f859775d8528a8f12, type: 3}
  m_Name: 
  m_EditorClassIdentifier: 
  Nickname: 
  LeftHand: {fileID: 2663824396696379256}
  RightHand: {fileID: 3184397568665997811}
--- !u!114 &2419900373640356349
MonoBehaviour:
  m_ObjectHideFlags: 0
  m_CorrespondingSourceObject: {fileID: 0}
  m_PrefabInstance: {fileID: 0}
  m_PrefabAsset: {fileID: 0}
  m_GameObject: {fileID: 6474265280155933425}
  m_Enabled: 1
  m_EditorHideFlags: 0
  m_Script: {fileID: 11500000, guid: b220ea0c852a049499171b51c58596c1, type: 3}
  m_Name: 
  m_EditorClassIdentifier: 
  ConfigBlockly: 
  ConfigAssetBundle: 
  Icon: {fileID: 0}
  Name: NetworkPlayer
  DisplayNames:
    LocalizationStrings:
    - key: 10
      value: Network Player
    - key: 30
      value: "\u0421\u0435\u0442\u0435\u0432\u043E\u0439 \u0438\u0433\u0440\u043E\u043A"
    - key: 6
      value: "\u7DB2\u8DEF\u64AD\u653E\u5668"
    - key: 23
      value: "\uB124\uD2B8\uC6CC\uD06C \uD50C\uB808\uC774\uC5B4"
    IsValidDictionary: 1
  Description:
    LocalizationStrings:
    - key: 10
      value: Network Player description
    - key: 30
      value: "\u0421\u0435\u0442\u0435\u0432\u043E\u0439 \u0438\u0433\u0440\u043E\u043A
        \u043E\u043F\u0438\u0441\u0430\u043D\u0438\u0435"
    - key: 6
      value: "\u7DB2\u8DEF\u64AD\u653E\u5668\u63CF\u8FF0"
    - key: 23
      value: "\uB124\uD2B8\uC6CC\uD06C \uD50C\uB808\uC774\uC5B4 \uC124\uBA85"
    IsValidDictionary: 1
  AssetBundleParts: []
  Prefab: Assets/Varwin/Core/Multiplayer/Prefabs/NetworkAvatar.prefab
  PrefabGuid: 
  Guid: 451085a2-1d75-473c-be31-b220fefd5c58
  RootGuid: 451085a2-1d75-473c-be31-b220fefd5c58
  Locked: 0
  Embedded: 0
  SourcesIncluded: 0
  MobileReady: 0
  DisableSceneLogic: 0
  AddBehavioursAtRuntime: 0
  AuthorName: Varwin
  AuthorEmail: dev@varwin.com
  AuthorUrl: varwin.com
  LicenseCode: cc-by
  LicenseVersion: 4.0
  BuiltAt: 
  AssemblySuffix: 
  CurrentVersionWasBuilt: 0
  CurrentVersionWasBuiltAsMobileReady: 0
  Changelog: 
  Components:
    ComponentReferences:
    - Name: Avatar_0
      Component: {fileID: 7795551144158044188}
    - Name: NetworkObject_0
      Component: {fileID: 2822595259016746041}
    - Name: TransformPose_0
      Component: {fileID: 4006249158582513331}
    - Name: NetworkPlayer_0
      Component: {fileID: 8839896854183285726}
    - Name: TransformPose_1
      Component: {fileID: 1606266406833650716}
    - Name: TransformPose_2
      Component: {fileID: 2225768182269661191}
    - Name: TransformPose_3
      Component: {fileID: 4779038341357509831}
    - Name: TransformPose_4
      Component: {fileID: 1357179976377392458}
    - Name: NetworkPlayerController_0
      Component: {fileID: 3186991782894522023}
    - Name: AvatarColliderControler_0
      Component: {fileID: 3648248907280197463}
    - Name: HandCollider_0
      Component: {fileID: 2663824396696379256}
    - Name: HandCollider_1
      Component: {fileID: 3184397568665997811}
  Signatures:
    PropertySignatures: []
    MethodSignatures: []
    EventSignatures: []
    GroupSignatures: []
    UseValueListSignatures: []
--- !u!54 &6642982558310532708
Rigidbody:
  m_ObjectHideFlags: 0
  m_CorrespondingSourceObject: {fileID: 0}
  m_PrefabInstance: {fileID: 0}
  m_PrefabAsset: {fileID: 0}
  m_GameObject: {fileID: 6474265280155933425}
  serializedVersion: 2
  m_Mass: 1
  m_Drag: 0
  m_AngularDrag: 0.05
  m_UseGravity: 1
  m_IsKinematic: 1
  m_Interpolate: 0
  m_Constraints: 0
  m_CollisionDetection: 0
--- !u!114 &3186991782894522023
MonoBehaviour:
  m_ObjectHideFlags: 0
  m_CorrespondingSourceObject: {fileID: 0}
  m_PrefabInstance: {fileID: 0}
  m_PrefabAsset: {fileID: 0}
  m_GameObject: {fileID: 6474265280155933425}
  m_Enabled: 1
  m_EditorHideFlags: 0
  m_Script: {fileID: 11500000, guid: 35460aa0e90e4abebf8baeb49c4673d2, type: 3}
  m_Name: 
  m_EditorClassIdentifier: 
  Avatar: {fileID: 7795551144158044188}
--- !u!136 &4169101970918342921
CapsuleCollider:
  m_ObjectHideFlags: 0
  m_CorrespondingSourceObject: {fileID: 0}
  m_PrefabInstance: {fileID: 0}
  m_PrefabAsset: {fileID: 0}
  m_GameObject: {fileID: 6474265280155933425}
  m_Material: {fileID: 0}
  m_IsTrigger: 1
  m_Enabled: 1
  m_Radius: 0.25
  m_Height: 1.7
  m_Direction: 1
  m_Center: {x: 0, y: 0.85, z: 0}
--- !u!114 &3648248907280197463
MonoBehaviour:
  m_ObjectHideFlags: 0
  m_CorrespondingSourceObject: {fileID: 0}
  m_PrefabInstance: {fileID: 0}
  m_PrefabAsset: {fileID: 0}
  m_GameObject: {fileID: 6474265280155933425}
  m_Enabled: 1
  m_EditorHideFlags: 0
  m_Script: {fileID: 11500000, guid: d780793cc8574584db3c0a78014232e6, type: 3}
  m_Name: 
  m_EditorClassIdentifier: 
  _avatar: {fileID: 7795551144158044188}
--- !u!1 &6758134008553440200
GameObject:
  m_ObjectHideFlags: 0
  m_CorrespondingSourceObject: {fileID: 0}
  m_PrefabInstance: {fileID: 0}
  m_PrefabAsset: {fileID: 0}
  serializedVersion: 6
  m_Component:
  - component: {fileID: 7840058764765195674}
  - component: {fileID: 424614094128351298}
  - component: {fileID: 8553630148625961094}
  - component: {fileID: 1606266406833650716}
  m_Layer: 2
  m_Name: Body
  m_TagString: Untagged
  m_Icon: {fileID: 0}
  m_NavMeshLayer: 0
  m_StaticEditorFlags: 0
  m_IsActive: 1
--- !u!4 &7840058764765195674
Transform:
  m_ObjectHideFlags: 0
  m_CorrespondingSourceObject: {fileID: 0}
  m_PrefabInstance: {fileID: 0}
  m_PrefabAsset: {fileID: 0}
  m_GameObject: {fileID: 6758134008553440200}
  m_LocalRotation: {x: -0.7071068, y: -0, z: -0, w: 0.7071067}
  m_LocalPosition: {x: 0, y: 1.7, z: 0}
  m_LocalScale: {x: 1, y: 1, z: 1}
  m_ConstrainProportionsScale: 0
  m_Children: []
  m_Father: {fileID: 5950070210003632203}
  m_RootOrder: 1
  m_LocalEulerAnglesHint: {x: 0, y: 0, z: 0}
--- !u!33 &424614094128351298
MeshFilter:
  m_ObjectHideFlags: 0
  m_CorrespondingSourceObject: {fileID: 0}
  m_PrefabInstance: {fileID: 0}
  m_PrefabAsset: {fileID: 0}
  m_GameObject: {fileID: 6758134008553440200}
  m_Mesh: {fileID: 2959467708922500008, guid: 53122722bfc830744aa2b1717c4403a9, type: 3}
--- !u!23 &8553630148625961094
MeshRenderer:
  m_ObjectHideFlags: 0
  m_CorrespondingSourceObject: {fileID: 0}
  m_PrefabInstance: {fileID: 0}
  m_PrefabAsset: {fileID: 0}
  m_GameObject: {fileID: 6758134008553440200}
  m_Enabled: 1
  m_CastShadows: 1
  m_ReceiveShadows: 1
  m_DynamicOccludee: 1
  m_StaticShadowCaster: 0
  m_MotionVectors: 1
  m_LightProbeUsage: 1
  m_ReflectionProbeUsage: 1
  m_RayTracingMode: 2
  m_RayTraceProcedural: 0
  m_RenderingLayerMask: 1
  m_RendererPriority: 0
  m_Materials:
  - {fileID: 2100000, guid: eb2cb51f63c47d04f8513186584eb54f, type: 2}
  - {fileID: 2100000, guid: 1f503b5dcc3049f47af65fbfa0800a78, type: 2}
  m_StaticBatchInfo:
    firstSubMesh: 0
    subMeshCount: 0
  m_StaticBatchRoot: {fileID: 0}
  m_ProbeAnchor: {fileID: 0}
  m_LightProbeVolumeOverride: {fileID: 0}
  m_ScaleInLightmap: 1
  m_ReceiveGI: 1
  m_PreserveUVs: 0
  m_IgnoreNormalsForChartDetection: 0
  m_ImportantGI: 0
  m_StitchLightmapSeams: 1
  m_SelectedEditorRenderState: 3
  m_MinimumChartSize: 4
  m_AutoUVMaxDistance: 0.5
  m_AutoUVMaxAngle: 89
  m_LightmapParameters: {fileID: 0}
  m_SortingLayerID: 0
  m_SortingLayer: 0
  m_SortingOrder: 0
  m_AdditionalVertexStreams: {fileID: 0}
--- !u!114 &1606266406833650716
MonoBehaviour:
  m_ObjectHideFlags: 0
  m_CorrespondingSourceObject: {fileID: 0}
  m_PrefabInstance: {fileID: 0}
  m_PrefabAsset: {fileID: 0}
  m_GameObject: {fileID: 6758134008553440200}
  m_Enabled: 1
  m_EditorHideFlags: 0
  m_Script: {fileID: 11500000, guid: 894d40bc8f6190849b61bf814e0781d3, type: 3}
  m_Name: 
  m_EditorClassIdentifier: 
  RotationOffset: {x: -0.70710677, y: 0, z: 0, w: 0.70710677}
  PositionOffset: {x: 0, y: -0.125, z: 0}
