%YAML 1.1
%TAG !u! tag:unity3d.com,2011:
--- !u!1 &20781562896262700
GameObject:
  m_ObjectHideFlags: 0
  m_CorrespondingSourceObject: {fileID: 0}
  m_PrefabInstance: {fileID: 0}
  m_PrefabAsset: {fileID: 0}
  serializedVersion: 6
  m_Component:
  - component: {fileID: 499604604236418392}
  - component: {fileID: 6704636643009528906}
  - component: {fileID: 249265217291899528}
  m_Layer: 0
  m_Name: Tooltip
  m_TagString: Untagged
  m_Icon: {fileID: 0}
  m_NavMeshLayer: 0
  m_StaticEditorFlags: 0
  m_IsActive: 1
--- !u!4 &499604604236418392
Transform:
  m_ObjectHideFlags: 0
  m_CorrespondingSourceObject: {fileID: 0}
  m_PrefabInstance: {fileID: 0}
  m_PrefabAsset: {fileID: 0}
  m_GameObject: {fileID: 20781562896262700}
  m_LocalRotation: {x: 0, y: 0, z: 0, w: 1}
  m_LocalPosition: {x: 0.00089183846, y: -0.000012731354, z: 0.000038965314}
  m_LocalScale: {x: 1, y: 1, z: 1}
  m_ConstrainProportionsScale: 0
  m_Children: []
  m_Father: {fileID: 2025400659021385419}
  m_RootOrder: 0
  m_LocalEulerAnglesHint: {x: 0, y: 0, z: 0}
--- !u!114 &6704636643009528906
MonoBehaviour:
  m_ObjectHideFlags: 0
  m_CorrespondingSourceObject: {fileID: 0}
  m_PrefabInstance: {fileID: 0}
  m_PrefabAsset: {fileID: 0}
  m_GameObject: {fileID: 20781562896262700}
  m_Enabled: 1
  m_EditorHideFlags: 0
  m_Script: {fileID: 11500000, guid: b46c4909cebc470fbcfc052ab0ba2827, type: 3}
  m_Name: 
  m_EditorClassIdentifier: 
  Type: 7
--- !u!114 &249265217291899528
MonoBehaviour:
  m_ObjectHideFlags: 0
  m_CorrespondingSourceObject: {fileID: 0}
  m_PrefabInstance: {fileID: 0}
  m_PrefabAsset: {fileID: 0}
  m_GameObject: {fileID: 20781562896262700}
  m_Enabled: 1
  m_EditorHideFlags: 0
  m_Script: {fileID: 11500000, guid: b46c4909cebc470fbcfc052ab0ba2827, type: 3}
  m_Name: 
  m_EditorClassIdentifier: 
  Type: 9
--- !u!1 &487742304353978422
GameObject:
  m_ObjectHideFlags: 0
  m_CorrespondingSourceObject: {fileID: 0}
  m_PrefabInstance: {fileID: 0}
  m_PrefabAsset: {fileID: 0}
  serializedVersion: 6
  m_Component:
  - component: {fileID: 3809158292584384623}
  - component: {fileID: 3073120352086783351}
  m_Layer: 0
  m_Name: Tooltip
  m_TagString: Untagged
  m_Icon: {fileID: 0}
  m_NavMeshLayer: 0
  m_StaticEditorFlags: 0
  m_IsActive: 1
--- !u!4 &3809158292584384623
Transform:
  m_ObjectHideFlags: 0
  m_CorrespondingSourceObject: {fileID: 0}
  m_PrefabInstance: {fileID: 0}
  m_PrefabAsset: {fileID: 0}
  m_GameObject: {fileID: 487742304353978422}
  m_LocalRotation: {x: 0, y: 0, z: 0, w: 1}
  m_LocalPosition: {x: 0.0015877872, y: 0.0000000044237822, z: 0.000000014551915}
  m_LocalScale: {x: 1, y: 1, z: 1}
  m_ConstrainProportionsScale: 0
  m_Children: []
  m_Father: {fileID: 3882322231326998551}
  m_RootOrder: 0
  m_LocalEulerAnglesHint: {x: 0, y: 0, z: 0}
--- !u!114 &3073120352086783351
MonoBehaviour:
  m_ObjectHideFlags: 0
  m_CorrespondingSourceObject: {fileID: 0}
  m_PrefabInstance: {fileID: 0}
  m_PrefabAsset: {fileID: 0}
  m_GameObject: {fileID: 487742304353978422}
  m_Enabled: 1
  m_EditorHideFlags: 0
  m_Script: {fileID: 11500000, guid: b46c4909cebc470fbcfc052ab0ba2827, type: 3}
  m_Name: 
  m_EditorClassIdentifier: 
  Type: 6
--- !u!1 &843422170785773120
GameObject:
  m_ObjectHideFlags: 0
  m_CorrespondingSourceObject: {fileID: 0}
  m_PrefabInstance: {fileID: 0}
  m_PrefabAsset: {fileID: 0}
  serializedVersion: 6
  m_Component:
  - component: {fileID: 7626535917056466474}
  - component: {fileID: 4795145129201288433}
  m_Layer: 0
  m_Name: Tooltip
  m_TagString: Untagged
  m_Icon: {fileID: 0}
  m_NavMeshLayer: 0
  m_StaticEditorFlags: 0
  m_IsActive: 1
--- !u!4 &7626535917056466474
Transform:
  m_ObjectHideFlags: 0
  m_CorrespondingSourceObject: {fileID: 0}
  m_PrefabInstance: {fileID: 0}
  m_PrefabAsset: {fileID: 0}
  m_GameObject: {fileID: 843422170785773120}
  m_LocalRotation: {x: 0, y: 0, z: 0, w: 1}
  m_LocalPosition: {x: 0.0015877894, y: -0.0000000013969839, z: 0.000000007625204}
  m_LocalScale: {x: 1, y: 1, z: 1}
  m_ConstrainProportionsScale: 0
  m_Children: []
  m_Father: {fileID: 1929719125406557633}
  m_RootOrder: 0
  m_LocalEulerAnglesHint: {x: 0, y: 0, z: 0}
--- !u!114 &4795145129201288433
MonoBehaviour:
  m_ObjectHideFlags: 0
  m_CorrespondingSourceObject: {fileID: 0}
  m_PrefabInstance: {fileID: 0}
  m_PrefabAsset: {fileID: 0}
  m_GameObject: {fileID: 843422170785773120}
  m_Enabled: 1
  m_EditorHideFlags: 0
  m_Script: {fileID: 11500000, guid: b46c4909cebc470fbcfc052ab0ba2827, type: 3}
  m_Name: 
  m_EditorClassIdentifier: 
  Type: 5
--- !u!1 &1141143830287675823
GameObject:
  m_ObjectHideFlags: 0
  m_CorrespondingSourceObject: {fileID: 0}
  m_PrefabInstance: {fileID: 0}
  m_PrefabAsset: {fileID: 0}
  serializedVersion: 6
  m_Component:
  - component: {fileID: 1141143830287675808}
  m_Layer: 0
  m_Name: PointerAnchor
  m_TagString: Untagged
  m_Icon: {fileID: 0}
  m_NavMeshLayer: 0
  m_StaticEditorFlags: 0
  m_IsActive: 1
--- !u!4 &1141143830287675808
Transform:
  m_ObjectHideFlags: 0
  m_CorrespondingSourceObject: {fileID: 0}
  m_PrefabInstance: {fileID: 0}
  m_PrefabAsset: {fileID: 0}
  m_GameObject: {fileID: 1141143830287675823}
  m_LocalRotation: {x: 0, y: 0, z: 0, w: 1}
  m_LocalPosition: {x: 0, y: -0.023, z: -0.027}
  m_LocalScale: {x: 1, y: 1, z: 1}
  m_ConstrainProportionsScale: 0
  m_Children: []
  m_Father: {fileID: 1141143830523417262}
  m_RootOrder: 1
  m_LocalEulerAnglesHint: {x: 0, y: 0, z: 0}
--- !u!1 &1141143830523417259
GameObject:
  m_ObjectHideFlags: 0
  m_CorrespondingSourceObject: {fileID: 0}
  m_PrefabInstance: {fileID: 0}
  m_PrefabAsset: {fileID: 0}
  serializedVersion: 6
  m_Component:
  - component: {fileID: 1141143830523417262}
  - component: {fileID: 1141143830523417261}
  - component: {fileID: 1141143830523417260}
  m_Layer: 0
  m_Name: OculusQuest1ControllerLeft
  m_TagString: Untagged
  m_Icon: {fileID: 0}
  m_NavMeshLayer: 0
  m_StaticEditorFlags: 0
  m_IsActive: 1
--- !u!4 &1141143830523417262
Transform:
  m_ObjectHideFlags: 0
  m_CorrespondingSourceObject: {fileID: 0}
  m_PrefabInstance: {fileID: 0}
  m_PrefabAsset: {fileID: 0}
  m_GameObject: {fileID: 1141143830523417259}
  m_LocalRotation: {x: 0, y: 0, z: 0, w: 1}
  m_LocalPosition: {x: 0.13657448, y: 0.205, z: -0.6942304}
  m_LocalScale: {x: 1, y: 1, z: 1}
  m_ConstrainProportionsScale: 0
  m_Children:
  - {fileID: 602516126517506788}
  - {fileID: 1141143830287675808}
  - {fileID: 8490990081539287137}
  - {fileID: 6429920287054853621}
  - {fileID: 8831883378006518432}
  m_Father: {fileID: 0}
  m_RootOrder: 0
  m_LocalEulerAnglesHint: {x: 0, y: 0, z: 0}
--- !u!114 &1141143830523417261
MonoBehaviour:
  m_ObjectHideFlags: 0
  m_CorrespondingSourceObject: {fileID: 0}
  m_PrefabInstance: {fileID: 0}
  m_PrefabAsset: {fileID: 0}
  m_GameObject: {fileID: 1141143830523417259}
  m_Enabled: 1
  m_EditorHideFlags: 0
  m_Script: {fileID: 11500000, guid: 926d2692cbf74cefb9bde63d562cf607, type: 3}
  m_Name: 
  m_EditorClassIdentifier: 
  InputDeviceHandler: {fileID: 6826539960959035550}
  CustomPointerAnchor: {fileID: 1141143830287675808}
  PlatformOffsetInfos:
  - Name: Varwin OpenXR Display
    AngleOffset: {x: 0, y: 180, z: 0}
    Anchor: {fileID: 8490990081539287137}
    IsDesktopOnly: 0
  - Name: oculus display
    AngleOffset: {x: 0, y: 0, z: 0}
    Anchor: {fileID: 6429920287054853621}
    IsDesktopOnly: 0
  _controlTooltipHandlers:
  - {fileID: 2567585693705755844}
  - {fileID: 6704636643009528906}
  - {fileID: 249265217291899528}
  - {fileID: 4945540889816544597}
  - {fileID: 8705046176773933258}
  - {fileID: 4795145129201288433}
  - {fileID: 3073120352086783351}
  - {fileID: 9168838259870527612}
  - {fileID: 5694706224135497901}
  TeleportOnThumbstick: 1
  Is3Dof: 0
  GrabAnchor: {fileID: 8135199490632425889}
--- !u!114 &1141143830523417260
MonoBehaviour:
  m_ObjectHideFlags: 0
  m_CorrespondingSourceObject: {fileID: 0}
  m_PrefabInstance: {fileID: 0}
  m_PrefabAsset: {fileID: 0}
  m_GameObject: {fileID: 1141143830523417259}
  m_Enabled: 1
  m_EditorHideFlags: 0
  m_Script: {fileID: 11500000, guid: e92dc823f4034a4dabdef690e2c1a7c0, type: 3}
  m_Name: 
  m_EditorClassIdentifier: 
  Animator: {fileID: 6826539960959035550}
  Indicators:
  - {fileID: 1141143832171664665}
  - {fileID: 1141143831733364036}
  - {fileID: 1141143832171664664}
  - {fileID: 1141143832171664647}
  TimeSwitching: 0.05
--- !u!1 &5252149254752641576
GameObject:
  m_ObjectHideFlags: 0
  m_CorrespondingSourceObject: {fileID: 0}
  m_PrefabInstance: {fileID: 0}
  m_PrefabAsset: {fileID: 0}
  serializedVersion: 6
  m_Component:
  - component: {fileID: 695878283593613715}
  - component: {fileID: 9168838259870527612}
  m_Layer: 0
  m_Name: Tooltip
  m_TagString: Untagged
  m_Icon: {fileID: 0}
  m_NavMeshLayer: 0
  m_StaticEditorFlags: 0
  m_IsActive: 1
--- !u!4 &695878283593613715
Transform:
  m_ObjectHideFlags: 0
  m_CorrespondingSourceObject: {fileID: 0}
  m_PrefabInstance: {fileID: 0}
  m_PrefabAsset: {fileID: 0}
  m_GameObject: {fileID: 5252149254752641576}
  m_LocalRotation: {x: 0, y: 0, z: 0, w: 1}
  m_LocalPosition: {x: 0.0070494916, y: -0.000015004072, z: 0.0000062864274}
  m_LocalScale: {x: 1, y: 1, z: 1}
  m_ConstrainProportionsScale: 0
  m_Children: []
  m_Father: {fileID: 1533356273513676125}
  m_RootOrder: 0
  m_LocalEulerAnglesHint: {x: 0, y: 0, z: 0}
--- !u!114 &9168838259870527612
MonoBehaviour:
  m_ObjectHideFlags: 0
  m_CorrespondingSourceObject: {fileID: 0}
  m_PrefabInstance: {fileID: 0}
  m_PrefabAsset: {fileID: 0}
  m_GameObject: {fileID: 5252149254752641576}
  m_Enabled: 1
  m_EditorHideFlags: 0
  m_Script: {fileID: 11500000, guid: b46c4909cebc470fbcfc052ab0ba2827, type: 3}
  m_Name: 
  m_EditorClassIdentifier: 
  Type: 4
--- !u!1 &5870695085457631414
GameObject:
  m_ObjectHideFlags: 0
  m_CorrespondingSourceObject: {fileID: 0}
  m_PrefabInstance: {fileID: 0}
  m_PrefabAsset: {fileID: 0}
  serializedVersion: 6
  m_Component:
  - component: {fileID: 8964590449064514661}
  - component: {fileID: 5694706224135497901}
  m_Layer: 0
  m_Name: Tooltip
  m_TagString: Untagged
  m_Icon: {fileID: 0}
  m_NavMeshLayer: 0
  m_StaticEditorFlags: 0
  m_IsActive: 1
--- !u!4 &8964590449064514661
Transform:
  m_ObjectHideFlags: 0
  m_CorrespondingSourceObject: {fileID: 0}
  m_PrefabInstance: {fileID: 0}
  m_PrefabAsset: {fileID: 0}
  m_GameObject: {fileID: 5870695085457631414}
  m_LocalRotation: {x: 0, y: 0, z: 0, w: 1}
  m_LocalPosition: {x: 0.008874592, y: 0.007452289, z: 0.000000022351742}
  m_LocalScale: {x: 1, y: 1, z: 1}
  m_ConstrainProportionsScale: 0
  m_Children: []
  m_Father: {fileID: 4667420178501959269}
  m_RootOrder: 0
  m_LocalEulerAnglesHint: {x: 0, y: 0, z: 0}
--- !u!114 &5694706224135497901
MonoBehaviour:
  m_ObjectHideFlags: 0
  m_CorrespondingSourceObject: {fileID: 0}
  m_PrefabInstance: {fileID: 0}
  m_PrefabAsset: {fileID: 0}
  m_GameObject: {fileID: 5870695085457631414}
  m_Enabled: 1
  m_EditorHideFlags: 0
  m_Script: {fileID: 11500000, guid: b46c4909cebc470fbcfc052ab0ba2827, type: 3}
  m_Name: 
  m_EditorClassIdentifier: 
  Type: 1
--- !u!1 &8135199490632425889
GameObject:
  m_ObjectHideFlags: 0
  m_CorrespondingSourceObject: {fileID: 0}
  m_PrefabInstance: {fileID: 0}
  m_PrefabAsset: {fileID: 0}
  serializedVersion: 6
  m_Component:
  - component: {fileID: 8831883378006518432}
  m_Layer: 0
  m_Name: GrabAnchor
  m_TagString: Untagged
  m_Icon: {fileID: 0}
  m_NavMeshLayer: 0
  m_StaticEditorFlags: 0
  m_IsActive: 1
--- !u!4 &8831883378006518432
Transform:
  m_ObjectHideFlags: 0
  m_CorrespondingSourceObject: {fileID: 0}
  m_PrefabInstance: {fileID: 0}
  m_PrefabAsset: {fileID: 0}
  m_GameObject: {fileID: 8135199490632425889}
  m_LocalRotation: {x: 0, y: 0, z: 0, w: 1}
  m_LocalPosition: {x: 0, y: -0.0054, z: -0.1027}
  m_LocalScale: {x: 1, y: 1, z: 1}
  m_ConstrainProportionsScale: 0
  m_Children: []
  m_Father: {fileID: 1141143830523417262}
  m_RootOrder: 4
  m_LocalEulerAnglesHint: {x: 0, y: 0, z: 0}
--- !u!1 &8248046654895002107
GameObject:
  m_ObjectHideFlags: 0
  m_CorrespondingSourceObject: {fileID: 0}
  m_PrefabInstance: {fileID: 0}
  m_PrefabAsset: {fileID: 0}
  serializedVersion: 6
  m_Component:
  - component: {fileID: 8490990081539287137}
  m_Layer: 0
  m_Name: OpenXRAnchor
  m_TagString: Untagged
  m_Icon: {fileID: 0}
  m_NavMeshLayer: 0
  m_StaticEditorFlags: 0
  m_IsActive: 1
--- !u!4 &8490990081539287137
Transform:
  m_ObjectHideFlags: 0
  m_CorrespondingSourceObject: {fileID: 0}
  m_PrefabInstance: {fileID: 0}
  m_PrefabAsset: {fileID: 0}
  m_GameObject: {fileID: 8248046654895002107}
  m_LocalRotation: {x: -7.119407e-17, y: 0.98388505, z: 0.17880227, w: 4.9297106e-17}
  m_LocalPosition: {x: 0.008000001, y: -0.0018294156, z: -0.1019482}
  m_LocalScale: {x: 1, y: 1, z: 1}
  m_ConstrainProportionsScale: 0
  m_Children: []
  m_Father: {fileID: 1141143830523417262}
  m_RootOrder: 2
  m_LocalEulerAnglesHint: {x: 0, y: 0, z: 0}
--- !u!1 &8452452018309844599
GameObject:
  m_ObjectHideFlags: 0
  m_CorrespondingSourceObject: {fileID: 0}
  m_PrefabInstance: {fileID: 0}
  m_PrefabAsset: {fileID: 0}
  serializedVersion: 6
  m_Component:
  - component: {fileID: 6429920287054853621}
  m_Layer: 0
  m_Name: OculusAnchor
  m_TagString: Untagged
  m_Icon: {fileID: 0}
  m_NavMeshLayer: 0
  m_StaticEditorFlags: 0
  m_IsActive: 1
--- !u!4 &6429920287054853621
Transform:
  m_ObjectHideFlags: 0
  m_CorrespondingSourceObject: {fileID: 0}
  m_PrefabInstance: {fileID: 0}
  m_PrefabAsset: {fileID: 0}
  m_GameObject: {fileID: 8452452018309844599}
  m_LocalRotation: {x: -0.3420201, y: 0, z: 0, w: 0.9396927}
  m_LocalPosition: {x: -0.00575, y: 0.005, z: 0.055}
  m_LocalScale: {x: 1, y: 1, z: 1}
  m_ConstrainProportionsScale: 0
  m_Children: []
  m_Father: {fileID: 1141143830523417262}
  m_RootOrder: 3
  m_LocalEulerAnglesHint: {x: -40, y: 0, z: 0}
--- !u!1 &9161708367394028553
GameObject:
  m_ObjectHideFlags: 0
  m_CorrespondingSourceObject: {fileID: 0}
  m_PrefabInstance: {fileID: 0}
  m_PrefabAsset: {fileID: 0}
  serializedVersion: 6
  m_Component:
  - component: {fileID: 2776786794316260527}
  - component: {fileID: 4945540889816544597}
  - component: {fileID: 8705046176773933258}
  m_Layer: 0
  m_Name: Tooltip
  m_TagString: Untagged
  m_Icon: {fileID: 0}
  m_NavMeshLayer: 0
  m_StaticEditorFlags: 0
  m_IsActive: 1
--- !u!4 &2776786794316260527
Transform:
  m_ObjectHideFlags: 0
  m_CorrespondingSourceObject: {fileID: 0}
  m_PrefabInstance: {fileID: 0}
  m_PrefabAsset: {fileID: 0}
  m_GameObject: {fileID: 9161708367394028553}
  m_LocalRotation: {x: 0, y: 0, z: 0, w: 1}
  m_LocalPosition: {x: -0.0005067382, y: -0.0022980925, z: 0.042037766}
  m_LocalScale: {x: 1, y: 1, z: 1}
  m_ConstrainProportionsScale: 0
  m_Children: []
  m_Father: {fileID: 4565884230453822476}
  m_RootOrder: 0
  m_LocalEulerAnglesHint: {x: 0, y: 0, z: 0}
--- !u!114 &4945540889816544597
MonoBehaviour:
  m_ObjectHideFlags: 0
  m_CorrespondingSourceObject: {fileID: 0}
  m_PrefabInstance: {fileID: 0}
  m_PrefabAsset: {fileID: 0}
  m_GameObject: {fileID: 9161708367394028553}
  m_Enabled: 1
  m_EditorHideFlags: 0
  m_Script: {fileID: 11500000, guid: b46c4909cebc470fbcfc052ab0ba2827, type: 3}
  m_Name: 
  m_EditorClassIdentifier: 
  Type: 2
--- !u!114 &8705046176773933258
MonoBehaviour:
  m_ObjectHideFlags: 0
  m_CorrespondingSourceObject: {fileID: 0}
  m_PrefabInstance: {fileID: 0}
  m_PrefabAsset: {fileID: 0}
  m_GameObject: {fileID: 9161708367394028553}
  m_Enabled: 1
  m_EditorHideFlags: 0
  m_Script: {fileID: 11500000, guid: b46c4909cebc470fbcfc052ab0ba2827, type: 3}
  m_Name: 
  m_EditorClassIdentifier: 
  Type: 3
--- !u!1 &9170600467762335901
GameObject:
  m_ObjectHideFlags: 0
  m_CorrespondingSourceObject: {fileID: 0}
  m_PrefabInstance: {fileID: 0}
  m_PrefabAsset: {fileID: 0}
  serializedVersion: 6
  m_Component:
  - component: {fileID: 6290543905588528835}
  - component: {fileID: 2567585693705755844}
  m_Layer: 0
  m_Name: Tooltip
  m_TagString: Untagged
  m_Icon: {fileID: 0}
  m_NavMeshLayer: 0
  m_StaticEditorFlags: 0
  m_IsActive: 1
--- !u!4 &6290543905588528835
Transform:
  m_ObjectHideFlags: 0
  m_CorrespondingSourceObject: {fileID: 0}
  m_PrefabInstance: {fileID: 0}
  m_PrefabAsset: {fileID: 0}
  m_GameObject: {fileID: 9170600467762335901}
  m_LocalRotation: {x: 0, y: 0, z: 0, w: 1}
  m_LocalPosition: {x: 0.0025, y: 0.0044, z: 0.0834}
  m_LocalScale: {x: 1, y: 1, z: 1}
  m_ConstrainProportionsScale: 0
  m_Children: []
  m_Father: {fileID: 1493620525144215483}
  m_RootOrder: 0
  m_LocalEulerAnglesHint: {x: 0, y: 0, z: 0}
--- !u!114 &2567585693705755844
MonoBehaviour:
  m_ObjectHideFlags: 0
  m_CorrespondingSourceObject: {fileID: 0}
  m_PrefabInstance: {fileID: 0}
  m_PrefabAsset: {fileID: 0}
  m_GameObject: {fileID: 9170600467762335901}
  m_Enabled: 1
  m_EditorHideFlags: 0
  m_Script: {fileID: 11500000, guid: b46c4909cebc470fbcfc052ab0ba2827, type: 3}
  m_Name: 
  m_EditorClassIdentifier: 
  Type: 8
--- !u!1001 &1141143832171664655
PrefabInstance:
  m_ObjectHideFlags: 0
  serializedVersion: 2
  m_Modification:
    m_TransformParent: {fileID: 1141143830523417262}
    m_Modifications:
    - target: {fileID: -8679921383154817045, guid: f066f92ef11fa764bb76895e2e30f85d,
        type: 3}
      propertyPath: m_RootOrder
      value: 0
      objectReference: {fileID: 0}
    - target: {fileID: -8679921383154817045, guid: f066f92ef11fa764bb76895e2e30f85d,
        type: 3}
      propertyPath: m_LocalPosition.x
      value: 0
      objectReference: {fileID: 0}
    - target: {fileID: -8679921383154817045, guid: f066f92ef11fa764bb76895e2e30f85d,
        type: 3}
      propertyPath: m_LocalPosition.y
      value: 0
      objectReference: {fileID: 0}
    - target: {fileID: -8679921383154817045, guid: f066f92ef11fa764bb76895e2e30f85d,
        type: 3}
      propertyPath: m_LocalPosition.z
      value: 0
      objectReference: {fileID: 0}
    - target: {fileID: -8679921383154817045, guid: f066f92ef11fa764bb76895e2e30f85d,
        type: 3}
      propertyPath: m_LocalRotation.w
      value: 1
      objectReference: {fileID: 0}
    - target: {fileID: -8679921383154817045, guid: f066f92ef11fa764bb76895e2e30f85d,
        type: 3}
      propertyPath: m_LocalRotation.x
      value: -0
      objectReference: {fileID: 0}
    - target: {fileID: -8679921383154817045, guid: f066f92ef11fa764bb76895e2e30f85d,
        type: 3}
      propertyPath: m_LocalRotation.y
      value: -0
      objectReference: {fileID: 0}
    - target: {fileID: -8679921383154817045, guid: f066f92ef11fa764bb76895e2e30f85d,
        type: 3}
      propertyPath: m_LocalRotation.z
      value: -0
      objectReference: {fileID: 0}
    - target: {fileID: -8679921383154817045, guid: f066f92ef11fa764bb76895e2e30f85d,
        type: 3}
      propertyPath: m_LocalEulerAnglesHint.x
      value: 0
      objectReference: {fileID: 0}
    - target: {fileID: -8679921383154817045, guid: f066f92ef11fa764bb76895e2e30f85d,
        type: 3}
      propertyPath: m_LocalEulerAnglesHint.y
      value: 0
      objectReference: {fileID: 0}
    - target: {fileID: -8679921383154817045, guid: f066f92ef11fa764bb76895e2e30f85d,
        type: 3}
      propertyPath: m_LocalEulerAnglesHint.z
      value: 0
      objectReference: {fileID: 0}
    - target: {fileID: -7761653290824669072, guid: f066f92ef11fa764bb76895e2e30f85d,
        type: 3}
      propertyPath: m_Materials.Array.data[0]
      value: 
      objectReference: {fileID: 2100000, guid: c0f0f027c0515944bb14704bca73b4ec, type: 2}
    - target: {fileID: -4796266564536600923, guid: f066f92ef11fa764bb76895e2e30f85d,
        type: 3}
      propertyPath: m_Materials.Array.data[0]
      value: 
      objectReference: {fileID: 2100000, guid: c0f0f027c0515944bb14704bca73b4ec, type: 2}
    - target: {fileID: -1983120319597383265, guid: f066f92ef11fa764bb76895e2e30f85d,
        type: 3}
      propertyPath: m_Materials.Array.data[0]
      value: 
      objectReference: {fileID: 2100000, guid: c0f0f027c0515944bb14704bca73b4ec, type: 2}
    - target: {fileID: 919132149155446097, guid: f066f92ef11fa764bb76895e2e30f85d,
        type: 3}
      propertyPath: m_Name
      value: Oculus_quest_controller_left
      objectReference: {fileID: 0}
    - target: {fileID: 2545228181402026268, guid: f066f92ef11fa764bb76895e2e30f85d,
        type: 3}
      propertyPath: m_Mesh
      value: 
      objectReference: {fileID: -1400252653696632910, guid: b6b6e82f462f28a42aad856bd2159f95,
        type: 3}
    - target: {fileID: 2545228181402026268, guid: f066f92ef11fa764bb76895e2e30f85d,
        type: 3}
      propertyPath: m_Materials.Array.data[0]
      value: 
      objectReference: {fileID: 2100000, guid: 98f191acca91cc14ebcd02c5c1277539, type: 2}
    - target: {fileID: 2628389529492363703, guid: f066f92ef11fa764bb76895e2e30f85d,
        type: 3}
      propertyPath: m_LocalPosition.x
      value: -0.008
      objectReference: {fileID: 0}
    - target: {fileID: 2680031633361485198, guid: f066f92ef11fa764bb76895e2e30f85d,
        type: 3}
      propertyPath: m_Materials.Array.data[0]
      value: 
      objectReference: {fileID: 2100000, guid: c0f0f027c0515944bb14704bca73b4ec, type: 2}
    - target: {fileID: 5302020411613980871, guid: f066f92ef11fa764bb76895e2e30f85d,
        type: 3}
      propertyPath: m_Materials.Array.data[0]
      value: 
      objectReference: {fileID: 2100000, guid: c0f0f027c0515944bb14704bca73b4ec, type: 2}
    - target: {fileID: 5866666021909216657, guid: f066f92ef11fa764bb76895e2e30f85d,
        type: 3}
      propertyPath: m_Controller
      value: 
      objectReference: {fileID: 9100000, guid: e276c40c89760d649b5e4303bf18c043, type: 2}
    - target: {fileID: 7269875724241359754, guid: f066f92ef11fa764bb76895e2e30f85d,
        type: 3}
      propertyPath: m_Materials.Array.data[0]
      value: 
      objectReference: {fileID: 2100000, guid: c0f0f027c0515944bb14704bca73b4ec, type: 2}
    - target: {fileID: 8452402308636366295, guid: f066f92ef11fa764bb76895e2e30f85d,
        type: 3}
      propertyPath: m_Materials.Array.data[0]
      value: 
      objectReference: {fileID: 2100000, guid: c0f0f027c0515944bb14704bca73b4ec, type: 2}
    m_RemovedComponents: []
  m_SourcePrefab: {fileID: 100100000, guid: f066f92ef11fa764bb76895e2e30f85d, type: 3}
--- !u!4 &602516126517506788 stripped
Transform:
  m_CorrespondingSourceObject: {fileID: -8679921383154817045, guid: f066f92ef11fa764bb76895e2e30f85d,
    type: 3}
  m_PrefabInstance: {fileID: 1141143832171664655}
  m_PrefabAsset: {fileID: 0}
--- !u!1 &1179328229392151911 stripped
GameObject:
  m_CorrespondingSourceObject: {fileID: 2273183675388141672, guid: f066f92ef11fa764bb76895e2e30f85d,
    type: 3}
  m_PrefabInstance: {fileID: 1141143832171664655}
  m_PrefabAsset: {fileID: 0}
--- !u!114 &1235651168403625351
MonoBehaviour:
  m_ObjectHideFlags: 0
  m_CorrespondingSourceObject: {fileID: 0}
  m_PrefabInstance: {fileID: 0}
  m_PrefabAsset: {fileID: 0}
  m_GameObject: {fileID: 1179328229392151911}
  m_Enabled: 1
  m_EditorHideFlags: 0
  m_Script: {fileID: 11500000, guid: 7fbc17ab92734d1fbb0edb12e8e31bbd, type: 3}
  m_Name: 
  m_EditorClassIdentifier: 
  PrimaryInputFeatureName: Trigger
  LayerIndex: 0
  AnimatorParameterName: Trigger
--- !u!4 &1493620525144215483 stripped
Transform:
  m_CorrespondingSourceObject: {fileID: 1976041957269199540, guid: f066f92ef11fa764bb76895e2e30f85d,
    type: 3}
  m_PrefabInstance: {fileID: 1141143832171664655}
  m_PrefabAsset: {fileID: 0}
--- !u!1 &1498797399462094581 stripped
GameObject:
  m_CorrespondingSourceObject: {fileID: 1953124144900994042, guid: f066f92ef11fa764bb76895e2e30f85d,
    type: 3}
  m_PrefabInstance: {fileID: 1141143832171664655}
  m_PrefabAsset: {fileID: 0}
--- !u!114 &1141143832171664666
MonoBehaviour:
  m_ObjectHideFlags: 0
  m_CorrespondingSourceObject: {fileID: 0}
  m_PrefabInstance: {fileID: 0}
  m_PrefabAsset: {fileID: 0}
  m_GameObject: {fileID: 1498797399462094581}
  m_Enabled: 1
  m_EditorHideFlags: 0
  m_Script: {fileID: 11500000, guid: 7fbc17ab92734d1fbb0edb12e8e31bbd, type: 3}
  m_Name: 
  m_EditorClassIdentifier: 
  PrimaryInputFeatureName: Grip
  LayerIndex: 3
  AnimatorParameterName: Grip
--- !u!4 &1533356273513676125 stripped
Transform:
  m_CorrespondingSourceObject: {fileID: 1914517118269679698, guid: f066f92ef11fa764bb76895e2e30f85d,
    type: 3}
  m_PrefabInstance: {fileID: 1141143832171664655}
  m_PrefabAsset: {fileID: 0}
--- !u!4 &1929719125406557633 stripped
Transform:
  m_CorrespondingSourceObject: {fileID: -7705213561569873714, guid: f066f92ef11fa764bb76895e2e30f85d,
    type: 3}
  m_PrefabInstance: {fileID: 1141143832171664655}
  m_PrefabAsset: {fileID: 0}
--- !u!4 &2025400659021385419 stripped
Transform:
  m_CorrespondingSourceObject: {fileID: 1426941173653019588, guid: f066f92ef11fa764bb76895e2e30f85d,
    type: 3}
  m_PrefabInstance: {fileID: 1141143832171664655}
  m_PrefabAsset: {fileID: 0}
--- !u!1 &2474804283167274811 stripped
GameObject:
  m_CorrespondingSourceObject: {fileID: -5940690844839009740, guid: f066f92ef11fa764bb76895e2e30f85d,
    type: 3}
  m_PrefabInstance: {fileID: 1141143832171664655}
  m_PrefabAsset: {fileID: 0}
--- !u!114 &1141143831733364036
MonoBehaviour:
  m_ObjectHideFlags: 0
  m_CorrespondingSourceObject: {fileID: 0}
  m_PrefabInstance: {fileID: 0}
  m_PrefabAsset: {fileID: 0}
  m_GameObject: {fileID: 2474804283167274811}
  m_Enabled: 1
  m_EditorHideFlags: 0
  m_Script: {fileID: 11500000, guid: 42a14b2b31e04e42ace502a2acb818ea, type: 3}
  m_Name: 
  m_EditorClassIdentifier: 
  PrimaryInputFeatureName: SecondaryButton
  LayerIndex: 5
  AnimatorParameterName: ButtonB
--- !u!1 &2831599110337384752 stripped
GameObject:
  m_CorrespondingSourceObject: {fileID: 2926763783881786431, guid: f066f92ef11fa764bb76895e2e30f85d,
    type: 3}
  m_PrefabInstance: {fileID: 1141143832171664655}
  m_PrefabAsset: {fileID: 0}
--- !u!114 &1141143832171664647
MonoBehaviour:
  m_ObjectHideFlags: 0
  m_CorrespondingSourceObject: {fileID: 0}
  m_PrefabInstance: {fileID: 0}
  m_PrefabAsset: {fileID: 0}
  m_GameObject: {fileID: 2831599110337384752}
  m_Enabled: 1
  m_EditorHideFlags: 0
  m_Script: {fileID: 11500000, guid: 42a14b2b31e04e42ace502a2acb818ea, type: 3}
  m_Name: 
  m_EditorClassIdentifier: 
  PrimaryInputFeatureName: Primary2DAxisTouch
  LayerIndex: 2
  AnimatorParameterName: 
--- !u!114 &1141143832171664664
MonoBehaviour:
  m_ObjectHideFlags: 0
  m_CorrespondingSourceObject: {fileID: 0}
  m_PrefabInstance: {fileID: 0}
  m_PrefabAsset: {fileID: 0}
  m_GameObject: {fileID: 2831599110337384752}
  m_Enabled: 1
  m_EditorHideFlags: 0
  m_Script: {fileID: 11500000, guid: fb959ab8eca546139141a13f20354e8e, type: 3}
  m_Name: 
  m_EditorClassIdentifier: 
  PrimaryInputFeatureName: Primary2DAxis
  LayerIndex: 2
  AnimatorParameterXName: AxisX
  AnimatorParameterYName: AxisY
  InvertedX: 0
  InvertedY: 0
--- !u!4 &3882322231326998551 stripped
Transform:
  m_CorrespondingSourceObject: {fileID: -5028568896964045544, guid: f066f92ef11fa764bb76895e2e30f85d,
    type: 3}
  m_PrefabInstance: {fileID: 1141143832171664655}
  m_PrefabAsset: {fileID: 0}
--- !u!4 &4565884230453822476 stripped
Transform:
  m_CorrespondingSourceObject: {fileID: -5725359627424870141, guid: f066f92ef11fa764bb76895e2e30f85d,
    type: 3}
  m_PrefabInstance: {fileID: 1141143832171664655}
  m_PrefabAsset: {fileID: 0}
--- !u!4 &4667420178501959269 stripped
Transform:
  m_CorrespondingSourceObject: {fileID: 5697099333093108586, guid: f066f92ef11fa764bb76895e2e30f85d,
    type: 3}
  m_PrefabInstance: {fileID: 1141143832171664655}
  m_PrefabAsset: {fileID: 0}
--- !u!1 &5104263889931626215 stripped
GameObject:
  m_CorrespondingSourceObject: {fileID: 5261282651423257576, guid: f066f92ef11fa764bb76895e2e30f85d,
    type: 3}
  m_PrefabInstance: {fileID: 1141143832171664655}
  m_PrefabAsset: {fileID: 0}
--- !u!114 &1141143832171664665
MonoBehaviour:
  m_ObjectHideFlags: 0
  m_CorrespondingSourceObject: {fileID: 0}
  m_PrefabInstance: {fileID: 0}
  m_PrefabAsset: {fileID: 0}
  m_GameObject: {fileID: 5104263889931626215}
  m_Enabled: 1
  m_EditorHideFlags: 0
  m_Script: {fileID: 11500000, guid: 42a14b2b31e04e42ace502a2acb818ea, type: 3}
  m_Name: 
  m_EditorClassIdentifier: 
  PrimaryInputFeatureName: PrimaryButton
  LayerIndex: 4
  AnimatorParameterName: ButtonA
--- !u!95 &6826539960959035550 stripped
Animator:
  m_CorrespondingSourceObject: {fileID: 5866666021909216657, guid: f066f92ef11fa764bb76895e2e30f85d,
    type: 3}
  m_PrefabInstance: {fileID: 1141143832171664655}
  m_PrefabAsset: {fileID: 0}
