%YAML 1.1
%TAG !u! tag:unity3d.com,2011:
--- !u!1 &1735736043
GameObject:
  m_ObjectHideFlags: 0
  m_CorrespondingSourceObject: {fileID: 0}
  m_PrefabInstance: {fileID: 0}
  m_PrefabAsset: {fileID: 0}
  serializedVersion: 6
  m_Component:
  - component: {fileID: 1735736044}
  m_Layer: 0
  m_Name: DesktopOpenXRAnchor
  m_TagString: Untagged
  m_Icon: {fileID: 0}
  m_NavMeshLayer: 0
  m_StaticEditorFlags: 0
  m_IsActive: 1
--- !u!4 &1735736044
Transform:
  m_ObjectHideFlags: 0
  m_CorrespondingSourceObject: {fileID: 0}
  m_PrefabInstance: {fileID: 0}
  m_PrefabAsset: {fileID: 0}
  m_GameObject: {fileID: 1735736043}
  m_LocalRotation: {x: 0.3252582, y: 0.04124296, z: -0.014201085, w: 0.94461876}
  m_LocalPosition: {x: -0.005, y: 0.0025, z: 0.025}
  m_LocalScale: {x: 1, y: 1, z: 1}
  m_ConstrainProportionsScale: 0
  m_Children: []
  m_Father: {fileID: 259040555331275824}
  m_RootOrder: 5
  m_LocalEulerAnglesHint: {x: 38, y: 5, z: 0}
--- !u!1 &1135795341243488130
GameObject:
  m_ObjectHideFlags: 0
  m_CorrespondingSourceObject: {fileID: 0}
  m_PrefabInstance: {fileID: 0}
  m_PrefabAsset: {fileID: 0}
  serializedVersion: 6
  m_Component:
  - component: {fileID: 8170286670057081982}
  m_Layer: 0
  m_Name: MobileOpenXRAnchor
  m_TagString: Untagged
  m_Icon: {fileID: 0}
  m_NavMeshLayer: 0
  m_StaticEditorFlags: 0
  m_IsActive: 1
--- !u!4 &8170286670057081982
Transform:
  m_ObjectHideFlags: 0
  m_CorrespondingSourceObject: {fileID: 0}
  m_PrefabInstance: {fileID: 0}
  m_PrefabAsset: {fileID: 0}
  m_GameObject: {fileID: 1135795341243488130}
  m_LocalRotation: {x: 0, y: 0, z: 0, w: 1}
  m_LocalPosition: {x: -0.008, y: -0.015, z: 0.005}
  m_LocalScale: {x: 1, y: 1, z: 1}
  m_ConstrainProportionsScale: 0
  m_Children: []
  m_Father: {fileID: 259040555331275824}
  m_RootOrder: 2
  m_LocalEulerAnglesHint: {x: 0, y: 0, z: 0}
--- !u!1 &1717911123120455279
GameObject:
  m_ObjectHideFlags: 0
  m_CorrespondingSourceObject: {fileID: 0}
  m_PrefabInstance: {fileID: 0}
  m_PrefabAsset: {fileID: 0}
  serializedVersion: 6
  m_Component:
  - component: {fileID: 8461798057891820785}
  - component: {fileID: 7474547569583087095}
  - component: {fileID: 5143152163732120220}
  m_Layer: 0
  m_Name: Tooltip
  m_TagString: Untagged
  m_Icon: {fileID: 0}
  m_NavMeshLayer: 0
  m_StaticEditorFlags: 0
  m_IsActive: 1
--- !u!4 &8461798057891820785
Transform:
  m_ObjectHideFlags: 0
  m_CorrespondingSourceObject: {fileID: 0}
  m_PrefabInstance: {fileID: 0}
  m_PrefabAsset: {fileID: 0}
  m_GameObject: {fileID: 1717911123120455279}
  m_LocalRotation: {x: 0, y: 0, z: 0, w: 1}
  m_LocalPosition: {x: 0, y: 0, z: 0}
  m_LocalScale: {x: 1, y: 1, z: 1}
  m_ConstrainProportionsScale: 0
  m_Children: []
  m_Father: {fileID: 1155139883821764049}
  m_RootOrder: 0
  m_LocalEulerAnglesHint: {x: 0, y: 0, z: 0}
--- !u!114 &7474547569583087095
MonoBehaviour:
  m_ObjectHideFlags: 0
  m_CorrespondingSourceObject: {fileID: 0}
  m_PrefabInstance: {fileID: 0}
  m_PrefabAsset: {fileID: 0}
  m_GameObject: {fileID: 1717911123120455279}
  m_Enabled: 1
  m_EditorHideFlags: 0
  m_Script: {fileID: 11500000, guid: b46c4909cebc470fbcfc052ab0ba2827, type: 3}
  m_Name: 
  m_EditorClassIdentifier: 
  Type: 7
--- !u!114 &5143152163732120220
MonoBehaviour:
  m_ObjectHideFlags: 0
  m_CorrespondingSourceObject: {fileID: 0}
  m_PrefabInstance: {fileID: 0}
  m_PrefabAsset: {fileID: 0}
  m_GameObject: {fileID: 1717911123120455279}
  m_Enabled: 1
  m_EditorHideFlags: 0
  m_Script: {fileID: 11500000, guid: b46c4909cebc470fbcfc052ab0ba2827, type: 3}
  m_Name: 
  m_EditorClassIdentifier: 
  Type: 9
--- !u!1 &2517436976897023943
GameObject:
  m_ObjectHideFlags: 0
  m_CorrespondingSourceObject: {fileID: 0}
  m_PrefabInstance: {fileID: 0}
  m_PrefabAsset: {fileID: 0}
  serializedVersion: 6
  m_Component:
  - component: {fileID: 67103354451221}
  - component: {fileID: 7563465112184633036}
  m_Layer: 0
  m_Name: Tooltip
  m_TagString: Untagged
  m_Icon: {fileID: 0}
  m_NavMeshLayer: 0
  m_StaticEditorFlags: 0
  m_IsActive: 1
--- !u!4 &67103354451221
Transform:
  m_ObjectHideFlags: 0
  m_CorrespondingSourceObject: {fileID: 0}
  m_PrefabInstance: {fileID: 0}
  m_PrefabAsset: {fileID: 0}
  m_GameObject: {fileID: 2517436976897023943}
  m_LocalRotation: {x: 0, y: 0, z: 0, w: 1}
  m_LocalPosition: {x: -0.000036571146, y: -0.0032995045, z: 0.00017530774}
  m_LocalScale: {x: 1, y: 1, z: 1}
  m_ConstrainProportionsScale: 0
  m_Children: []
  m_Father: {fileID: 4667027622624635019}
  m_RootOrder: 0
  m_LocalEulerAnglesHint: {x: 0, y: 0, z: 0}
--- !u!114 &7563465112184633036
MonoBehaviour:
  m_ObjectHideFlags: 0
  m_CorrespondingSourceObject: {fileID: 0}
  m_PrefabInstance: {fileID: 0}
  m_PrefabAsset: {fileID: 0}
  m_GameObject: {fileID: 2517436976897023943}
  m_Enabled: 1
  m_EditorHideFlags: 0
  m_Script: {fileID: 11500000, guid: b46c4909cebc470fbcfc052ab0ba2827, type: 3}
  m_Name: 
  m_EditorClassIdentifier: 
  Type: 5
--- !u!1 &2779472176151090282
GameObject:
  m_ObjectHideFlags: 0
  m_CorrespondingSourceObject: {fileID: 0}
  m_PrefabInstance: {fileID: 0}
  m_PrefabAsset: {fileID: 0}
  serializedVersion: 6
  m_Component:
  - component: {fileID: 7652499758666528616}
  m_Layer: 0
  m_Name: PicoXRAnchor
  m_TagString: Untagged
  m_Icon: {fileID: 0}
  m_NavMeshLayer: 0
  m_StaticEditorFlags: 0
  m_IsActive: 1
--- !u!4 &7652499758666528616
Transform:
  m_ObjectHideFlags: 0
  m_CorrespondingSourceObject: {fileID: 0}
  m_PrefabInstance: {fileID: 0}
  m_PrefabAsset: {fileID: 0}
  m_GameObject: {fileID: 2779472176151090282}
  m_LocalRotation: {x: -0, y: -0, z: -0, w: 1}
  m_LocalPosition: {x: 0, y: 0, z: 0}
  m_LocalScale: {x: 1, y: 1, z: 1}
  m_ConstrainProportionsScale: 0
  m_Children: []
  m_Father: {fileID: 259040555331275824}
  m_RootOrder: 3
  m_LocalEulerAnglesHint: {x: 0, y: 0, z: 0}
--- !u!1 &5364863477174489905
GameObject:
  m_ObjectHideFlags: 0
  m_CorrespondingSourceObject: {fileID: 0}
  m_PrefabInstance: {fileID: 0}
  m_PrefabAsset: {fileID: 0}
  serializedVersion: 6
  m_Component:
  - component: {fileID: 5191522504063909234}
  m_Layer: 0
  m_Name: GrabAnchor
  m_TagString: Untagged
  m_Icon: {fileID: 0}
  m_NavMeshLayer: 0
  m_StaticEditorFlags: 0
  m_IsActive: 1
--- !u!4 &5191522504063909234
Transform:
  m_ObjectHideFlags: 0
  m_CorrespondingSourceObject: {fileID: 0}
  m_PrefabInstance: {fileID: 0}
  m_PrefabAsset: {fileID: 0}
  m_GameObject: {fileID: 5364863477174489905}
  m_LocalRotation: {x: -0.2523367, y: -0, z: -0, w: 0.9676395}
  m_LocalPosition: {x: 0.0091, y: -0.0152, z: -0.0361}
  m_LocalScale: {x: 1, y: 1, z: 1}
  m_ConstrainProportionsScale: 0
  m_Children: []
  m_Father: {fileID: 259040555331275824}
  m_RootOrder: 4
  m_LocalEulerAnglesHint: {x: -29.232, y: 0, z: 0}
--- !u!1 &5997336288245101755
GameObject:
  m_ObjectHideFlags: 0
  m_CorrespondingSourceObject: {fileID: 0}
  m_PrefabInstance: {fileID: 0}
  m_PrefabAsset: {fileID: 0}
  serializedVersion: 6
  m_Component:
  - component: {fileID: 7880064491767309014}
  - component: {fileID: 2577873100871685186}
  m_Layer: 0
  m_Name: Tooltip
  m_TagString: Untagged
  m_Icon: {fileID: 0}
  m_NavMeshLayer: 0
  m_StaticEditorFlags: 0
  m_IsActive: 1
--- !u!4 &7880064491767309014
Transform:
  m_ObjectHideFlags: 0
  m_CorrespondingSourceObject: {fileID: 0}
  m_PrefabInstance: {fileID: 0}
  m_PrefabAsset: {fileID: 0}
  m_GameObject: {fileID: 5997336288245101755}
  m_LocalRotation: {x: 0, y: 0, z: 0, w: 1}
  m_LocalPosition: {x: 0.0032285457, y: 0.0000003525056, z: 0.00000013903511}
  m_LocalScale: {x: 1, y: 1, z: 1}
  m_ConstrainProportionsScale: 0
  m_Children: []
  m_Father: {fileID: 569975141841178156}
  m_RootOrder: 0
  m_LocalEulerAnglesHint: {x: 0, y: 0, z: 0}
--- !u!114 &2577873100871685186
MonoBehaviour:
  m_ObjectHideFlags: 0
  m_CorrespondingSourceObject: {fileID: 0}
  m_PrefabInstance: {fileID: 0}
  m_PrefabAsset: {fileID: 0}
  m_GameObject: {fileID: 5997336288245101755}
  m_Enabled: 1
  m_EditorHideFlags: 0
  m_Script: {fileID: 11500000, guid: b46c4909cebc470fbcfc052ab0ba2827, type: 3}
  m_Name: 
  m_EditorClassIdentifier: 
  Type: 6
--- !u!1 &6994679146281695269
GameObject:
  m_ObjectHideFlags: 0
  m_CorrespondingSourceObject: {fileID: 0}
  m_PrefabInstance: {fileID: 0}
  m_PrefabAsset: {fileID: 0}
  serializedVersion: 6
  m_Component:
  - component: {fileID: 4265809456575476913}
  - component: {fileID: 860674152172570911}
  m_Layer: 0
  m_Name: Tooltip
  m_TagString: Untagged
  m_Icon: {fileID: 0}
  m_NavMeshLayer: 0
  m_StaticEditorFlags: 0
  m_IsActive: 1
--- !u!4 &4265809456575476913
Transform:
  m_ObjectHideFlags: 0
  m_CorrespondingSourceObject: {fileID: 0}
  m_PrefabInstance: {fileID: 0}
  m_PrefabAsset: {fileID: 0}
  m_GameObject: {fileID: 6994679146281695269}
  m_LocalRotation: {x: 0, y: 0, z: 0, w: 1}
  m_LocalPosition: {x: 0, y: 0, z: 0}
  m_LocalScale: {x: 1, y: 1, z: 1}
  m_ConstrainProportionsScale: 0
  m_Children: []
  m_Father: {fileID: 6159688586476261104}
  m_RootOrder: 0
  m_LocalEulerAnglesHint: {x: 0, y: 0, z: 0}
--- !u!114 &860674152172570911
MonoBehaviour:
  m_ObjectHideFlags: 0
  m_CorrespondingSourceObject: {fileID: 0}
  m_PrefabInstance: {fileID: 0}
  m_PrefabAsset: {fileID: 0}
  m_GameObject: {fileID: 6994679146281695269}
  m_Enabled: 1
  m_EditorHideFlags: 0
  m_Script: {fileID: 11500000, guid: b46c4909cebc470fbcfc052ab0ba2827, type: 3}
  m_Name: 
  m_EditorClassIdentifier: 
  Type: 8
--- !u!1 &7237503055830723556
GameObject:
  m_ObjectHideFlags: 0
  m_CorrespondingSourceObject: {fileID: 0}
  m_PrefabInstance: {fileID: 0}
  m_PrefabAsset: {fileID: 0}
  serializedVersion: 6
  m_Component:
  - component: {fileID: 9205752239617303197}
  - component: {fileID: 2774948618848391470}
  m_Layer: 0
  m_Name: Tooltip
  m_TagString: Untagged
  m_Icon: {fileID: 0}
  m_NavMeshLayer: 0
  m_StaticEditorFlags: 0
  m_IsActive: 1
--- !u!4 &9205752239617303197
Transform:
  m_ObjectHideFlags: 0
  m_CorrespondingSourceObject: {fileID: 0}
  m_PrefabInstance: {fileID: 0}
  m_PrefabAsset: {fileID: 0}
  m_GameObject: {fileID: 7237503055830723556}
  m_LocalRotation: {x: 0, y: 0, z: 0, w: 1}
  m_LocalPosition: {x: -0.000004322268, y: 0.006750649, z: -0.00002697669}
  m_LocalScale: {x: 1, y: 1, z: 1}
  m_ConstrainProportionsScale: 0
  m_Children: []
  m_Father: {fileID: 5867071309849803803}
  m_RootOrder: 0
  m_LocalEulerAnglesHint: {x: 0, y: 0, z: 0}
--- !u!114 &2774948618848391470
MonoBehaviour:
  m_ObjectHideFlags: 0
  m_CorrespondingSourceObject: {fileID: 0}
  m_PrefabInstance: {fileID: 0}
  m_PrefabAsset: {fileID: 0}
  m_GameObject: {fileID: 7237503055830723556}
  m_Enabled: 1
  m_EditorHideFlags: 0
  m_Script: {fileID: 11500000, guid: b46c4909cebc470fbcfc052ab0ba2827, type: 3}
  m_Name: 
  m_EditorClassIdentifier: 
  Type: 4
--- !u!1 &7571740395678635343
GameObject:
  m_ObjectHideFlags: 0
  m_CorrespondingSourceObject: {fileID: 0}
  m_PrefabInstance: {fileID: 0}
  m_PrefabAsset: {fileID: 0}
  serializedVersion: 6
  m_Component:
  - component: {fileID: 7307388667051504870}
  m_Layer: 0
  m_Name: PointerAnchor
  m_TagString: Untagged
  m_Icon: {fileID: 0}
  m_NavMeshLayer: 0
  m_StaticEditorFlags: 0
  m_IsActive: 1
--- !u!4 &7307388667051504870
Transform:
  m_ObjectHideFlags: 0
  m_CorrespondingSourceObject: {fileID: 0}
  m_PrefabInstance: {fileID: 0}
  m_PrefabAsset: {fileID: 0}
  m_GameObject: {fileID: 7571740395678635343}
  m_LocalRotation: {x: -0.1992499, y: -0, z: -0, w: 0.97994876}
  m_LocalPosition: {x: 0.0056, y: 0.017300019, z: 0.0412}
  m_LocalScale: {x: 1, y: 1, z: 1}
  m_ConstrainProportionsScale: 0
  m_Children: []
  m_Father: {fileID: 259040555331275824}
  m_RootOrder: 1
  m_LocalEulerAnglesHint: {x: -22.986, y: 0, z: 0}
--- !u!1 &8147578588516084321
GameObject:
  m_ObjectHideFlags: 0
  m_CorrespondingSourceObject: {fileID: 0}
  m_PrefabInstance: {fileID: 0}
  m_PrefabAsset: {fileID: 0}
  serializedVersion: 6
  m_Component:
  - component: {fileID: 8806589432450594693}
  - component: {fileID: 1333720823556105046}
  - component: {fileID: 990295669303763847}
  m_Layer: 0
  m_Name: Tooltip
  m_TagString: Untagged
  m_Icon: {fileID: 0}
  m_NavMeshLayer: 0
  m_StaticEditorFlags: 0
  m_IsActive: 1
--- !u!4 &8806589432450594693
Transform:
  m_ObjectHideFlags: 0
  m_CorrespondingSourceObject: {fileID: 0}
  m_PrefabInstance: {fileID: 0}
  m_PrefabAsset: {fileID: 0}
  m_GameObject: {fileID: 8147578588516084321}
  m_LocalRotation: {x: 0, y: 0, z: 0, w: 1}
  m_LocalPosition: {x: 0.0074486164, y: -0.0036156648, z: -0.0063420925}
  m_LocalScale: {x: 1, y: 1, z: 1}
  m_ConstrainProportionsScale: 0
  m_Children: []
  m_Father: {fileID: 4049835994127453517}
  m_RootOrder: 0
  m_LocalEulerAnglesHint: {x: 0, y: 0, z: 0}
--- !u!114 &1333720823556105046
MonoBehaviour:
  m_ObjectHideFlags: 0
  m_CorrespondingSourceObject: {fileID: 0}
  m_PrefabInstance: {fileID: 0}
  m_PrefabAsset: {fileID: 0}
  m_GameObject: {fileID: 8147578588516084321}
  m_Enabled: 1
  m_EditorHideFlags: 0
  m_Script: {fileID: 11500000, guid: b46c4909cebc470fbcfc052ab0ba2827, type: 3}
  m_Name: 
  m_EditorClassIdentifier: 
  Type: 3
--- !u!114 &990295669303763847
MonoBehaviour:
  m_ObjectHideFlags: 0
  m_CorrespondingSourceObject: {fileID: 0}
  m_PrefabInstance: {fileID: 0}
  m_PrefabAsset: {fileID: 0}
  m_GameObject: {fileID: 8147578588516084321}
  m_Enabled: 1
  m_EditorHideFlags: 0
  m_Script: {fileID: 11500000, guid: b46c4909cebc470fbcfc052ab0ba2827, type: 3}
  m_Name: 
  m_EditorClassIdentifier: 
  Type: 2
--- !u!1 &8518068129814508374
GameObject:
  m_ObjectHideFlags: 0
  m_CorrespondingSourceObject: {fileID: 0}
  m_PrefabInstance: {fileID: 0}
  m_PrefabAsset: {fileID: 0}
  serializedVersion: 6
  m_Component:
  - component: {fileID: 259040555331275824}
  - component: {fileID: 9118692287142717206}
  - component: {fileID: 4505223221689720330}
  m_Layer: 0
  m_Name: PicoNeo4ControllerRight
  m_TagString: Untagged
  m_Icon: {fileID: 0}
  m_NavMeshLayer: 0
  m_StaticEditorFlags: 0
  m_IsActive: 1
--- !u!4 &259040555331275824
Transform:
  m_ObjectHideFlags: 0
  m_CorrespondingSourceObject: {fileID: 0}
  m_PrefabInstance: {fileID: 0}
  m_PrefabAsset: {fileID: 0}
  m_GameObject: {fileID: 8518068129814508374}
  m_LocalRotation: {x: 0, y: 0, z: 0, w: 1}
  m_LocalPosition: {x: 0.2629, y: 0.37610605, z: -0.017856024}
  m_LocalScale: {x: 1, y: 1, z: 1}
  m_ConstrainProportionsScale: 0
  m_Children:
  - {fileID: 2275047007295123178}
  - {fileID: 7307388667051504870}
  - {fileID: 8170286670057081982}
  - {fileID: 7652499758666528616}
  - {fileID: 5191522504063909234}
  - {fileID: 1735736044}
  m_Father: {fileID: 0}
  m_RootOrder: 0
  m_LocalEulerAnglesHint: {x: 0, y: 0, z: 0}
--- !u!114 &9118692287142717206
MonoBehaviour:
  m_ObjectHideFlags: 0
  m_CorrespondingSourceObject: {fileID: 0}
  m_PrefabInstance: {fileID: 0}
  m_PrefabAsset: {fileID: 0}
  m_GameObject: {fileID: 8518068129814508374}
  m_Enabled: 1
  m_EditorHideFlags: 0
  m_Script: {fileID: 11500000, guid: 926d2692cbf74cefb9bde63d562cf607, type: 3}
  m_Name: 
  m_EditorClassIdentifier: 
  InputDeviceHandler: {fileID: 5292499115213190288}
  CustomPointerAnchor: {fileID: 7307388667051504870}
  PlatformOffsetInfos:
  - Name: PICO Display
    AngleOffset: {x: 0, y: 0, z: 0}
    Anchor: {fileID: 7652499758666528616}
    IsDesktopOnly: 0
  - Name: Varwin OpenXR Display
    AngleOffset: {x: 0, y: 0, z: 0}
    Anchor: {fileID: 8170286670057081982}
    IsDesktopOnly: 0
  - Name: Varwin OpenXR Display
    AngleOffset: {x: 0, y: 0, z: 0}
    Anchor: {fileID: 1735736044}
    IsDesktopOnly: 1
  _controlTooltipHandlers:
  - {fileID: 860674152172570911}
  - {fileID: 1333720823556105046}
  - {fileID: 990295669303763847}
  - {fileID: 7563465112184633036}
  - {fileID: 2577873100871685186}
  - {fileID: 7474547569583087095}
  - {fileID: 5143152163732120220}
  - {fileID: 2774948618848391470}
  - {fileID: 4711320040230320713}
  TeleportOnThumbstick: 1
  Is3Dof: 0
  GrabAnchor: {fileID: 5364863477174489905}
--- !u!114 &4505223221689720330
MonoBehaviour:
  m_ObjectHideFlags: 0
  m_CorrespondingSourceObject: {fileID: 0}
  m_PrefabInstance: {fileID: 0}
  m_PrefabAsset: {fileID: 0}
  m_GameObject: {fileID: 8518068129814508374}
  m_Enabled: 1
  m_EditorHideFlags: 0
  m_Script: {fileID: 11500000, guid: e92dc823f4034a4dabdef690e2c1a7c0, type: 3}
  m_Name: 
  m_EditorClassIdentifier: 
  Animator: {fileID: 5292499115213190288}
  Indicators:
  - {fileID: 8509370704251925384}
  - {fileID: 364435756571119161}
  - {fileID: 3907050647465856933}
  - {fileID: 5390190330807547659}
  TimeSwitching: 0.05
--- !u!1 &8964934846291377188
GameObject:
  m_ObjectHideFlags: 0
  m_CorrespondingSourceObject: {fileID: 0}
  m_PrefabInstance: {fileID: 0}
  m_PrefabAsset: {fileID: 0}
  serializedVersion: 6
  m_Component:
  - component: {fileID: 2436365291307885156}
  - component: {fileID: 4711320040230320713}
  m_Layer: 0
  m_Name: Tooltip
  m_TagString: Untagged
  m_Icon: {fileID: 0}
  m_NavMeshLayer: 0
  m_StaticEditorFlags: 0
  m_IsActive: 1
--- !u!4 &2436365291307885156
Transform:
  m_ObjectHideFlags: 0
  m_CorrespondingSourceObject: {fileID: 0}
  m_PrefabInstance: {fileID: 0}
  m_PrefabAsset: {fileID: 0}
  m_GameObject: {fileID: 8964934846291377188}
  m_LocalRotation: {x: 0, y: 0, z: 0, w: 1}
  m_LocalPosition: {x: 0.0007117144, y: -0.00974354, z: -0.011673693}
  m_LocalScale: {x: 1, y: 1, z: 1}
  m_ConstrainProportionsScale: 0
  m_Children: []
  m_Father: {fileID: 5272386161311850998}
  m_RootOrder: 0
  m_LocalEulerAnglesHint: {x: 0, y: 0, z: 0}
--- !u!114 &4711320040230320713
MonoBehaviour:
  m_ObjectHideFlags: 0
  m_CorrespondingSourceObject: {fileID: 0}
  m_PrefabInstance: {fileID: 0}
  m_PrefabAsset: {fileID: 0}
  m_GameObject: {fileID: 8964934846291377188}
  m_Enabled: 1
  m_EditorHideFlags: 0
  m_Script: {fileID: 11500000, guid: b46c4909cebc470fbcfc052ab0ba2827, type: 3}
  m_Name: 
  m_EditorClassIdentifier: 
  Type: 1
--- !u!1001 &1736188570833078529
PrefabInstance:
  m_ObjectHideFlags: 0
  serializedVersion: 2
  m_Modification:
    m_TransformParent: {fileID: 259040555331275824}
    m_Modifications:
    - target: {fileID: -8679921383154817045, guid: 675f54bed0844fe4e83285b4ff6c9135,
        type: 3}
      propertyPath: m_RootOrder
      value: 0
      objectReference: {fileID: 0}
    - target: {fileID: -8679921383154817045, guid: 675f54bed0844fe4e83285b4ff6c9135,
        type: 3}
      propertyPath: m_LocalScale.x
      value: -1
      objectReference: {fileID: 0}
    - target: {fileID: -8679921383154817045, guid: 675f54bed0844fe4e83285b4ff6c9135,
        type: 3}
      propertyPath: m_LocalPosition.x
      value: 0
      objectReference: {fileID: 0}
    - target: {fileID: -8679921383154817045, guid: 675f54bed0844fe4e83285b4ff6c9135,
        type: 3}
      propertyPath: m_LocalPosition.y
      value: 0
      objectReference: {fileID: 0}
    - target: {fileID: -8679921383154817045, guid: 675f54bed0844fe4e83285b4ff6c9135,
        type: 3}
      propertyPath: m_LocalPosition.z
      value: 0
      objectReference: {fileID: 0}
    - target: {fileID: -8679921383154817045, guid: 675f54bed0844fe4e83285b4ff6c9135,
        type: 3}
      propertyPath: m_LocalRotation.w
      value: 1
      objectReference: {fileID: 0}
    - target: {fileID: -8679921383154817045, guid: 675f54bed0844fe4e83285b4ff6c9135,
        type: 3}
      propertyPath: m_LocalRotation.x
      value: -0
      objectReference: {fileID: 0}
    - target: {fileID: -8679921383154817045, guid: 675f54bed0844fe4e83285b4ff6c9135,
        type: 3}
      propertyPath: m_LocalRotation.y
      value: -0
      objectReference: {fileID: 0}
    - target: {fileID: -8679921383154817045, guid: 675f54bed0844fe4e83285b4ff6c9135,
        type: 3}
      propertyPath: m_LocalRotation.z
      value: -0
      objectReference: {fileID: 0}
    - target: {fileID: -8679921383154817045, guid: 675f54bed0844fe4e83285b4ff6c9135,
        type: 3}
      propertyPath: m_LocalEulerAnglesHint.x
      value: 0
      objectReference: {fileID: 0}
    - target: {fileID: -8679921383154817045, guid: 675f54bed0844fe4e83285b4ff6c9135,
        type: 3}
      propertyPath: m_LocalEulerAnglesHint.y
      value: 0
      objectReference: {fileID: 0}
    - target: {fileID: -8679921383154817045, guid: 675f54bed0844fe4e83285b4ff6c9135,
        type: 3}
      propertyPath: m_LocalEulerAnglesHint.z
      value: 0
      objectReference: {fileID: 0}
    - target: {fileID: -8283391008975584455, guid: 675f54bed0844fe4e83285b4ff6c9135,
        type: 3}
      propertyPath: m_Materials.Array.data[0]
      value: 
      objectReference: {fileID: 2100000, guid: 72ff2649b50bcb64ebd8134cff1f309f, type: 2}
    - target: {fileID: -6878151020480969209, guid: 675f54bed0844fe4e83285b4ff6c9135,
        type: 3}
      propertyPath: m_Materials.Array.data[0]
      value: 
      objectReference: {fileID: 2100000, guid: 72ff2649b50bcb64ebd8134cff1f309f, type: 2}
    - target: {fileID: -4579502252303831533, guid: 675f54bed0844fe4e83285b4ff6c9135,
        type: 3}
      propertyPath: m_Materials.Array.data[0]
      value: 
      objectReference: {fileID: 2100000, guid: 72ff2649b50bcb64ebd8134cff1f309f, type: 2}
    - target: {fileID: -3802506340951692793, guid: 675f54bed0844fe4e83285b4ff6c9135,
        type: 3}
      propertyPath: m_Materials.Array.data[0]
      value: 
      objectReference: {fileID: 2100000, guid: 72ff2649b50bcb64ebd8134cff1f309f, type: 2}
    - target: {fileID: -1323452568262623700, guid: 675f54bed0844fe4e83285b4ff6c9135,
        type: 3}
      propertyPath: m_IsActive
      value: 1
      objectReference: {fileID: 0}
    - target: {fileID: -541067440093374581, guid: 675f54bed0844fe4e83285b4ff6c9135,
        type: 3}
      propertyPath: m_Materials.Array.data[0]
      value: 
      objectReference: {fileID: 2100000, guid: 72ff2649b50bcb64ebd8134cff1f309f, type: 2}
    - target: {fileID: -293077114229572877, guid: 675f54bed0844fe4e83285b4ff6c9135,
        type: 3}
      propertyPath: m_Materials.Array.data[0]
      value: 
      objectReference: {fileID: 2100000, guid: 72ff2649b50bcb64ebd8134cff1f309f, type: 2}
    - target: {fileID: -264885249446196901, guid: 675f54bed0844fe4e83285b4ff6c9135,
        type: 3}
      propertyPath: m_Materials.Array.data[0]
      value: 
      objectReference: {fileID: 2100000, guid: 72ff2649b50bcb64ebd8134cff1f309f, type: 2}
    - target: {fileID: 222875849950588970, guid: 675f54bed0844fe4e83285b4ff6c9135,
        type: 3}
      propertyPath: m_IsActive
      value: 0
      objectReference: {fileID: 0}
    - target: {fileID: 919132149155446097, guid: 675f54bed0844fe4e83285b4ff6c9135,
        type: 3}
      propertyPath: m_Name
      value: PicoNeo4
      objectReference: {fileID: 0}
    - target: {fileID: 2108932603885306630, guid: 675f54bed0844fe4e83285b4ff6c9135,
        type: 3}
      propertyPath: m_Materials.Array.data[0]
      value: 
      objectReference: {fileID: 2100000, guid: 72ff2649b50bcb64ebd8134cff1f309f, type: 2}
    - target: {fileID: 2545228181402026268, guid: 675f54bed0844fe4e83285b4ff6c9135,
        type: 3}
      propertyPath: m_Mesh
      value: 
      objectReference: {fileID: -1400252653696632910, guid: b6b6e82f462f28a42aad856bd2159f95,
        type: 3}
    - target: {fileID: 2545228181402026268, guid: 675f54bed0844fe4e83285b4ff6c9135,
        type: 3}
      propertyPath: m_Materials.Array.data[0]
      value: 
      objectReference: {fileID: 2100000, guid: 98f191acca91cc14ebcd02c5c1277539, type: 2}
    - target: {fileID: 3380123038142395292, guid: 675f54bed0844fe4e83285b4ff6c9135,
        type: 3}
      propertyPath: m_Materials.Array.data[0]
      value: 
      objectReference: {fileID: 2100000, guid: 72ff2649b50bcb64ebd8134cff1f309f, type: 2}
    - target: {fileID: 3723094731882504606, guid: 675f54bed0844fe4e83285b4ff6c9135,
        type: 3}
      propertyPath: m_Materials.Array.data[0]
      value: 
      objectReference: {fileID: 2100000, guid: 72ff2649b50bcb64ebd8134cff1f309f, type: 2}
    - target: {fileID: 5406617218613826633, guid: 675f54bed0844fe4e83285b4ff6c9135,
        type: 3}
      propertyPath: m_Materials.Array.data[0]
      value: 
      objectReference: {fileID: 2100000, guid: 72ff2649b50bcb64ebd8134cff1f309f, type: 2}
    - target: {fileID: 5866666021909216657, guid: 675f54bed0844fe4e83285b4ff6c9135,
        type: 3}
      propertyPath: m_Controller
      value: 
      objectReference: {fileID: 9100000, guid: b786e06512769574bbdefbc0d4292c4f, type: 2}
    m_RemovedComponents: []
  m_SourcePrefab: {fileID: 100100000, guid: 675f54bed0844fe4e83285b4ff6c9135, type: 3}
--- !u!4 &569975141841178156 stripped
Transform:
  m_CorrespondingSourceObject: {fileID: 2301580277117765421, guid: 675f54bed0844fe4e83285b4ff6c9135,
    type: 3}
  m_PrefabInstance: {fileID: 1736188570833078529}
  m_PrefabAsset: {fileID: 0}
--- !u!1 &999152842883054646 stripped
GameObject:
  m_CorrespondingSourceObject: {fileID: -7654542143007689417, guid: 675f54bed0844fe4e83285b4ff6c9135,
    type: 3}
  m_PrefabInstance: {fileID: 1736188570833078529}
  m_PrefabAsset: {fileID: 0}
--- !u!114 &2083155101021641435
MonoBehaviour:
  m_ObjectHideFlags: 0
  m_CorrespondingSourceObject: {fileID: 0}
  m_PrefabInstance: {fileID: 0}
  m_PrefabAsset: {fileID: 0}
  m_GameObject: {fileID: 999152842883054646}
  m_Enabled: 1
  m_EditorHideFlags: 0
  m_Script: {fileID: 11500000, guid: 7fbc17ab92734d1fbb0edb12e8e31bbd, type: 3}
  m_Name: 
  m_EditorClassIdentifier: 
  PrimaryInputFeatureName: Grip
  LayerIndex: 3
  AnimatorParameterName: Grip
--- !u!4 &1155139883821764049 stripped
Transform:
  m_CorrespondingSourceObject: {fileID: 585414989688095952, guid: 675f54bed0844fe4e83285b4ff6c9135,
    type: 3}
  m_PrefabInstance: {fileID: 1736188570833078529}
  m_PrefabAsset: {fileID: 0}
--- !u!1 &2066518888731482848 stripped
GameObject:
  m_CorrespondingSourceObject: {fileID: -8884034485224418335, guid: 675f54bed0844fe4e83285b4ff6c9135,
    type: 3}
  m_PrefabInstance: {fileID: 1736188570833078529}
  m_PrefabAsset: {fileID: 0}
--- !u!114 &5783199094647514597
MonoBehaviour:
  m_ObjectHideFlags: 0
  m_CorrespondingSourceObject: {fileID: 0}
  m_PrefabInstance: {fileID: 0}
  m_PrefabAsset: {fileID: 0}
  m_GameObject: {fileID: 2066518888731482848}
  m_Enabled: 1
  m_EditorHideFlags: 0
  m_Script: {fileID: 11500000, guid: 7fbc17ab92734d1fbb0edb12e8e31bbd, type: 3}
  m_Name: 
  m_EditorClassIdentifier: 
  PrimaryInputFeatureName: Trigger
  LayerIndex: 0
  AnimatorParameterName: Trigger
--- !u!4 &2275047007295123178 stripped
Transform:
  m_CorrespondingSourceObject: {fileID: -8679921383154817045, guid: 675f54bed0844fe4e83285b4ff6c9135,
    type: 3}
  m_PrefabInstance: {fileID: 1736188570833078529}
  m_PrefabAsset: {fileID: 0}
--- !u!4 &4049835994127453517 stripped
Transform:
  m_CorrespondingSourceObject: {fileID: -6905207697284037556, guid: 675f54bed0844fe4e83285b4ff6c9135,
    type: 3}
  m_PrefabInstance: {fileID: 1736188570833078529}
  m_PrefabAsset: {fileID: 0}
--- !u!4 &4667027622624635019 stripped
Transform:
  m_CorrespondingSourceObject: {fileID: -2820182818579848822, guid: 675f54bed0844fe4e83285b4ff6c9135,
    type: 3}
  m_PrefabInstance: {fileID: 1736188570833078529}
  m_PrefabAsset: {fileID: 0}
--- !u!1 &4837935148142064364 stripped
GameObject:
  m_CorrespondingSourceObject: {fileID: 6574096759901600749, guid: 675f54bed0844fe4e83285b4ff6c9135,
    type: 3}
  m_PrefabInstance: {fileID: 1736188570833078529}
  m_PrefabAsset: {fileID: 0}
--- !u!114 &364435756571119161
MonoBehaviour:
  m_ObjectHideFlags: 0
  m_CorrespondingSourceObject: {fileID: 0}
  m_PrefabInstance: {fileID: 0}
  m_PrefabAsset: {fileID: 0}
  m_GameObject: {fileID: 4837935148142064364}
  m_Enabled: 1
  m_EditorHideFlags: 0
  m_Script: {fileID: 11500000, guid: 42a14b2b31e04e42ace502a2acb818ea, type: 3}
  m_Name: 
  m_EditorClassIdentifier: 
  PrimaryInputFeatureName: SecondaryButton
  LayerIndex: 5
  AnimatorParameterName: ButtonB
--- !u!4 &5272386161311850998 stripped
Transform:
  m_CorrespondingSourceObject: {fileID: -3372236204497639177, guid: 675f54bed0844fe4e83285b4ff6c9135,
    type: 3}
  m_PrefabInstance: {fileID: 1736188570833078529}
  m_PrefabAsset: {fileID: 0}
--- !u!95 &5292499115213190288 stripped
Animator:
  m_CorrespondingSourceObject: {fileID: 5866666021909216657, guid: 675f54bed0844fe4e83285b4ff6c9135,
    type: 3}
  m_PrefabInstance: {fileID: 1736188570833078529}
  m_PrefabAsset: {fileID: 0}
--- !u!4 &5867071309849803803 stripped
Transform:
  m_CorrespondingSourceObject: {fileID: 5292899490261562650, guid: 675f54bed0844fe4e83285b4ff6c9135,
    type: 3}
  m_PrefabInstance: {fileID: 1736188570833078529}
  m_PrefabAsset: {fileID: 0}
--- !u!4 &6159688586476261104 stripped
Transform:
  m_CorrespondingSourceObject: {fileID: 5576496941487572977, guid: 675f54bed0844fe4e83285b4ff6c9135,
    type: 3}
  m_PrefabInstance: {fileID: 1736188570833078529}
  m_PrefabAsset: {fileID: 0}
--- !u!1 &6229853736685181068 stripped
GameObject:
  m_CorrespondingSourceObject: {fileID: 5651116727692153229, guid: 675f54bed0844fe4e83285b4ff6c9135,
    type: 3}
  m_PrefabInstance: {fileID: 1736188570833078529}
  m_PrefabAsset: {fileID: 0}
--- !u!114 &3907050647465856933
MonoBehaviour:
  m_ObjectHideFlags: 0
  m_CorrespondingSourceObject: {fileID: 0}
  m_PrefabInstance: {fileID: 0}
  m_PrefabAsset: {fileID: 0}
  m_GameObject: {fileID: 6229853736685181068}
  m_Enabled: 1
  m_EditorHideFlags: 0
  m_Script: {fileID: 11500000, guid: fb959ab8eca546139141a13f20354e8e, type: 3}
  m_Name: 
  m_EditorClassIdentifier: 
  PrimaryInputFeatureName: Primary2DAxis
  LayerIndex: 2
  AnimatorParameterXName: AxisX
  AnimatorParameterYName: AxisY
  InvertedX: 1
  InvertedY: 0
--- !u!114 &5390190330807547659
MonoBehaviour:
  m_ObjectHideFlags: 0
  m_CorrespondingSourceObject: {fileID: 0}
  m_PrefabInstance: {fileID: 0}
  m_PrefabAsset: {fileID: 0}
  m_GameObject: {fileID: 6229853736685181068}
  m_Enabled: 1
  m_EditorHideFlags: 0
  m_Script: {fileID: 11500000, guid: 42a14b2b31e04e42ace502a2acb818ea, type: 3}
  m_Name: 
  m_EditorClassIdentifier: 
  PrimaryInputFeatureName: Primary2DAxisTouch
  LayerIndex: 2
  AnimatorParameterName: 
--- !u!1 &6498554000726747887 stripped
GameObject:
  m_CorrespondingSourceObject: {fileID: 4771473785848833006, guid: 675f54bed0844fe4e83285b4ff6c9135,
    type: 3}
  m_PrefabInstance: {fileID: 1736188570833078529}
  m_PrefabAsset: {fileID: 0}
--- !u!114 &8509370704251925384
MonoBehaviour:
  m_ObjectHideFlags: 0
  m_CorrespondingSourceObject: {fileID: 0}
  m_PrefabInstance: {fileID: 0}
  m_PrefabAsset: {fileID: 0}
  m_GameObject: {fileID: 6498554000726747887}
  m_Enabled: 1
  m_EditorHideFlags: 0
  m_Script: {fileID: 11500000, guid: 42a14b2b31e04e42ace502a2acb818ea, type: 3}
  m_Name: 
  m_EditorClassIdentifier: 
  PrimaryInputFeatureName: PrimaryButton
  LayerIndex: 4
  AnimatorParameterName: ButtonA
