%YAML 1.1
%TAG !u! tag:unity3d.com,2011:
--- !u!1 &2413152349034369853
GameObject:
  m_ObjectHideFlags: 0
  m_CorrespondingSourceObject: {fileID: 0}
  m_PrefabInstance: {fileID: 0}
  m_PrefabAsset: {fileID: 0}
  serializedVersion: 6
  m_Component:
  - component: {fileID: 2413152349034369854}
  m_Layer: 0
  m_Name: OpenXRAnchor
  m_TagString: Untagged
  m_Icon: {fileID: 0}
  m_NavMeshLayer: 0
  m_StaticEditorFlags: 0
  m_IsActive: 1
--- !u!4 &2413152349034369854
Transform:
  m_ObjectHideFlags: 0
  m_CorrespondingSourceObject: {fileID: 0}
  m_PrefabInstance: {fileID: 0}
  m_PrefabAsset: {fileID: 0}
  m_GameObject: {fileID: 2413152349034369853}
  m_LocalRotation: {x: -7.119407e-17, y: -0.98388505, z: -0.17880227, w: 4.9297106e-17}
  m_LocalPosition: {x: -0.007999986, y: -0.0018294156, z: -0.1019482}
  m_LocalScale: {x: 1, y: 1, z: 1}
  m_ConstrainProportionsScale: 0
  m_Children: []
  m_Father: {fileID: 2413152349958661124}
  m_RootOrder: 1
  m_LocalEulerAnglesHint: {x: 0, y: 0, z: 0}
--- !u!1 &2413152349746972506
GameObject:
  m_ObjectHideFlags: 0
  m_CorrespondingSourceObject: {fileID: 0}
  m_PrefabInstance: {fileID: 0}
  m_PrefabAsset: {fileID: 0}
  serializedVersion: 6
  m_Component:
  - component: {fileID: 2413152349746972507}
  m_Layer: 0
  m_Name: PointerAnchor
  m_TagString: Untagged
  m_Icon: {fileID: 0}
  m_NavMeshLayer: 0
  m_StaticEditorFlags: 0
  m_IsActive: 1
--- !u!4 &2413152349746972507
Transform:
  m_ObjectHideFlags: 0
  m_CorrespondingSourceObject: {fileID: 0}
  m_PrefabInstance: {fileID: 0}
  m_PrefabAsset: {fileID: 0}
  m_GameObject: {fileID: 2413152349746972506}
  m_LocalRotation: {x: 0, y: 0, z: 0, w: 1}
  m_LocalPosition: {x: 0, y: 0, z: 0.0457}
  m_LocalScale: {x: 1, y: 1, z: 1}
  m_ConstrainProportionsScale: 0
  m_Children: []
  m_Father: {fileID: 2413152349958661124}
  m_RootOrder: 2
  m_LocalEulerAnglesHint: {x: 0, y: 0, z: 0}
--- !u!1 &2413152349958661177
GameObject:
  m_ObjectHideFlags: 0
  m_CorrespondingSourceObject: {fileID: 0}
  m_PrefabInstance: {fileID: 0}
  m_PrefabAsset: {fileID: 0}
  serializedVersion: 6
  m_Component:
  - component: {fileID: 2413152349958661124}
  - component: {fileID: 2413152349958661179}
  - component: {fileID: 2413152349958661178}
  m_Layer: 0
  m_Name: HTCViveFocus1Left
  m_TagString: Untagged
  m_Icon: {fileID: 0}
  m_NavMeshLayer: 0
  m_StaticEditorFlags: 0
  m_IsActive: 1
--- !u!4 &2413152349958661124
Transform:
  m_ObjectHideFlags: 0
  m_CorrespondingSourceObject: {fileID: 0}
  m_PrefabInstance: {fileID: 0}
  m_PrefabAsset: {fileID: 0}
  m_GameObject: {fileID: 2413152349958661177}
  m_LocalRotation: {x: 0, y: 0, z: 0, w: 1}
  m_LocalPosition: {x: -0.03906902, y: 0.08980656, z: -0.056722894}
  m_LocalScale: {x: 1, y: 1, z: 1}
  m_ConstrainProportionsScale: 0
  m_Children:
  - {fileID: 2807858285607270967}
  - {fileID: 2413152349034369854}
  - {fileID: 2413152349746972507}
  - {fileID: 6085656750798635453}
  m_Father: {fileID: 0}
  m_RootOrder: 0
  m_LocalEulerAnglesHint: {x: 0, y: 0, z: 0}
--- !u!114 &2413152349958661179
MonoBehaviour:
  m_ObjectHideFlags: 0
  m_CorrespondingSourceObject: {fileID: 0}
  m_PrefabInstance: {fileID: 0}
  m_PrefabAsset: {fileID: 0}
  m_GameObject: {fileID: 2413152349958661177}
  m_Enabled: 1
  m_EditorHideFlags: 0
  m_Script: {fileID: 11500000, guid: 926d2692cbf74cefb9bde63d562cf607, type: 3}
  m_Name: 
  m_EditorClassIdentifier: 
  InputDeviceHandler: {fileID: 8077110202911940685}
  CustomPointerAnchor: {fileID: 2413152349746972507}
  PlatformOffsetInfos:
  - Name: Varwin OpenXR Display
    AngleOffset: {x: 0, y: 180, z: 0}
    Anchor: {fileID: 2413152349034369854}
    IsDesktopOnly: 0
  _controlTooltipHandlers:
  - {fileID: 3109001277877227777}
  - {fileID: 6449371746509072813}
  - {fileID: 4460432146172515294}
  - {fileID: 308511967652660426}
  - {fileID: 36092741471812954}
  - {fileID: 4591706401212722160}
  - {fileID: 1880433000478775030}
  - {fileID: 3359181024883392272}
  TeleportOnThumbstick: 0
  Is3Dof: 1
  GrabAnchor: {fileID: 5350788671230731486}
--- !u!114 &2413152349958661178
MonoBehaviour:
  m_ObjectHideFlags: 0
  m_CorrespondingSourceObject: {fileID: 0}
  m_PrefabInstance: {fileID: 0}
  m_PrefabAsset: {fileID: 0}
  m_GameObject: {fileID: 2413152349958661177}
  m_Enabled: 1
  m_EditorHideFlags: 0
  m_Script: {fileID: 11500000, guid: e92dc823f4034a4dabdef690e2c1a7c0, type: 3}
  m_Name: 
  m_EditorClassIdentifier: 
  Animator: {fileID: 8077110202911940685}
  Indicators:
  - {fileID: 2413152349916232040}
  - {fileID: 2413152348680445348}
  - {fileID: 2413152348680445403}
  TimeSwitching: 0.05
--- !u!1 &2550630137678953527
GameObject:
  m_ObjectHideFlags: 0
  m_CorrespondingSourceObject: {fileID: 0}
  m_PrefabInstance: {fileID: 0}
  m_PrefabAsset: {fileID: 0}
  serializedVersion: 6
  m_Component:
  - component: {fileID: 3298474804640716411}
  - component: {fileID: 6449371746509072813}
  m_Layer: 0
  m_Name: Tooltip
  m_TagString: Untagged
  m_Icon: {fileID: 0}
  m_NavMeshLayer: 0
  m_StaticEditorFlags: 0
  m_IsActive: 1
--- !u!4 &3298474804640716411
Transform:
  m_ObjectHideFlags: 0
  m_CorrespondingSourceObject: {fileID: 0}
  m_PrefabInstance: {fileID: 0}
  m_PrefabAsset: {fileID: 0}
  m_GameObject: {fileID: 2550630137678953527}
  m_LocalRotation: {x: 0, y: 0, z: 0, w: 1}
  m_LocalPosition: {x: 0, y: 0, z: 0}
  m_LocalScale: {x: 1, y: 1, z: 1}
  m_ConstrainProportionsScale: 0
  m_Children: []
  m_Father: {fileID: 670870018684489085}
  m_RootOrder: 0
  m_LocalEulerAnglesHint: {x: 0, y: 0, z: 0}
--- !u!114 &6449371746509072813
MonoBehaviour:
  m_ObjectHideFlags: 0
  m_CorrespondingSourceObject: {fileID: 0}
  m_PrefabInstance: {fileID: 0}
  m_PrefabAsset: {fileID: 0}
  m_GameObject: {fileID: 2550630137678953527}
  m_Enabled: 1
  m_EditorHideFlags: 0
  m_Script: {fileID: 11500000, guid: b46c4909cebc470fbcfc052ab0ba2827, type: 3}
  m_Name: 
  m_EditorClassIdentifier: 
  Type: 8
--- !u!1 &2830020771503755435
GameObject:
  m_ObjectHideFlags: 0
  m_CorrespondingSourceObject: {fileID: 0}
  m_PrefabInstance: {fileID: 0}
  m_PrefabAsset: {fileID: 0}
  serializedVersion: 6
  m_Component:
  - component: {fileID: 903393573392427108}
  - component: {fileID: 4591706401212722160}
  - component: {fileID: 1880433000478775030}
  - component: {fileID: 3359181024883392272}
  m_Layer: 0
  m_Name: Tooltip
  m_TagString: Untagged
  m_Icon: {fileID: 0}
  m_NavMeshLayer: 0
  m_StaticEditorFlags: 0
  m_IsActive: 1
--- !u!4 &903393573392427108
Transform:
  m_ObjectHideFlags: 0
  m_CorrespondingSourceObject: {fileID: 0}
  m_PrefabInstance: {fileID: 0}
  m_PrefabAsset: {fileID: 0}
  m_GameObject: {fileID: 2830020771503755435}
  m_LocalRotation: {x: 0, y: 0, z: 0, w: 1}
  m_LocalPosition: {x: 1.2098041e-18, y: 0, z: 0}
  m_LocalScale: {x: 1, y: 1, z: 1}
  m_ConstrainProportionsScale: 0
  m_Children: []
  m_Father: {fileID: 5446751902705926379}
  m_RootOrder: 0
  m_LocalEulerAnglesHint: {x: 0, y: 0, z: 0}
--- !u!114 &4591706401212722160
MonoBehaviour:
  m_ObjectHideFlags: 0
  m_CorrespondingSourceObject: {fileID: 0}
  m_PrefabInstance: {fileID: 0}
  m_PrefabAsset: {fileID: 0}
  m_GameObject: {fileID: 2830020771503755435}
  m_Enabled: 1
  m_EditorHideFlags: 0
  m_Script: {fileID: 11500000, guid: b46c4909cebc470fbcfc052ab0ba2827, type: 3}
  m_Name: 
  m_EditorClassIdentifier: 
  Type: 4
--- !u!114 &1880433000478775030
MonoBehaviour:
  m_ObjectHideFlags: 0
  m_CorrespondingSourceObject: {fileID: 0}
  m_PrefabInstance: {fileID: 0}
  m_PrefabAsset: {fileID: 0}
  m_GameObject: {fileID: 2830020771503755435}
  m_Enabled: 1
  m_EditorHideFlags: 0
  m_Script: {fileID: 11500000, guid: b46c4909cebc470fbcfc052ab0ba2827, type: 3}
  m_Name: 
  m_EditorClassIdentifier: 
  Type: 2
--- !u!114 &3359181024883392272
MonoBehaviour:
  m_ObjectHideFlags: 0
  m_CorrespondingSourceObject: {fileID: 0}
  m_PrefabInstance: {fileID: 0}
  m_PrefabAsset: {fileID: 0}
  m_GameObject: {fileID: 2830020771503755435}
  m_Enabled: 1
  m_EditorHideFlags: 0
  m_Script: {fileID: 11500000, guid: b46c4909cebc470fbcfc052ab0ba2827, type: 3}
  m_Name: 
  m_EditorClassIdentifier: 
  Type: 3
--- !u!1 &4813949327493659313
GameObject:
  m_ObjectHideFlags: 0
  m_CorrespondingSourceObject: {fileID: 0}
  m_PrefabInstance: {fileID: 0}
  m_PrefabAsset: {fileID: 0}
  serializedVersion: 6
  m_Component:
  - component: {fileID: 7460232241929234686}
  - component: {fileID: 308511967652660426}
  - component: {fileID: 36092741471812954}
  m_Layer: 0
  m_Name: Tooltip
  m_TagString: Untagged
  m_Icon: {fileID: 0}
  m_NavMeshLayer: 0
  m_StaticEditorFlags: 0
  m_IsActive: 1
--- !u!4 &7460232241929234686
Transform:
  m_ObjectHideFlags: 0
  m_CorrespondingSourceObject: {fileID: 0}
  m_PrefabInstance: {fileID: 0}
  m_PrefabAsset: {fileID: 0}
  m_GameObject: {fileID: 4813949327493659313}
  m_LocalRotation: {x: 0, y: 0, z: 0, w: 1}
  m_LocalPosition: {x: 0, y: 0.00127, z: 0}
  m_LocalScale: {x: 1, y: 1, z: 1}
  m_ConstrainProportionsScale: 0
  m_Children: []
  m_Father: {fileID: 1824414222305416597}
  m_RootOrder: 0
  m_LocalEulerAnglesHint: {x: 0, y: 0, z: 0}
--- !u!114 &308511967652660426
MonoBehaviour:
  m_ObjectHideFlags: 0
  m_CorrespondingSourceObject: {fileID: 0}
  m_PrefabInstance: {fileID: 0}
  m_PrefabAsset: {fileID: 0}
  m_GameObject: {fileID: 4813949327493659313}
  m_Enabled: 1
  m_EditorHideFlags: 0
  m_Script: {fileID: 11500000, guid: b46c4909cebc470fbcfc052ab0ba2827, type: 3}
  m_Name: 
  m_EditorClassIdentifier: 
  Type: 7
--- !u!114 &36092741471812954
MonoBehaviour:
  m_ObjectHideFlags: 0
  m_CorrespondingSourceObject: {fileID: 0}
  m_PrefabInstance: {fileID: 0}
  m_PrefabAsset: {fileID: 0}
  m_GameObject: {fileID: 4813949327493659313}
  m_Enabled: 1
  m_EditorHideFlags: 0
  m_Script: {fileID: 11500000, guid: b46c4909cebc470fbcfc052ab0ba2827, type: 3}
  m_Name: 
  m_EditorClassIdentifier: 
  Type: 9
--- !u!1 &5350788671230731486
GameObject:
  m_ObjectHideFlags: 0
  m_CorrespondingSourceObject: {fileID: 0}
  m_PrefabInstance: {fileID: 0}
  m_PrefabAsset: {fileID: 0}
  serializedVersion: 6
  m_Component:
  - component: {fileID: 6085656750798635453}
  m_Layer: 0
  m_Name: GrabAnchor
  m_TagString: Untagged
  m_Icon: {fileID: 0}
  m_NavMeshLayer: 0
  m_StaticEditorFlags: 0
  m_IsActive: 1
--- !u!4 &6085656750798635453
Transform:
  m_ObjectHideFlags: 0
  m_CorrespondingSourceObject: {fileID: 0}
  m_PrefabInstance: {fileID: 0}
  m_PrefabAsset: {fileID: 0}
  m_GameObject: {fileID: 5350788671230731486}
  m_LocalRotation: {x: 0, y: 0, z: 0, w: 1}
  m_LocalPosition: {x: 0, y: 0, z: -0.0072}
  m_LocalScale: {x: 1, y: 1, z: 1}
  m_ConstrainProportionsScale: 0
  m_Children: []
  m_Father: {fileID: 2413152349958661124}
  m_RootOrder: 3
  m_LocalEulerAnglesHint: {x: 0, y: 0, z: 0}
--- !u!1 &8533834673303581462
GameObject:
  m_ObjectHideFlags: 0
  m_CorrespondingSourceObject: {fileID: 0}
  m_PrefabInstance: {fileID: 0}
  m_PrefabAsset: {fileID: 0}
  serializedVersion: 6
  m_Component:
  - component: {fileID: 6686497497724238250}
  - component: {fileID: 3109001277877227777}
  m_Layer: 0
  m_Name: Tooltip
  m_TagString: Untagged
  m_Icon: {fileID: 0}
  m_NavMeshLayer: 0
  m_StaticEditorFlags: 0
  m_IsActive: 1
--- !u!4 &6686497497724238250
Transform:
  m_ObjectHideFlags: 0
  m_CorrespondingSourceObject: {fileID: 0}
  m_PrefabInstance: {fileID: 0}
  m_PrefabAsset: {fileID: 0}
  m_GameObject: {fileID: 8533834673303581462}
  m_LocalRotation: {x: 0, y: 0, z: 0, w: 1}
  m_LocalPosition: {x: 0, y: -0.0018189568, z: -0.0000000011641532}
  m_LocalScale: {x: 1, y: 1, z: 1}
  m_ConstrainProportionsScale: 0
  m_Children: []
  m_Father: {fileID: 4904806600646347522}
  m_RootOrder: 0
  m_LocalEulerAnglesHint: {x: 0, y: 0, z: 0}
--- !u!114 &3109001277877227777
MonoBehaviour:
  m_ObjectHideFlags: 0
  m_CorrespondingSourceObject: {fileID: 0}
  m_PrefabInstance: {fileID: 0}
  m_PrefabAsset: {fileID: 0}
  m_GameObject: {fileID: 8533834673303581462}
  m_Enabled: 1
  m_EditorHideFlags: 0
  m_Script: {fileID: 11500000, guid: b46c4909cebc470fbcfc052ab0ba2827, type: 3}
  m_Name: 
  m_EditorClassIdentifier: 
  Type: 5
--- !u!1 &9081764030925714864
GameObject:
  m_ObjectHideFlags: 0
  m_CorrespondingSourceObject: {fileID: 0}
  m_PrefabInstance: {fileID: 0}
  m_PrefabAsset: {fileID: 0}
  serializedVersion: 6
  m_Component:
  - component: {fileID: 777770115119001977}
  - component: {fileID: 4460432146172515294}
  m_Layer: 0
  m_Name: Tooltip
  m_TagString: Untagged
  m_Icon: {fileID: 0}
  m_NavMeshLayer: 0
  m_StaticEditorFlags: 0
  m_IsActive: 1
--- !u!4 &777770115119001977
Transform:
  m_ObjectHideFlags: 0
  m_CorrespondingSourceObject: {fileID: 0}
  m_PrefabInstance: {fileID: 0}
  m_PrefabAsset: {fileID: 0}
  m_GameObject: {fileID: 9081764030925714864}
  m_LocalRotation: {x: 0, y: 0, z: 0, w: 1}
  m_LocalPosition: {x: -1.1246006e-18, y: -0.0065498115, z: -0.006873235}
  m_LocalScale: {x: 1, y: 1, z: 1}
  m_ConstrainProportionsScale: 0
  m_Children: []
  m_Father: {fileID: 106263628689976154}
  m_RootOrder: 0
  m_LocalEulerAnglesHint: {x: 0, y: 0, z: 0}
--- !u!114 &4460432146172515294
MonoBehaviour:
  m_ObjectHideFlags: 0
  m_CorrespondingSourceObject: {fileID: 0}
  m_PrefabInstance: {fileID: 0}
  m_PrefabAsset: {fileID: 0}
  m_GameObject: {fileID: 9081764030925714864}
  m_Enabled: 1
  m_EditorHideFlags: 0
  m_Script: {fileID: 11500000, guid: b46c4909cebc470fbcfc052ab0ba2827, type: 3}
  m_Name: 
  m_EditorClassIdentifier: 
  Type: 1
--- !u!1001 &2413152348680445404
PrefabInstance:
  m_ObjectHideFlags: 0
  serializedVersion: 2
  m_Modification:
    m_TransformParent: {fileID: 2413152349958661124}
    m_Modifications:
    - target: {fileID: -8679921383154817045, guid: 550fcebf7fecc064c9d68429983cf6a7,
        type: 3}
      propertyPath: m_RootOrder
      value: 0
      objectReference: {fileID: 0}
    - target: {fileID: -8679921383154817045, guid: 550fcebf7fecc064c9d68429983cf6a7,
        type: 3}
      propertyPath: m_LocalPosition.x
      value: 0
      objectReference: {fileID: 0}
    - target: {fileID: -8679921383154817045, guid: 550fcebf7fecc064c9d68429983cf6a7,
        type: 3}
      propertyPath: m_LocalPosition.y
      value: 0
      objectReference: {fileID: 0}
    - target: {fileID: -8679921383154817045, guid: 550fcebf7fecc064c9d68429983cf6a7,
        type: 3}
      propertyPath: m_LocalPosition.z
      value: 0
      objectReference: {fileID: 0}
    - target: {fileID: -8679921383154817045, guid: 550fcebf7fecc064c9d68429983cf6a7,
        type: 3}
      propertyPath: m_LocalRotation.w
      value: 1
      objectReference: {fileID: 0}
    - target: {fileID: -8679921383154817045, guid: 550fcebf7fecc064c9d68429983cf6a7,
        type: 3}
      propertyPath: m_LocalRotation.x
      value: -0
      objectReference: {fileID: 0}
    - target: {fileID: -8679921383154817045, guid: 550fcebf7fecc064c9d68429983cf6a7,
        type: 3}
      propertyPath: m_LocalRotation.y
      value: -0
      objectReference: {fileID: 0}
    - target: {fileID: -8679921383154817045, guid: 550fcebf7fecc064c9d68429983cf6a7,
        type: 3}
      propertyPath: m_LocalRotation.z
      value: -0
      objectReference: {fileID: 0}
    - target: {fileID: -8679921383154817045, guid: 550fcebf7fecc064c9d68429983cf6a7,
        type: 3}
      propertyPath: m_LocalEulerAnglesHint.x
      value: 0
      objectReference: {fileID: 0}
    - target: {fileID: -8679921383154817045, guid: 550fcebf7fecc064c9d68429983cf6a7,
        type: 3}
      propertyPath: m_LocalEulerAnglesHint.y
      value: 0
      objectReference: {fileID: 0}
    - target: {fileID: -8679921383154817045, guid: 550fcebf7fecc064c9d68429983cf6a7,
        type: 3}
      propertyPath: m_LocalEulerAnglesHint.z
      value: 0
      objectReference: {fileID: 0}
    - target: {fileID: -7612831858606822100, guid: 550fcebf7fecc064c9d68429983cf6a7,
        type: 3}
      propertyPath: m_Materials.Array.data[0]
      value: 
      objectReference: {fileID: 2100000, guid: 0bc3ab6fb8f74704b83518e2df7d80e6, type: 2}
    - target: {fileID: -5544015876230440735, guid: 550fcebf7fecc064c9d68429983cf6a7,
        type: 3}
      propertyPath: m_Materials.Array.data[0]
      value: 
      objectReference: {fileID: 2100000, guid: 0bc3ab6fb8f74704b83518e2df7d80e6, type: 2}
    - target: {fileID: -3035666135846152248, guid: 550fcebf7fecc064c9d68429983cf6a7,
        type: 3}
      propertyPath: m_Materials.Array.data[0]
      value: 
      objectReference: {fileID: 2100000, guid: 0bc3ab6fb8f74704b83518e2df7d80e6, type: 2}
    - target: {fileID: -2613384300963852269, guid: 550fcebf7fecc064c9d68429983cf6a7,
        type: 3}
      propertyPath: m_Materials.Array.data[0]
      value: 
      objectReference: {fileID: 2100000, guid: 0bc3ab6fb8f74704b83518e2df7d80e6, type: 2}
    - target: {fileID: -432912430749734656, guid: 550fcebf7fecc064c9d68429983cf6a7,
        type: 3}
      propertyPath: m_Materials.Array.data[0]
      value: 
      objectReference: {fileID: 2100000, guid: 0bc3ab6fb8f74704b83518e2df7d80e6, type: 2}
    - target: {fileID: 919132149155446097, guid: 550fcebf7fecc064c9d68429983cf6a7,
        type: 3}
      propertyPath: m_Name
      value: HTC_Vive_Focus
      objectReference: {fileID: 0}
    - target: {fileID: 2545228181402026268, guid: 550fcebf7fecc064c9d68429983cf6a7,
        type: 3}
      propertyPath: m_Mesh
      value: 
      objectReference: {fileID: -1400252653696632910, guid: b6b6e82f462f28a42aad856bd2159f95,
        type: 3}
    - target: {fileID: 2545228181402026268, guid: 550fcebf7fecc064c9d68429983cf6a7,
        type: 3}
      propertyPath: m_Materials.Array.data[0]
      value: 
      objectReference: {fileID: 2100000, guid: 98f191acca91cc14ebcd02c5c1277539, type: 2}
    - target: {fileID: 2936196939978631309, guid: 550fcebf7fecc064c9d68429983cf6a7,
        type: 3}
      propertyPath: m_Materials.Array.data[0]
      value: 
      objectReference: {fileID: 2100000, guid: 0bc3ab6fb8f74704b83518e2df7d80e6, type: 2}
    - target: {fileID: 5866666021909216657, guid: 550fcebf7fecc064c9d68429983cf6a7,
        type: 3}
      propertyPath: m_Controller
      value: 
      objectReference: {fileID: 9100000, guid: dedbf094dfbd17546a581dda34a46a20, type: 2}
    m_RemovedComponents: []
  m_SourcePrefab: {fileID: 100100000, guid: 550fcebf7fecc064c9d68429983cf6a7, type: 3}
--- !u!4 &106263628689976154 stripped
Transform:
  m_CorrespondingSourceObject: {fileID: -6916197022934272378, guid: 550fcebf7fecc064c9d68429983cf6a7,
    type: 3}
  m_PrefabInstance: {fileID: 2413152348680445404}
  m_PrefabAsset: {fileID: 0}
--- !u!4 &670870018684489085 stripped
Transform:
  m_CorrespondingSourceObject: {fileID: 2896472054693449889, guid: 550fcebf7fecc064c9d68429983cf6a7,
    type: 3}
  m_PrefabInstance: {fileID: 2413152348680445404}
  m_PrefabAsset: {fileID: 0}
--- !u!1 &1614900859254547900 stripped
GameObject:
  m_CorrespondingSourceObject: {fileID: 3968931865765116000, guid: 550fcebf7fecc064c9d68429983cf6a7,
    type: 3}
  m_PrefabInstance: {fileID: 2413152348680445404}
  m_PrefabAsset: {fileID: 0}
--- !u!114 &2413152349916232040
MonoBehaviour:
  m_ObjectHideFlags: 0
  m_CorrespondingSourceObject: {fileID: 0}
  m_PrefabInstance: {fileID: 0}
  m_PrefabAsset: {fileID: 0}
  m_GameObject: {fileID: 1614900859254547900}
  m_Enabled: 1
  m_EditorHideFlags: 0
  m_Script: {fileID: 11500000, guid: 42a14b2b31e04e42ace502a2acb818ea, type: 3}
  m_Name: 
  m_EditorClassIdentifier: 
  PrimaryInputFeatureName: PrimaryButton
  LayerIndex: 3
  AnimatorParameterName: ButtonA
--- !u!4 &1824414222305416597 stripped
Transform:
  m_CorrespondingSourceObject: {fileID: -5175583376264918967, guid: 550fcebf7fecc064c9d68429983cf6a7,
    type: 3}
  m_PrefabInstance: {fileID: 2413152348680445404}
  m_PrefabAsset: {fileID: 0}
--- !u!4 &2807858285607270967 stripped
Transform:
  m_CorrespondingSourceObject: {fileID: -8679921383154817045, guid: 550fcebf7fecc064c9d68429983cf6a7,
    type: 3}
  m_PrefabInstance: {fileID: 2413152348680445404}
  m_PrefabAsset: {fileID: 0}
--- !u!1 &3675714244128129542 stripped
GameObject:
  m_CorrespondingSourceObject: {fileID: 1333065385731596250, guid: 550fcebf7fecc064c9d68429983cf6a7,
    type: 3}
  m_PrefabInstance: {fileID: 2413152348680445404}
  m_PrefabAsset: {fileID: 0}
--- !u!114 &2413152348680445350
MonoBehaviour:
  m_ObjectHideFlags: 0
  m_CorrespondingSourceObject: {fileID: 0}
  m_PrefabInstance: {fileID: 0}
  m_PrefabAsset: {fileID: 0}
  m_GameObject: {fileID: 3675714244128129542}
  m_Enabled: 1
  m_EditorHideFlags: 0
  m_Script: {fileID: 11500000, guid: 7fbc17ab92734d1fbb0edb12e8e31bbd, type: 3}
  m_Name: 
  m_EditorClassIdentifier: 
  PrimaryInputFeatureName: Trigger
  LayerIndex: 1
  AnimatorParameterName: Trigger
--- !u!4 &4904806600646347522 stripped
Transform:
  m_CorrespondingSourceObject: {fileID: 7308324989134640862, guid: 550fcebf7fecc064c9d68429983cf6a7,
    type: 3}
  m_PrefabInstance: {fileID: 2413152348680445404}
  m_PrefabAsset: {fileID: 0}
--- !u!1 &5224930584668642773 stripped
GameObject:
  m_CorrespondingSourceObject: {fileID: -1585385912714346487, guid: 550fcebf7fecc064c9d68429983cf6a7,
    type: 3}
  m_PrefabInstance: {fileID: 2413152348680445404}
  m_PrefabAsset: {fileID: 0}
--- !u!114 &2413152348680445348
MonoBehaviour:
  m_ObjectHideFlags: 0
  m_CorrespondingSourceObject: {fileID: 0}
  m_PrefabInstance: {fileID: 0}
  m_PrefabAsset: {fileID: 0}
  m_GameObject: {fileID: 5224930584668642773}
  m_Enabled: 1
  m_EditorHideFlags: 0
  m_Script: {fileID: 11500000, guid: fb959ab8eca546139141a13f20354e8e, type: 3}
  m_Name: 
  m_EditorClassIdentifier: 
  PrimaryInputFeatureName: Primary2DAxis
  LayerIndex: 2
  AnimatorParameterXName: AxisX
  AnimatorParameterYName: AxisY
  InvertedX: 0
  InvertedY: 0
--- !u!114 &2413152348680445403
MonoBehaviour:
  m_ObjectHideFlags: 0
  m_CorrespondingSourceObject: {fileID: 0}
  m_PrefabInstance: {fileID: 0}
  m_PrefabAsset: {fileID: 0}
  m_GameObject: {fileID: 5224930584668642773}
  m_Enabled: 1
  m_EditorHideFlags: 0
  m_Script: {fileID: 11500000, guid: 42a14b2b31e04e42ace502a2acb818ea, type: 3}
  m_Name: 
  m_EditorClassIdentifier: 
  PrimaryInputFeatureName: Primary2DAxisTouch
  LayerIndex: 2
  AnimatorParameterName: 
--- !u!4 &5446751902705926379 stripped
Transform:
  m_CorrespondingSourceObject: {fileID: 7704395321975446839, guid: 550fcebf7fecc064c9d68429983cf6a7,
    type: 3}
  m_PrefabInstance: {fileID: 2413152348680445404}
  m_PrefabAsset: {fileID: 0}
--- !u!95 &8077110202911940685 stripped
Animator:
  m_CorrespondingSourceObject: {fileID: 5866666021909216657, guid: 550fcebf7fecc064c9d68429983cf6a7,
    type: 3}
  m_PrefabInstance: {fileID: 2413152348680445404}
  m_PrefabAsset: {fileID: 0}
