%YAML 1.1
%TAG !u! tag:unity3d.com,2011:
--- !u!1 &884783652
GameObject:
  m_ObjectHideFlags: 0
  m_CorrespondingSourceObject: {fileID: 0}
  m_PrefabInstance: {fileID: 0}
  m_PrefabAsset: {fileID: 0}
  serializedVersion: 6
  m_Component:
  - component: {fileID: 884783653}
  m_Layer: 0
  m_Name: PicoXRAnchor
  m_TagString: Untagged
  m_Icon: {fileID: 0}
  m_NavMeshLayer: 0
  m_StaticEditorFlags: 0
  m_IsActive: 1
--- !u!4 &884783653
Transform:
  m_ObjectHideFlags: 0
  m_CorrespondingSourceObject: {fileID: 0}
  m_PrefabInstance: {fileID: 0}
  m_PrefabAsset: {fileID: 0}
  m_GameObject: {fileID: 884783652}
  m_LocalRotation: {x: -0.29237175, y: 0, z: 0, w: 0.9563048}
  m_LocalPosition: {x: 0, y: 0, z: 0}
  m_LocalScale: {x: 1, y: 1, z: 1}
  m_ConstrainProportionsScale: 0
  m_Children: []
  m_Father: {fileID: 8045899690630475010}
  m_RootOrder: 3
  m_LocalEulerAnglesHint: {x: -34, y: 0, z: 0}
--- !u!1 &522621918227422716
GameObject:
  m_ObjectHideFlags: 0
  m_CorrespondingSourceObject: {fileID: 0}
  m_PrefabInstance: {fileID: 0}
  m_PrefabAsset: {fileID: 0}
  serializedVersion: 6
  m_Component:
  - component: {fileID: 5339204900171678189}
  m_Layer: 0
  m_Name: GrabAnchor
  m_TagString: Untagged
  m_Icon: {fileID: 0}
  m_NavMeshLayer: 0
  m_StaticEditorFlags: 0
  m_IsActive: 1
--- !u!4 &5339204900171678189
Transform:
  m_ObjectHideFlags: 0
  m_CorrespondingSourceObject: {fileID: 0}
  m_PrefabInstance: {fileID: 0}
  m_PrefabAsset: {fileID: 0}
  m_GameObject: {fileID: 522621918227422716}
  m_LocalRotation: {x: 0.0071403827, y: -0, z: -0, w: 0.9999745}
  m_LocalPosition: {x: 0, y: 0.009400003, z: -0.0178}
  m_LocalScale: {x: 1, y: 1, z: 1}
  m_ConstrainProportionsScale: 0
  m_Children: []
  m_Father: {fileID: 8045899690630475010}
  m_RootOrder: 4
  m_LocalEulerAnglesHint: {x: 0.818, y: 0, z: 0}
--- !u!1 &2386245806231079677
GameObject:
  m_ObjectHideFlags: 0
  m_CorrespondingSourceObject: {fileID: 0}
  m_PrefabInstance: {fileID: 0}
  m_PrefabAsset: {fileID: 0}
  serializedVersion: 6
  m_Component:
  - component: {fileID: 3564398636978775686}
  - component: {fileID: 3458621549628794457}
  m_Layer: 0
  m_Name: Tooltip
  m_TagString: Untagged
  m_Icon: {fileID: 0}
  m_NavMeshLayer: 0
  m_StaticEditorFlags: 0
  m_IsActive: 1
--- !u!4 &3564398636978775686
Transform:
  m_ObjectHideFlags: 0
  m_CorrespondingSourceObject: {fileID: 0}
  m_PrefabInstance: {fileID: 0}
  m_PrefabAsset: {fileID: 0}
  m_GameObject: {fileID: 2386245806231079677}
  m_LocalRotation: {x: 0, y: 0, z: 0, w: 1}
  m_LocalPosition: {x: 4.4270005e-17, y: -0.0118193645, z: 0.0053389743}
  m_LocalScale: {x: 1, y: 1, z: 1}
  m_ConstrainProportionsScale: 0
  m_Children: []
  m_Father: {fileID: 8229674745394532502}
  m_RootOrder: 0
  m_LocalEulerAnglesHint: {x: 0, y: 0, z: 0}
--- !u!114 &3458621549628794457
MonoBehaviour:
  m_ObjectHideFlags: 0
  m_CorrespondingSourceObject: {fileID: 0}
  m_PrefabInstance: {fileID: 0}
  m_PrefabAsset: {fileID: 0}
  m_GameObject: {fileID: 2386245806231079677}
  m_Enabled: 1
  m_EditorHideFlags: 0
  m_Script: {fileID: 11500000, guid: b46c4909cebc470fbcfc052ab0ba2827, type: 3}
  m_Name: 
  m_EditorClassIdentifier: 
  Type: 1
--- !u!1 &3434550945278217952
GameObject:
  m_ObjectHideFlags: 0
  m_CorrespondingSourceObject: {fileID: 0}
  m_PrefabInstance: {fileID: 0}
  m_PrefabAsset: {fileID: 0}
  serializedVersion: 6
  m_Component:
  - component: {fileID: 5619085986756799898}
  - component: {fileID: 7747647082301375782}
  - component: {fileID: 7801323642251039211}
  m_Layer: 0
  m_Name: Tooltip
  m_TagString: Untagged
  m_Icon: {fileID: 0}
  m_NavMeshLayer: 0
  m_StaticEditorFlags: 0
  m_IsActive: 1
--- !u!4 &5619085986756799898
Transform:
  m_ObjectHideFlags: 0
  m_CorrespondingSourceObject: {fileID: 0}
  m_PrefabInstance: {fileID: 0}
  m_PrefabAsset: {fileID: 0}
  m_GameObject: {fileID: 3434550945278217952}
  m_LocalRotation: {x: 0, y: 0, z: 0, w: 1}
  m_LocalPosition: {x: 0.0010000227, y: 0.0003994253, z: 0.000000016822014}
  m_LocalScale: {x: 1, y: 1, z: 1}
  m_ConstrainProportionsScale: 0
  m_Children: []
  m_Father: {fileID: 4466109425266293376}
  m_RootOrder: 0
  m_LocalEulerAnglesHint: {x: 0, y: 0, z: 0}
--- !u!114 &7747647082301375782
MonoBehaviour:
  m_ObjectHideFlags: 0
  m_CorrespondingSourceObject: {fileID: 0}
  m_PrefabInstance: {fileID: 0}
  m_PrefabAsset: {fileID: 0}
  m_GameObject: {fileID: 3434550945278217952}
  m_Enabled: 1
  m_EditorHideFlags: 0
  m_Script: {fileID: 11500000, guid: b46c4909cebc470fbcfc052ab0ba2827, type: 3}
  m_Name: 
  m_EditorClassIdentifier: 
  Type: 2
--- !u!114 &7801323642251039211
MonoBehaviour:
  m_ObjectHideFlags: 0
  m_CorrespondingSourceObject: {fileID: 0}
  m_PrefabInstance: {fileID: 0}
  m_PrefabAsset: {fileID: 0}
  m_GameObject: {fileID: 3434550945278217952}
  m_Enabled: 1
  m_EditorHideFlags: 0
  m_Script: {fileID: 11500000, guid: b46c4909cebc470fbcfc052ab0ba2827, type: 3}
  m_Name: 
  m_EditorClassIdentifier: 
  Type: 3
--- !u!1 &4045076613602873064
GameObject:
  m_ObjectHideFlags: 0
  m_CorrespondingSourceObject: {fileID: 0}
  m_PrefabInstance: {fileID: 0}
  m_PrefabAsset: {fileID: 0}
  serializedVersion: 6
  m_Component:
  - component: {fileID: 7011917648310461880}
  - component: {fileID: 7072538978499988312}
  - component: {fileID: 6174263115015382562}
  m_Layer: 0
  m_Name: Tooltip
  m_TagString: Untagged
  m_Icon: {fileID: 0}
  m_NavMeshLayer: 0
  m_StaticEditorFlags: 0
  m_IsActive: 1
--- !u!4 &7011917648310461880
Transform:
  m_ObjectHideFlags: 0
  m_CorrespondingSourceObject: {fileID: 0}
  m_PrefabInstance: {fileID: 0}
  m_PrefabAsset: {fileID: 0}
  m_GameObject: {fileID: 4045076613602873064}
  m_LocalRotation: {x: 0, y: 0, z: 0, w: 1}
  m_LocalPosition: {x: 0, y: 0, z: 0}
  m_LocalScale: {x: 1, y: 1, z: 1}
  m_ConstrainProportionsScale: 0
  m_Children: []
  m_Father: {fileID: 1117558479718415934}
  m_RootOrder: 0
  m_LocalEulerAnglesHint: {x: 0, y: 0, z: 0}
--- !u!114 &7072538978499988312
MonoBehaviour:
  m_ObjectHideFlags: 0
  m_CorrespondingSourceObject: {fileID: 0}
  m_PrefabInstance: {fileID: 0}
  m_PrefabAsset: {fileID: 0}
  m_GameObject: {fileID: 4045076613602873064}
  m_Enabled: 1
  m_EditorHideFlags: 0
  m_Script: {fileID: 11500000, guid: b46c4909cebc470fbcfc052ab0ba2827, type: 3}
  m_Name: 
  m_EditorClassIdentifier: 
  Type: 7
--- !u!114 &6174263115015382562
MonoBehaviour:
  m_ObjectHideFlags: 0
  m_CorrespondingSourceObject: {fileID: 0}
  m_PrefabInstance: {fileID: 0}
  m_PrefabAsset: {fileID: 0}
  m_GameObject: {fileID: 4045076613602873064}
  m_Enabled: 1
  m_EditorHideFlags: 0
  m_Script: {fileID: 11500000, guid: b46c4909cebc470fbcfc052ab0ba2827, type: 3}
  m_Name: 
  m_EditorClassIdentifier: 
  Type: 9
--- !u!1 &4207402556183739140
GameObject:
  m_ObjectHideFlags: 0
  m_CorrespondingSourceObject: {fileID: 0}
  m_PrefabInstance: {fileID: 0}
  m_PrefabAsset: {fileID: 0}
  serializedVersion: 6
  m_Component:
  - component: {fileID: 1419219194155999027}
  - component: {fileID: 5855658899701368137}
  m_Layer: 0
  m_Name: Tooltip
  m_TagString: Untagged
  m_Icon: {fileID: 0}
  m_NavMeshLayer: 0
  m_StaticEditorFlags: 0
  m_IsActive: 1
--- !u!4 &1419219194155999027
Transform:
  m_ObjectHideFlags: 0
  m_CorrespondingSourceObject: {fileID: 0}
  m_PrefabInstance: {fileID: 0}
  m_PrefabAsset: {fileID: 0}
  m_GameObject: {fileID: 4207402556183739140}
  m_LocalRotation: {x: 0, y: 0, z: 0, w: 1}
  m_LocalPosition: {x: -0.009362333, y: 0.000000011175871, z: 0.000000016298145}
  m_LocalScale: {x: 1, y: 1, z: 1}
  m_ConstrainProportionsScale: 0
  m_Children: []
  m_Father: {fileID: 5972506428670971533}
  m_RootOrder: 0
  m_LocalEulerAnglesHint: {x: 0, y: 0, z: 0}
--- !u!114 &5855658899701368137
MonoBehaviour:
  m_ObjectHideFlags: 0
  m_CorrespondingSourceObject: {fileID: 0}
  m_PrefabInstance: {fileID: 0}
  m_PrefabAsset: {fileID: 0}
  m_GameObject: {fileID: 4207402556183739140}
  m_Enabled: 1
  m_EditorHideFlags: 0
  m_Script: {fileID: 11500000, guid: b46c4909cebc470fbcfc052ab0ba2827, type: 3}
  m_Name: 
  m_EditorClassIdentifier: 
  Type: 4
--- !u!1 &4694311157818074847
GameObject:
  m_ObjectHideFlags: 0
  m_CorrespondingSourceObject: {fileID: 0}
  m_PrefabInstance: {fileID: 0}
  m_PrefabAsset: {fileID: 0}
  serializedVersion: 6
  m_Component:
  - component: {fileID: 1797683099367009880}
  - component: {fileID: 8209950505811348032}
  m_Layer: 0
  m_Name: Tooltip
  m_TagString: Untagged
  m_Icon: {fileID: 0}
  m_NavMeshLayer: 0
  m_StaticEditorFlags: 0
  m_IsActive: 1
--- !u!4 &1797683099367009880
Transform:
  m_ObjectHideFlags: 0
  m_CorrespondingSourceObject: {fileID: 0}
  m_PrefabInstance: {fileID: 0}
  m_PrefabAsset: {fileID: 0}
  m_GameObject: {fileID: 4694311157818074847}
  m_LocalRotation: {x: 0, y: 0, z: 0, w: 1}
  m_LocalPosition: {x: -0.000000010244548, y: 0.0000000018626451, z: 0}
  m_LocalScale: {x: 1, y: 1, z: 1}
  m_ConstrainProportionsScale: 0
  m_Children: []
  m_Father: {fileID: 5910420775270380719}
  m_RootOrder: 0
  m_LocalEulerAnglesHint: {x: 0, y: 0, z: 0}
--- !u!114 &8209950505811348032
MonoBehaviour:
  m_ObjectHideFlags: 0
  m_CorrespondingSourceObject: {fileID: 0}
  m_PrefabInstance: {fileID: 0}
  m_PrefabAsset: {fileID: 0}
  m_GameObject: {fileID: 4694311157818074847}
  m_Enabled: 1
  m_EditorHideFlags: 0
  m_Script: {fileID: 11500000, guid: b46c4909cebc470fbcfc052ab0ba2827, type: 3}
  m_Name: 
  m_EditorClassIdentifier: 
  Type: 6
--- !u!1 &5195595714288529447
GameObject:
  m_ObjectHideFlags: 0
  m_CorrespondingSourceObject: {fileID: 0}
  m_PrefabInstance: {fileID: 0}
  m_PrefabAsset: {fileID: 0}
  serializedVersion: 6
  m_Component:
  - component: {fileID: 672466042808712843}
  - component: {fileID: 1051527494837758930}
  m_Layer: 0
  m_Name: Tooltip
  m_TagString: Untagged
  m_Icon: {fileID: 0}
  m_NavMeshLayer: 0
  m_StaticEditorFlags: 0
  m_IsActive: 1
--- !u!4 &672466042808712843
Transform:
  m_ObjectHideFlags: 0
  m_CorrespondingSourceObject: {fileID: 0}
  m_PrefabInstance: {fileID: 0}
  m_PrefabAsset: {fileID: 0}
  m_GameObject: {fileID: 5195595714288529447}
  m_LocalRotation: {x: 0, y: 0, z: 0, w: 1}
  m_LocalPosition: {x: 0, y: 0, z: 0}
  m_LocalScale: {x: 1, y: 1, z: 1}
  m_ConstrainProportionsScale: 0
  m_Children: []
  m_Father: {fileID: 2844148066227819281}
  m_RootOrder: 0
  m_LocalEulerAnglesHint: {x: 0, y: 0, z: 0}
--- !u!114 &1051527494837758930
MonoBehaviour:
  m_ObjectHideFlags: 0
  m_CorrespondingSourceObject: {fileID: 0}
  m_PrefabInstance: {fileID: 0}
  m_PrefabAsset: {fileID: 0}
  m_GameObject: {fileID: 5195595714288529447}
  m_Enabled: 1
  m_EditorHideFlags: 0
  m_Script: {fileID: 11500000, guid: b46c4909cebc470fbcfc052ab0ba2827, type: 3}
  m_Name: 
  m_EditorClassIdentifier: 
  Type: 8
--- !u!1 &5767684816707929636
GameObject:
  m_ObjectHideFlags: 0
  m_CorrespondingSourceObject: {fileID: 0}
  m_PrefabInstance: {fileID: 0}
  m_PrefabAsset: {fileID: 0}
  serializedVersion: 6
  m_Component:
  - component: {fileID: 8419570474639992078}
  - component: {fileID: 7040088983755193045}
  m_Layer: 0
  m_Name: Tooltip
  m_TagString: Untagged
  m_Icon: {fileID: 0}
  m_NavMeshLayer: 0
  m_StaticEditorFlags: 0
  m_IsActive: 1
--- !u!4 &8419570474639992078
Transform:
  m_ObjectHideFlags: 0
  m_CorrespondingSourceObject: {fileID: 0}
  m_PrefabInstance: {fileID: 0}
  m_PrefabAsset: {fileID: 0}
  m_GameObject: {fileID: 5767684816707929636}
  m_LocalRotation: {x: 0, y: 0, z: 0, w: 1}
  m_LocalPosition: {x: 0.000000010244548, y: 0, z: 0}
  m_LocalScale: {x: 1, y: 1, z: 1}
  m_ConstrainProportionsScale: 0
  m_Children: []
  m_Father: {fileID: 5394831849422183363}
  m_RootOrder: 0
  m_LocalEulerAnglesHint: {x: 0, y: 0, z: 0}
--- !u!114 &7040088983755193045
MonoBehaviour:
  m_ObjectHideFlags: 0
  m_CorrespondingSourceObject: {fileID: 0}
  m_PrefabInstance: {fileID: 0}
  m_PrefabAsset: {fileID: 0}
  m_GameObject: {fileID: 5767684816707929636}
  m_Enabled: 1
  m_EditorHideFlags: 0
  m_Script: {fileID: 11500000, guid: b46c4909cebc470fbcfc052ab0ba2827, type: 3}
  m_Name: 
  m_EditorClassIdentifier: 
  Type: 5
--- !u!1 &8045899689795788874
GameObject:
  m_ObjectHideFlags: 0
  m_CorrespondingSourceObject: {fileID: 0}
  m_PrefabInstance: {fileID: 0}
  m_PrefabAsset: {fileID: 0}
  serializedVersion: 6
  m_Component:
  - component: {fileID: 8045899689795788873}
  m_Layer: 0
  m_Name: PointerAnchor
  m_TagString: Untagged
  m_Icon: {fileID: 0}
  m_NavMeshLayer: 0
  m_StaticEditorFlags: 0
  m_IsActive: 1
--- !u!4 &8045899689795788873
Transform:
  m_ObjectHideFlags: 0
  m_CorrespondingSourceObject: {fileID: 0}
  m_PrefabInstance: {fileID: 0}
  m_PrefabAsset: {fileID: 0}
  m_GameObject: {fileID: 8045899689795788874}
  m_LocalRotation: {x: -0, y: -0, z: -0, w: 1}
  m_LocalPosition: {x: 0, y: 0.005099997, z: 0.0743}
  m_LocalScale: {x: 1, y: 1, z: 1}
  m_ConstrainProportionsScale: 0
  m_Children: []
  m_Father: {fileID: 8045899690630475010}
  m_RootOrder: 1
  m_LocalEulerAnglesHint: {x: 0, y: 0, z: 0}
--- !u!1 &8045899690523154906
GameObject:
  m_ObjectHideFlags: 0
  m_CorrespondingSourceObject: {fileID: 0}
  m_PrefabInstance: {fileID: 0}
  m_PrefabAsset: {fileID: 0}
  serializedVersion: 6
  m_Component:
  - component: {fileID: 8045899690523154905}
  m_Layer: 0
  m_Name: OpenXRAnchor
  m_TagString: Untagged
  m_Icon: {fileID: 0}
  m_NavMeshLayer: 0
  m_StaticEditorFlags: 0
  m_IsActive: 1
--- !u!4 &8045899690523154905
Transform:
  m_ObjectHideFlags: 0
  m_CorrespondingSourceObject: {fileID: 0}
  m_PrefabInstance: {fileID: 0}
  m_PrefabAsset: {fileID: 0}
  m_GameObject: {fileID: 8045899690523154906}
  m_LocalRotation: {x: -7.119407e-17, y: 0.98388505, z: 0.17880227, w: 4.9297106e-17}
  m_LocalPosition: {x: 0.008000001, y: -0.0018294156, z: -0.1019482}
  m_LocalScale: {x: 1, y: 1, z: 1}
  m_ConstrainProportionsScale: 0
  m_Children: []
  m_Father: {fileID: 8045899690630475010}
  m_RootOrder: 2
  m_LocalEulerAnglesHint: {x: 0, y: 0, z: 0}
--- !u!1 &8045899690630475021
GameObject:
  m_ObjectHideFlags: 0
  m_CorrespondingSourceObject: {fileID: 0}
  m_PrefabInstance: {fileID: 0}
  m_PrefabAsset: {fileID: 0}
  serializedVersion: 6
  m_Component:
  - component: {fileID: 8045899690630475010}
  - component: {fileID: 8045899690630475011}
  - component: {fileID: 8045899690630475020}
  m_Layer: 0
  m_Name: PicoNeo2ControllerRight
  m_TagString: Untagged
  m_Icon: {fileID: 0}
  m_NavMeshLayer: 0
  m_StaticEditorFlags: 0
  m_IsActive: 1
--- !u!4 &8045899690630475010
Transform:
  m_ObjectHideFlags: 0
  m_CorrespondingSourceObject: {fileID: 0}
  m_PrefabInstance: {fileID: 0}
  m_PrefabAsset: {fileID: 0}
  m_GameObject: {fileID: 8045899690630475021}
  m_LocalRotation: {x: 0, y: 0, z: 0, w: 1}
  m_LocalPosition: {x: -0.2664, y: 0.0811, z: 0}
  m_LocalScale: {x: 1, y: 1, z: 1}
  m_ConstrainProportionsScale: 0
  m_Children:
  - {fileID: 7503698873623676037}
  - {fileID: 8045899689795788873}
  - {fileID: 8045899690523154905}
  - {fileID: 884783653}
  - {fileID: 5339204900171678189}
  m_Father: {fileID: 0}
  m_RootOrder: 0
  m_LocalEulerAnglesHint: {x: 0, y: 0, z: 0}
--- !u!114 &8045899690630475011
MonoBehaviour:
  m_ObjectHideFlags: 0
  m_CorrespondingSourceObject: {fileID: 0}
  m_PrefabInstance: {fileID: 0}
  m_PrefabAsset: {fileID: 0}
  m_GameObject: {fileID: 8045899690630475021}
  m_Enabled: 1
  m_EditorHideFlags: 0
  m_Script: {fileID: 11500000, guid: 926d2692cbf74cefb9bde63d562cf607, type: 3}
  m_Name: 
  m_EditorClassIdentifier: 
  InputDeviceHandler: {fileID: 4522267728537149183}
  CustomPointerAnchor: {fileID: 8045899689795788873}
  PlatformOffsetInfos:
  - Name: Varwin OpenXR Display
    AngleOffset: {x: 0, y: 180, z: 0}
    Anchor: {fileID: 8045899690523154905}
    IsDesktopOnly: 0
  - Name: PicoXR Display
    AngleOffset: {x: 0, y: 0, z: 0}
    Anchor: {fileID: 884783653}
    IsDesktopOnly: 0
  _controlTooltipHandlers:
  - {fileID: 1051527494837758930}
  - {fileID: 7040088983755193045}
  - {fileID: 8209950505811348032}
  - {fileID: 7747647082301375782}
  - {fileID: 7801323642251039211}
  - {fileID: 7072538978499988312}
  - {fileID: 6174263115015382562}
  - {fileID: 5855658899701368137}
  - {fileID: 3458621549628794457}
  TeleportOnThumbstick: 1
  Is3Dof: 0
  GrabAnchor: {fileID: 522621918227422716}
--- !u!114 &8045899690630475020
MonoBehaviour:
  m_ObjectHideFlags: 0
  m_CorrespondingSourceObject: {fileID: 0}
  m_PrefabInstance: {fileID: 0}
  m_PrefabAsset: {fileID: 0}
  m_GameObject: {fileID: 8045899690630475021}
  m_Enabled: 1
  m_EditorHideFlags: 0
  m_Script: {fileID: 11500000, guid: e92dc823f4034a4dabdef690e2c1a7c0, type: 3}
  m_Name: 
  m_EditorClassIdentifier: 
  Animator: {fileID: 4522267728537149183}
  Indicators:
  - {fileID: 8045899691619771260}
  - {fileID: 8045899691619771261}
  - {fileID: 8045899690050928805}
  - {fileID: 8045899690050928827}
  TimeSwitching: 0.05
--- !u!1001 &8045899691619771246
PrefabInstance:
  m_ObjectHideFlags: 0
  serializedVersion: 2
  m_Modification:
    m_TransformParent: {fileID: 8045899690630475010}
    m_Modifications:
    - target: {fileID: -8679921383154817045, guid: dd5c1bf48cff5bd4d9b20719338ec8e9,
        type: 3}
      propertyPath: m_RootOrder
      value: 0
      objectReference: {fileID: 0}
    - target: {fileID: -8679921383154817045, guid: dd5c1bf48cff5bd4d9b20719338ec8e9,
        type: 3}
      propertyPath: m_LocalPosition.x
      value: 0
      objectReference: {fileID: 0}
    - target: {fileID: -8679921383154817045, guid: dd5c1bf48cff5bd4d9b20719338ec8e9,
        type: 3}
      propertyPath: m_LocalPosition.y
      value: 0
      objectReference: {fileID: 0}
    - target: {fileID: -8679921383154817045, guid: dd5c1bf48cff5bd4d9b20719338ec8e9,
        type: 3}
      propertyPath: m_LocalPosition.z
      value: 0
      objectReference: {fileID: 0}
    - target: {fileID: -8679921383154817045, guid: dd5c1bf48cff5bd4d9b20719338ec8e9,
        type: 3}
      propertyPath: m_LocalRotation.w
      value: 1
      objectReference: {fileID: 0}
    - target: {fileID: -8679921383154817045, guid: dd5c1bf48cff5bd4d9b20719338ec8e9,
        type: 3}
      propertyPath: m_LocalRotation.x
      value: -0
      objectReference: {fileID: 0}
    - target: {fileID: -8679921383154817045, guid: dd5c1bf48cff5bd4d9b20719338ec8e9,
        type: 3}
      propertyPath: m_LocalRotation.y
      value: -0
      objectReference: {fileID: 0}
    - target: {fileID: -8679921383154817045, guid: dd5c1bf48cff5bd4d9b20719338ec8e9,
        type: 3}
      propertyPath: m_LocalRotation.z
      value: -0
      objectReference: {fileID: 0}
    - target: {fileID: -8679921383154817045, guid: dd5c1bf48cff5bd4d9b20719338ec8e9,
        type: 3}
      propertyPath: m_LocalEulerAnglesHint.x
      value: 0
      objectReference: {fileID: 0}
    - target: {fileID: -8679921383154817045, guid: dd5c1bf48cff5bd4d9b20719338ec8e9,
        type: 3}
      propertyPath: m_LocalEulerAnglesHint.y
      value: 0
      objectReference: {fileID: 0}
    - target: {fileID: -8679921383154817045, guid: dd5c1bf48cff5bd4d9b20719338ec8e9,
        type: 3}
      propertyPath: m_LocalEulerAnglesHint.z
      value: 0
      objectReference: {fileID: 0}
    - target: {fileID: -8553329701935688984, guid: dd5c1bf48cff5bd4d9b20719338ec8e9,
        type: 3}
      propertyPath: m_IsActive
      value: 1
      objectReference: {fileID: 0}
    - target: {fileID: -7654305915795851396, guid: dd5c1bf48cff5bd4d9b20719338ec8e9,
        type: 3}
      propertyPath: m_Materials.Array.data[0]
      value: 
      objectReference: {fileID: 2100000, guid: 7b55872c1e8aac145a88f9ac4803ed46, type: 2}
    - target: {fileID: -6653648062876019450, guid: dd5c1bf48cff5bd4d9b20719338ec8e9,
        type: 3}
      propertyPath: m_Materials.Array.data[0]
      value: 
      objectReference: {fileID: 2100000, guid: 7b55872c1e8aac145a88f9ac4803ed46, type: 2}
    - target: {fileID: -5230739781689506314, guid: dd5c1bf48cff5bd4d9b20719338ec8e9,
        type: 3}
      propertyPath: m_Materials.Array.data[0]
      value: 
      objectReference: {fileID: 2100000, guid: 7b55872c1e8aac145a88f9ac4803ed46, type: 2}
    - target: {fileID: -3779963944294777966, guid: dd5c1bf48cff5bd4d9b20719338ec8e9,
        type: 3}
      propertyPath: m_Materials.Array.data[0]
      value: 
      objectReference: {fileID: 2100000, guid: 7b55872c1e8aac145a88f9ac4803ed46, type: 2}
    - target: {fileID: -2717978881661849921, guid: dd5c1bf48cff5bd4d9b20719338ec8e9,
        type: 3}
      propertyPath: m_Materials.Array.data[0]
      value: 
      objectReference: {fileID: 2100000, guid: 7b55872c1e8aac145a88f9ac4803ed46, type: 2}
    - target: {fileID: -2409021245551130361, guid: dd5c1bf48cff5bd4d9b20719338ec8e9,
        type: 3}
      propertyPath: m_IsActive
      value: 0
      objectReference: {fileID: 0}
    - target: {fileID: -478069227840935169, guid: dd5c1bf48cff5bd4d9b20719338ec8e9,
        type: 3}
      propertyPath: m_LocalScale.x
      value: -1
      objectReference: {fileID: 0}
    - target: {fileID: 15447551484691087, guid: dd5c1bf48cff5bd4d9b20719338ec8e9,
        type: 3}
      propertyPath: m_Materials.Array.data[0]
      value: 
      objectReference: {fileID: 2100000, guid: 7b55872c1e8aac145a88f9ac4803ed46, type: 2}
    - target: {fileID: 919132149155446097, guid: dd5c1bf48cff5bd4d9b20719338ec8e9,
        type: 3}
      propertyPath: m_Name
      value: PicoNeo2
      objectReference: {fileID: 0}
    - target: {fileID: 1737723228673250938, guid: dd5c1bf48cff5bd4d9b20719338ec8e9,
        type: 3}
      propertyPath: m_Materials.Array.data[0]
      value: 
      objectReference: {fileID: 2100000, guid: 7b55872c1e8aac145a88f9ac4803ed46, type: 2}
    - target: {fileID: 2377609442028252725, guid: dd5c1bf48cff5bd4d9b20719338ec8e9,
        type: 3}
      propertyPath: m_Materials.Array.data[0]
      value: 
      objectReference: {fileID: 2100000, guid: 7b55872c1e8aac145a88f9ac4803ed46, type: 2}
    - target: {fileID: 2545228181402026268, guid: dd5c1bf48cff5bd4d9b20719338ec8e9,
        type: 3}
      propertyPath: m_Mesh
      value: 
      objectReference: {fileID: -1400252653696632910, guid: b6b6e82f462f28a42aad856bd2159f95,
        type: 3}
    - target: {fileID: 2545228181402026268, guid: dd5c1bf48cff5bd4d9b20719338ec8e9,
        type: 3}
      propertyPath: m_Materials.Array.data[0]
      value: 
      objectReference: {fileID: 2100000, guid: 98f191acca91cc14ebcd02c5c1277539, type: 2}
    - target: {fileID: 2788969073548220362, guid: dd5c1bf48cff5bd4d9b20719338ec8e9,
        type: 3}
      propertyPath: m_Materials.Array.data[0]
      value: 
      objectReference: {fileID: 2100000, guid: 7b55872c1e8aac145a88f9ac4803ed46, type: 2}
    - target: {fileID: 3058917418676848090, guid: dd5c1bf48cff5bd4d9b20719338ec8e9,
        type: 3}
      propertyPath: m_Materials.Array.data[0]
      value: 
      objectReference: {fileID: 2100000, guid: 7b55872c1e8aac145a88f9ac4803ed46, type: 2}
    - target: {fileID: 4120209081251236913, guid: dd5c1bf48cff5bd4d9b20719338ec8e9,
        type: 3}
      propertyPath: m_Materials.Array.data[0]
      value: 
      objectReference: {fileID: 2100000, guid: 7b55872c1e8aac145a88f9ac4803ed46, type: 2}
    - target: {fileID: 4290940006591173106, guid: dd5c1bf48cff5bd4d9b20719338ec8e9,
        type: 3}
      propertyPath: m_Materials.Array.data[0]
      value: 
      objectReference: {fileID: 2100000, guid: 7b55872c1e8aac145a88f9ac4803ed46, type: 2}
    - target: {fileID: 5866666021909216657, guid: dd5c1bf48cff5bd4d9b20719338ec8e9,
        type: 3}
      propertyPath: m_Controller
      value: 
      objectReference: {fileID: 9100000, guid: e7398c249b7a8e8478edef0f3ae788f4, type: 2}
    - target: {fileID: 5876369499985021594, guid: dd5c1bf48cff5bd4d9b20719338ec8e9,
        type: 3}
      propertyPath: m_Materials.Array.data[0]
      value: 
      objectReference: {fileID: 2100000, guid: 7b55872c1e8aac145a88f9ac4803ed46, type: 2}
    - target: {fileID: 6813916990499067530, guid: dd5c1bf48cff5bd4d9b20719338ec8e9,
        type: 3}
      propertyPath: m_LocalScale.x
      value: -1
      objectReference: {fileID: 0}
    - target: {fileID: 7214878304398742293, guid: dd5c1bf48cff5bd4d9b20719338ec8e9,
        type: 3}
      propertyPath: m_Materials.Array.data[0]
      value: 
      objectReference: {fileID: 2100000, guid: 7b55872c1e8aac145a88f9ac4803ed46, type: 2}
    - target: {fileID: 7573143493212126147, guid: dd5c1bf48cff5bd4d9b20719338ec8e9,
        type: 3}
      propertyPath: m_Materials.Array.data[0]
      value: 
      objectReference: {fileID: 2100000, guid: 7b55872c1e8aac145a88f9ac4803ed46, type: 2}
    - target: {fileID: 8470470331321530421, guid: dd5c1bf48cff5bd4d9b20719338ec8e9,
        type: 3}
      propertyPath: m_Materials.Array.data[0]
      value: 
      objectReference: {fileID: 2100000, guid: 7b55872c1e8aac145a88f9ac4803ed46, type: 2}
    m_RemovedComponents: []
  m_SourcePrefab: {fileID: 100100000, guid: dd5c1bf48cff5bd4d9b20719338ec8e9, type: 3}
--- !u!4 &1117558479718415934 stripped
Transform:
  m_CorrespondingSourceObject: {fileID: -2293851014413116080, guid: dd5c1bf48cff5bd4d9b20719338ec8e9,
    type: 3}
  m_PrefabInstance: {fileID: 8045899691619771246}
  m_PrefabAsset: {fileID: 0}
--- !u!4 &2844148066227819281 stripped
Transform:
  m_CorrespondingSourceObject: {fileID: 5246894480454611071, guid: dd5c1bf48cff5bd4d9b20719338ec8e9,
    type: 3}
  m_PrefabInstance: {fileID: 8045899691619771246}
  m_PrefabAsset: {fileID: 0}
--- !u!1 &3078626666464970115 stripped
GameObject:
  m_CorrespondingSourceObject: {fileID: 4976967453622626029, guid: dd5c1bf48cff5bd4d9b20719338ec8e9,
    type: 3}
  m_PrefabInstance: {fileID: 8045899691619771246}
  m_PrefabAsset: {fileID: 0}
--- !u!114 &8045899691619771260
MonoBehaviour:
  m_ObjectHideFlags: 0
  m_CorrespondingSourceObject: {fileID: 0}
  m_PrefabInstance: {fileID: 0}
  m_PrefabAsset: {fileID: 0}
  m_GameObject: {fileID: 3078626666464970115}
  m_Enabled: 1
  m_EditorHideFlags: 0
  m_Script: {fileID: 11500000, guid: 42a14b2b31e04e42ace502a2acb818ea, type: 3}
  m_Name: 
  m_EditorClassIdentifier: 
  PrimaryInputFeatureName: PrimaryButton
  LayerIndex: 4
  AnimatorParameterName: ButtonA
--- !u!4 &4466109425266293376 stripped
Transform:
  m_CorrespondingSourceObject: {fileID: -3291557383000647186, guid: dd5c1bf48cff5bd4d9b20719338ec8e9,
    type: 3}
  m_PrefabInstance: {fileID: 8045899691619771246}
  m_PrefabAsset: {fileID: 0}
--- !u!95 &4522267728537149183 stripped
Animator:
  m_CorrespondingSourceObject: {fileID: 5866666021909216657, guid: dd5c1bf48cff5bd4d9b20719338ec8e9,
    type: 3}
  m_PrefabInstance: {fileID: 8045899691619771246}
  m_PrefabAsset: {fileID: 0}
--- !u!4 &5394831849422183363 stripped
Transform:
  m_CorrespondingSourceObject: {fileID: 2699500986022377645, guid: dd5c1bf48cff5bd4d9b20719338ec8e9,
    type: 3}
  m_PrefabInstance: {fileID: 8045899691619771246}
  m_PrefabAsset: {fileID: 0}
--- !u!4 &5910420775270380719 stripped
Transform:
  m_CorrespondingSourceObject: {fileID: 4444717767429429185, guid: dd5c1bf48cff5bd4d9b20719338ec8e9,
    type: 3}
  m_PrefabInstance: {fileID: 8045899691619771246}
  m_PrefabAsset: {fileID: 0}
--- !u!4 &5972506428670971533 stripped
Transform:
  m_CorrespondingSourceObject: {fileID: 4416445566796459491, guid: dd5c1bf48cff5bd4d9b20719338ec8e9,
    type: 3}
  m_PrefabInstance: {fileID: 8045899691619771246}
  m_PrefabAsset: {fileID: 0}
--- !u!1 &6467398697264715495 stripped
GameObject:
  m_CorrespondingSourceObject: {fileID: -5302962196401982071, guid: dd5c1bf48cff5bd4d9b20719338ec8e9,
    type: 3}
  m_PrefabInstance: {fileID: 8045899691619771246}
  m_PrefabAsset: {fileID: 0}
--- !u!114 &8045899690050928805
MonoBehaviour:
  m_ObjectHideFlags: 0
  m_CorrespondingSourceObject: {fileID: 0}
  m_PrefabInstance: {fileID: 0}
  m_PrefabAsset: {fileID: 0}
  m_GameObject: {fileID: 6467398697264715495}
  m_Enabled: 1
  m_EditorHideFlags: 0
  m_Script: {fileID: 11500000, guid: 42a14b2b31e04e42ace502a2acb818ea, type: 3}
  m_Name: 
  m_EditorClassIdentifier: 
  PrimaryInputFeatureName: Primary2DAxisTouch
  LayerIndex: 2
  AnimatorParameterName: 
--- !u!114 &8045899690050928827
MonoBehaviour:
  m_ObjectHideFlags: 0
  m_CorrespondingSourceObject: {fileID: 0}
  m_PrefabInstance: {fileID: 0}
  m_PrefabAsset: {fileID: 0}
  m_GameObject: {fileID: 6467398697264715495}
  m_Enabled: 1
  m_EditorHideFlags: 0
  m_Script: {fileID: 11500000, guid: fb959ab8eca546139141a13f20354e8e, type: 3}
  m_Name: 
  m_EditorClassIdentifier: 
  PrimaryInputFeatureName: Primary2DAxis
  LayerIndex: 2
  AnimatorParameterXName: AxisX
  AnimatorParameterYName: AxisY
  InvertedX: 1
  InvertedY: 0
--- !u!4 &7503698873623676037 stripped
Transform:
  m_CorrespondingSourceObject: {fileID: -8679921383154817045, guid: dd5c1bf48cff5bd4d9b20719338ec8e9,
    type: 3}
  m_PrefabInstance: {fileID: 8045899691619771246}
  m_PrefabAsset: {fileID: 0}
--- !u!4 &8229674745394532502 stripped
Transform:
  m_CorrespondingSourceObject: {fileID: -7089392900150823944, guid: dd5c1bf48cff5bd4d9b20719338ec8e9,
    type: 3}
  m_PrefabInstance: {fileID: 8045899691619771246}
  m_PrefabAsset: {fileID: 0}
--- !u!1 &8485664191690990542 stripped
GameObject:
  m_CorrespondingSourceObject: {fileID: -7319504171905482592, guid: dd5c1bf48cff5bd4d9b20719338ec8e9,
    type: 3}
  m_PrefabInstance: {fileID: 8045899691619771246}
  m_PrefabAsset: {fileID: 0}
--- !u!114 &8045899691226675850
MonoBehaviour:
  m_ObjectHideFlags: 0
  m_CorrespondingSourceObject: {fileID: 0}
  m_PrefabInstance: {fileID: 0}
  m_PrefabAsset: {fileID: 0}
  m_GameObject: {fileID: 8485664191690990542}
  m_Enabled: 1
  m_EditorHideFlags: 0
  m_Script: {fileID: 11500000, guid: 7fbc17ab92734d1fbb0edb12e8e31bbd, type: 3}
  m_Name: 
  m_EditorClassIdentifier: 
  PrimaryInputFeatureName: Grip
  LayerIndex: 3
  AnimatorParameterName: Grip
--- !u!1 &8535414656089032410 stripped
GameObject:
  m_CorrespondingSourceObject: {fileID: -7360248158670920268, guid: dd5c1bf48cff5bd4d9b20719338ec8e9,
    type: 3}
  m_PrefabInstance: {fileID: 8045899691619771246}
  m_PrefabAsset: {fileID: 0}
--- !u!114 &8045899691619771261
MonoBehaviour:
  m_ObjectHideFlags: 0
  m_CorrespondingSourceObject: {fileID: 0}
  m_PrefabInstance: {fileID: 0}
  m_PrefabAsset: {fileID: 0}
  m_GameObject: {fileID: 8535414656089032410}
  m_Enabled: 1
  m_EditorHideFlags: 0
  m_Script: {fileID: 11500000, guid: 42a14b2b31e04e42ace502a2acb818ea, type: 3}
  m_Name: 
  m_EditorClassIdentifier: 
  PrimaryInputFeatureName: SecondaryButton
  LayerIndex: 5
  AnimatorParameterName: ButtonB
--- !u!1 &8771081060834858078 stripped
GameObject:
  m_CorrespondingSourceObject: {fileID: -7633068229432428752, guid: dd5c1bf48cff5bd4d9b20719338ec8e9,
    type: 3}
  m_PrefabInstance: {fileID: 8045899691619771246}
  m_PrefabAsset: {fileID: 0}
--- !u!114 &8045899691619771257
MonoBehaviour:
  m_ObjectHideFlags: 0
  m_CorrespondingSourceObject: {fileID: 0}
  m_PrefabInstance: {fileID: 0}
  m_PrefabAsset: {fileID: 0}
  m_GameObject: {fileID: 8771081060834858078}
  m_Enabled: 1
  m_EditorHideFlags: 0
  m_Script: {fileID: 11500000, guid: 7fbc17ab92734d1fbb0edb12e8e31bbd, type: 3}
  m_Name: 
  m_EditorClassIdentifier: 
  PrimaryInputFeatureName: Trigger
  LayerIndex: 0
  AnimatorParameterName: Trigger
