%YAML 1.1
%TAG !u! tag:unity3d.com,2011:
--- !u!1 &3489478177109968648
GameObject:
  m_ObjectHideFlags: 0
  m_CorrespondingSourceObject: {fileID: 0}
  m_PrefabInstance: {fileID: 0}
  m_PrefabAsset: {fileID: 0}
  serializedVersion: 6
  m_Component:
  - component: {fileID: 7465190618549936018}
  m_Layer: 0
  m_Name: OculusAnchor
  m_TagString: Untagged
  m_Icon: {fileID: 0}
  m_NavMeshLayer: 0
  m_StaticEditorFlags: 0
  m_IsActive: 1
--- !u!4 &7465190618549936018
Transform:
  m_ObjectHideFlags: 0
  m_CorrespondingSourceObject: {fileID: 0}
  m_PrefabInstance: {fileID: 0}
  m_PrefabAsset: {fileID: 0}
  m_GameObject: {fileID: 3489478177109968648}
  m_LocalRotation: {x: -0.3420201, y: 0, z: 0, w: 0.9396927}
  m_LocalPosition: {x: 0.00575, y: 0.005, z: 0.055}
  m_LocalScale: {x: 1, y: 1, z: 1}
  m_ConstrainProportionsScale: 0
  m_Children: []
  m_Father: {fileID: 9042511604619950080}
  m_RootOrder: 3
  m_LocalEulerAnglesHint: {x: -40, y: 0, z: 0}
--- !u!1 &4514781749722890271
GameObject:
  m_ObjectHideFlags: 0
  m_CorrespondingSourceObject: {fileID: 0}
  m_PrefabInstance: {fileID: 0}
  m_PrefabAsset: {fileID: 0}
  serializedVersion: 6
  m_Component:
  - component: {fileID: 5771622454423846043}
  - component: {fileID: 9110093919165062988}
  m_Layer: 0
  m_Name: Tooltip
  m_TagString: Untagged
  m_Icon: {fileID: 0}
  m_NavMeshLayer: 0
  m_StaticEditorFlags: 0
  m_IsActive: 1
--- !u!4 &5771622454423846043
Transform:
  m_ObjectHideFlags: 0
  m_CorrespondingSourceObject: {fileID: 0}
  m_PrefabInstance: {fileID: 0}
  m_PrefabAsset: {fileID: 0}
  m_GameObject: {fileID: 4514781749722890271}
  m_LocalRotation: {x: 0, y: 0, z: 0, w: 1}
  m_LocalPosition: {x: 0.0015877897, y: -0.000000015832484, z: 0.0000000037252903}
  m_LocalScale: {x: 1, y: 1, z: 1}
  m_ConstrainProportionsScale: 0
  m_Children: []
  m_Father: {fileID: 7524636965203663559}
  m_RootOrder: 0
  m_LocalEulerAnglesHint: {x: 0, y: 0, z: 0}
--- !u!114 &9110093919165062988
MonoBehaviour:
  m_ObjectHideFlags: 0
  m_CorrespondingSourceObject: {fileID: 0}
  m_PrefabInstance: {fileID: 0}
  m_PrefabAsset: {fileID: 0}
  m_GameObject: {fileID: 4514781749722890271}
  m_Enabled: 1
  m_EditorHideFlags: 0
  m_Script: {fileID: 11500000, guid: b46c4909cebc470fbcfc052ab0ba2827, type: 3}
  m_Name: 
  m_EditorClassIdentifier: 
  Type: 5
--- !u!1 &4694125276827089904
GameObject:
  m_ObjectHideFlags: 0
  m_CorrespondingSourceObject: {fileID: 0}
  m_PrefabInstance: {fileID: 0}
  m_PrefabAsset: {fileID: 0}
  serializedVersion: 6
  m_Component:
  - component: {fileID: 5158973987219583664}
  m_Layer: 0
  m_Name: GrabAnchor
  m_TagString: Untagged
  m_Icon: {fileID: 0}
  m_NavMeshLayer: 0
  m_StaticEditorFlags: 0
  m_IsActive: 1
--- !u!4 &5158973987219583664
Transform:
  m_ObjectHideFlags: 0
  m_CorrespondingSourceObject: {fileID: 0}
  m_PrefabInstance: {fileID: 0}
  m_PrefabAsset: {fileID: 0}
  m_GameObject: {fileID: 4694125276827089904}
  m_LocalRotation: {x: 0, y: 0, z: 0, w: 1}
  m_LocalPosition: {x: 0, y: -0.0054, z: -0.1027}
  m_LocalScale: {x: 1, y: 1, z: 1}
  m_ConstrainProportionsScale: 0
  m_Children: []
  m_Father: {fileID: 9042511604619950080}
  m_RootOrder: 4
  m_LocalEulerAnglesHint: {x: 0, y: 0, z: 0}
--- !u!1 &5231494634046118064
GameObject:
  m_ObjectHideFlags: 0
  m_CorrespondingSourceObject: {fileID: 0}
  m_PrefabInstance: {fileID: 0}
  m_PrefabAsset: {fileID: 0}
  serializedVersion: 6
  m_Component:
  - component: {fileID: 8669853452295578235}
  - component: {fileID: 3945742842364800389}
  m_Layer: 0
  m_Name: Tooltip
  m_TagString: Untagged
  m_Icon: {fileID: 0}
  m_NavMeshLayer: 0
  m_StaticEditorFlags: 0
  m_IsActive: 1
--- !u!4 &8669853452295578235
Transform:
  m_ObjectHideFlags: 0
  m_CorrespondingSourceObject: {fileID: 0}
  m_PrefabInstance: {fileID: 0}
  m_PrefabAsset: {fileID: 0}
  m_GameObject: {fileID: 5231494634046118064}
  m_LocalRotation: {x: 0, y: 0, z: 0, w: 1}
  m_LocalPosition: {x: 0.002571404, y: 0.0044, z: 0.08340001}
  m_LocalScale: {x: 1, y: 1, z: 1}
  m_ConstrainProportionsScale: 0
  m_Children: []
  m_Father: {fileID: 7354725456428036285}
  m_RootOrder: 0
  m_LocalEulerAnglesHint: {x: 0, y: 0, z: 0}
--- !u!114 &3945742842364800389
MonoBehaviour:
  m_ObjectHideFlags: 0
  m_CorrespondingSourceObject: {fileID: 0}
  m_PrefabInstance: {fileID: 0}
  m_PrefabAsset: {fileID: 0}
  m_GameObject: {fileID: 5231494634046118064}
  m_Enabled: 1
  m_EditorHideFlags: 0
  m_Script: {fileID: 11500000, guid: b46c4909cebc470fbcfc052ab0ba2827, type: 3}
  m_Name: 
  m_EditorClassIdentifier: 
  Type: 8
--- !u!1 &5409662471084579849
GameObject:
  m_ObjectHideFlags: 0
  m_CorrespondingSourceObject: {fileID: 0}
  m_PrefabInstance: {fileID: 0}
  m_PrefabAsset: {fileID: 0}
  serializedVersion: 6
  m_Component:
  - component: {fileID: 8829653641401133072}
  - component: {fileID: 5613192981311094439}
  m_Layer: 0
  m_Name: Tooltip
  m_TagString: Untagged
  m_Icon: {fileID: 0}
  m_NavMeshLayer: 0
  m_StaticEditorFlags: 0
  m_IsActive: 1
--- !u!4 &8829653641401133072
Transform:
  m_ObjectHideFlags: 0
  m_CorrespondingSourceObject: {fileID: 0}
  m_PrefabInstance: {fileID: 0}
  m_PrefabAsset: {fileID: 0}
  m_GameObject: {fileID: 5409662471084579849}
  m_LocalRotation: {x: 0, y: 0, z: 0, w: 1}
  m_LocalPosition: {x: 0.0070494916, y: -0.000015003141, z: 0.0000063013285}
  m_LocalScale: {x: 1, y: 1, z: 1}
  m_ConstrainProportionsScale: 0
  m_Children: []
  m_Father: {fileID: 7488588196213178971}
  m_RootOrder: 0
  m_LocalEulerAnglesHint: {x: 0, y: 0, z: 0}
--- !u!114 &5613192981311094439
MonoBehaviour:
  m_ObjectHideFlags: 0
  m_CorrespondingSourceObject: {fileID: 0}
  m_PrefabInstance: {fileID: 0}
  m_PrefabAsset: {fileID: 0}
  m_GameObject: {fileID: 5409662471084579849}
  m_Enabled: 1
  m_EditorHideFlags: 0
  m_Script: {fileID: 11500000, guid: b46c4909cebc470fbcfc052ab0ba2827, type: 3}
  m_Name: 
  m_EditorClassIdentifier: 
  Type: 4
--- !u!1 &6173185965614460344
GameObject:
  m_ObjectHideFlags: 0
  m_CorrespondingSourceObject: {fileID: 0}
  m_PrefabInstance: {fileID: 0}
  m_PrefabAsset: {fileID: 0}
  serializedVersion: 6
  m_Component:
  - component: {fileID: 6570429497846329673}
  m_Layer: 0
  m_Name: OpenXRAnchor
  m_TagString: Untagged
  m_Icon: {fileID: 0}
  m_NavMeshLayer: 0
  m_StaticEditorFlags: 0
  m_IsActive: 1
--- !u!4 &6570429497846329673
Transform:
  m_ObjectHideFlags: 0
  m_CorrespondingSourceObject: {fileID: 0}
  m_PrefabInstance: {fileID: 0}
  m_PrefabAsset: {fileID: 0}
  m_GameObject: {fileID: 6173185965614460344}
  m_LocalRotation: {x: -7.119407e-17, y: -0.98388505, z: -0.17880227, w: 4.9297106e-17}
  m_LocalPosition: {x: -0.007999986, y: -0.0018294156, z: -0.1019482}
  m_LocalScale: {x: -1, y: 1, z: 1}
  m_ConstrainProportionsScale: 0
  m_Children: []
  m_Father: {fileID: 9042511604619950080}
  m_RootOrder: 2
  m_LocalEulerAnglesHint: {x: 0, y: 0, z: 0}
--- !u!1 &6528634229567256943
GameObject:
  m_ObjectHideFlags: 0
  m_CorrespondingSourceObject: {fileID: 0}
  m_PrefabInstance: {fileID: 0}
  m_PrefabAsset: {fileID: 0}
  serializedVersion: 6
  m_Component:
  - component: {fileID: 9217269557747815982}
  - component: {fileID: 6086421622642040663}
  - component: {fileID: 2903345432975282998}
  m_Layer: 0
  m_Name: Tooltip
  m_TagString: Untagged
  m_Icon: {fileID: 0}
  m_NavMeshLayer: 0
  m_StaticEditorFlags: 0
  m_IsActive: 1
--- !u!4 &9217269557747815982
Transform:
  m_ObjectHideFlags: 0
  m_CorrespondingSourceObject: {fileID: 0}
  m_PrefabInstance: {fileID: 0}
  m_PrefabAsset: {fileID: 0}
  m_GameObject: {fileID: 6528634229567256943}
  m_LocalRotation: {x: 0, y: 0, z: 0, w: 1}
  m_LocalPosition: {x: 0.0008918385, y: -0.000012736244, z: 0.000038979342}
  m_LocalScale: {x: 1, y: 1, z: 1}
  m_ConstrainProportionsScale: 0
  m_Children: []
  m_Father: {fileID: 7976146565822788045}
  m_RootOrder: 0
  m_LocalEulerAnglesHint: {x: 0, y: 0, z: 0}
--- !u!114 &6086421622642040663
MonoBehaviour:
  m_ObjectHideFlags: 0
  m_CorrespondingSourceObject: {fileID: 0}
  m_PrefabInstance: {fileID: 0}
  m_PrefabAsset: {fileID: 0}
  m_GameObject: {fileID: 6528634229567256943}
  m_Enabled: 1
  m_EditorHideFlags: 0
  m_Script: {fileID: 11500000, guid: b46c4909cebc470fbcfc052ab0ba2827, type: 3}
  m_Name: 
  m_EditorClassIdentifier: 
  Type: 7
--- !u!114 &2903345432975282998
MonoBehaviour:
  m_ObjectHideFlags: 0
  m_CorrespondingSourceObject: {fileID: 0}
  m_PrefabInstance: {fileID: 0}
  m_PrefabAsset: {fileID: 0}
  m_GameObject: {fileID: 6528634229567256943}
  m_Enabled: 1
  m_EditorHideFlags: 0
  m_Script: {fileID: 11500000, guid: b46c4909cebc470fbcfc052ab0ba2827, type: 3}
  m_Name: 
  m_EditorClassIdentifier: 
  Type: 9
--- !u!1 &6853471579649713212
GameObject:
  m_ObjectHideFlags: 0
  m_CorrespondingSourceObject: {fileID: 0}
  m_PrefabInstance: {fileID: 0}
  m_PrefabAsset: {fileID: 0}
  serializedVersion: 6
  m_Component:
  - component: {fileID: 5285464594652524304}
  - component: {fileID: 3020320465460687923}
  - component: {fileID: 508127937608615476}
  m_Layer: 0
  m_Name: Tooltip
  m_TagString: Untagged
  m_Icon: {fileID: 0}
  m_NavMeshLayer: 0
  m_StaticEditorFlags: 0
  m_IsActive: 1
--- !u!4 &5285464594652524304
Transform:
  m_ObjectHideFlags: 0
  m_CorrespondingSourceObject: {fileID: 0}
  m_PrefabInstance: {fileID: 0}
  m_PrefabAsset: {fileID: 0}
  m_GameObject: {fileID: 6853471579649713212}
  m_LocalRotation: {x: 0, y: 0, z: 0, w: 1}
  m_LocalPosition: {x: -0.000506768, y: -0.0022980925, z: 0.042037766}
  m_LocalScale: {x: 1, y: 1, z: 1}
  m_ConstrainProportionsScale: 0
  m_Children: []
  m_Father: {fileID: 5617707984657087242}
  m_RootOrder: 0
  m_LocalEulerAnglesHint: {x: 0, y: 0, z: 0}
--- !u!114 &3020320465460687923
MonoBehaviour:
  m_ObjectHideFlags: 0
  m_CorrespondingSourceObject: {fileID: 0}
  m_PrefabInstance: {fileID: 0}
  m_PrefabAsset: {fileID: 0}
  m_GameObject: {fileID: 6853471579649713212}
  m_Enabled: 1
  m_EditorHideFlags: 0
  m_Script: {fileID: 11500000, guid: b46c4909cebc470fbcfc052ab0ba2827, type: 3}
  m_Name: 
  m_EditorClassIdentifier: 
  Type: 2
--- !u!114 &508127937608615476
MonoBehaviour:
  m_ObjectHideFlags: 0
  m_CorrespondingSourceObject: {fileID: 0}
  m_PrefabInstance: {fileID: 0}
  m_PrefabAsset: {fileID: 0}
  m_GameObject: {fileID: 6853471579649713212}
  m_Enabled: 1
  m_EditorHideFlags: 0
  m_Script: {fileID: 11500000, guid: b46c4909cebc470fbcfc052ab0ba2827, type: 3}
  m_Name: 
  m_EditorClassIdentifier: 
  Type: 3
--- !u!1 &7289152631319494824
GameObject:
  m_ObjectHideFlags: 0
  m_CorrespondingSourceObject: {fileID: 0}
  m_PrefabInstance: {fileID: 0}
  m_PrefabAsset: {fileID: 0}
  serializedVersion: 6
  m_Component:
  - component: {fileID: 5001732116390273730}
  - component: {fileID: 3222382460007679161}
  m_Layer: 0
  m_Name: Tooltip
  m_TagString: Untagged
  m_Icon: {fileID: 0}
  m_NavMeshLayer: 0
  m_StaticEditorFlags: 0
  m_IsActive: 1
--- !u!4 &5001732116390273730
Transform:
  m_ObjectHideFlags: 0
  m_CorrespondingSourceObject: {fileID: 0}
  m_PrefabInstance: {fileID: 0}
  m_PrefabAsset: {fileID: 0}
  m_GameObject: {fileID: 7289152631319494824}
  m_LocalRotation: {x: 0, y: 0, z: 0, w: 1}
  m_LocalPosition: {x: 0.0015877872, y: 0.0000000044237822, z: 0.000000014551915}
  m_LocalScale: {x: 1, y: 1, z: 1}
  m_ConstrainProportionsScale: 0
  m_Children: []
  m_Father: {fileID: 5137370628667965201}
  m_RootOrder: 0
  m_LocalEulerAnglesHint: {x: 0, y: 0, z: 0}
--- !u!114 &3222382460007679161
MonoBehaviour:
  m_ObjectHideFlags: 0
  m_CorrespondingSourceObject: {fileID: 0}
  m_PrefabInstance: {fileID: 0}
  m_PrefabAsset: {fileID: 0}
  m_GameObject: {fileID: 7289152631319494824}
  m_Enabled: 1
  m_EditorHideFlags: 0
  m_Script: {fileID: 11500000, guid: b46c4909cebc470fbcfc052ab0ba2827, type: 3}
  m_Name: 
  m_EditorClassIdentifier: 
  Type: 6
--- !u!1 &8764194338748295452
GameObject:
  m_ObjectHideFlags: 0
  m_CorrespondingSourceObject: {fileID: 0}
  m_PrefabInstance: {fileID: 0}
  m_PrefabAsset: {fileID: 0}
  serializedVersion: 6
  m_Component:
  - component: {fileID: 145728763599178536}
  - component: {fileID: 3448700857692516294}
  m_Layer: 0
  m_Name: Tooltip
  m_TagString: Untagged
  m_Icon: {fileID: 0}
  m_NavMeshLayer: 0
  m_StaticEditorFlags: 0
  m_IsActive: 1
--- !u!4 &145728763599178536
Transform:
  m_ObjectHideFlags: 0
  m_CorrespondingSourceObject: {fileID: 0}
  m_PrefabInstance: {fileID: 0}
  m_PrefabAsset: {fileID: 0}
  m_GameObject: {fileID: 8764194338748295452}
  m_LocalRotation: {x: 0, y: 0, z: 0, w: 1}
  m_LocalPosition: {x: 0.008874592, y: 0.007452289, z: 0.000000007450581}
  m_LocalScale: {x: 1, y: 1, z: 1}
  m_ConstrainProportionsScale: 0
  m_Children: []
  m_Father: {fileID: 3633663611714863459}
  m_RootOrder: 0
  m_LocalEulerAnglesHint: {x: 0, y: 0, z: 0}
--- !u!114 &3448700857692516294
MonoBehaviour:
  m_ObjectHideFlags: 0
  m_CorrespondingSourceObject: {fileID: 0}
  m_PrefabInstance: {fileID: 0}
  m_PrefabAsset: {fileID: 0}
  m_GameObject: {fileID: 8764194338748295452}
  m_Enabled: 1
  m_EditorHideFlags: 0
  m_Script: {fileID: 11500000, guid: b46c4909cebc470fbcfc052ab0ba2827, type: 3}
  m_Name: 
  m_EditorClassIdentifier: 
  Type: 1
--- !u!1 &9042511604004391494
GameObject:
  m_ObjectHideFlags: 0
  m_CorrespondingSourceObject: {fileID: 0}
  m_PrefabInstance: {fileID: 0}
  m_PrefabAsset: {fileID: 0}
  serializedVersion: 6
  m_Component:
  - component: {fileID: 9042511604004391495}
  m_Layer: 0
  m_Name: PointerAnchor
  m_TagString: Untagged
  m_Icon: {fileID: 0}
  m_NavMeshLayer: 0
  m_StaticEditorFlags: 0
  m_IsActive: 1
--- !u!4 &9042511604004391495
Transform:
  m_ObjectHideFlags: 0
  m_CorrespondingSourceObject: {fileID: 0}
  m_PrefabInstance: {fileID: 0}
  m_PrefabAsset: {fileID: 0}
  m_GameObject: {fileID: 9042511604004391494}
  m_LocalRotation: {x: 0, y: 0, z: 0, w: 1}
  m_LocalPosition: {x: 0, y: -0.023, z: -0.027}
  m_LocalScale: {x: 1, y: 1, z: 1}
  m_ConstrainProportionsScale: 0
  m_Children: []
  m_Father: {fileID: 9042511604619950080}
  m_RootOrder: 1
  m_LocalEulerAnglesHint: {x: 0, y: 0, z: 0}
--- !u!1 &9042511604619950085
GameObject:
  m_ObjectHideFlags: 0
  m_CorrespondingSourceObject: {fileID: 0}
  m_PrefabInstance: {fileID: 0}
  m_PrefabAsset: {fileID: 0}
  serializedVersion: 6
  m_Component:
  - component: {fileID: 9042511604619950080}
  - component: {fileID: 9042511604619950083}
  - component: {fileID: 9042511604619950082}
  m_Layer: 0
  m_Name: OculusQuest1ControllerRight
  m_TagString: Untagged
  m_Icon: {fileID: 0}
  m_NavMeshLayer: 0
  m_StaticEditorFlags: 0
  m_IsActive: 1
--- !u!4 &9042511604619950080
Transform:
  m_ObjectHideFlags: 0
  m_CorrespondingSourceObject: {fileID: 0}
  m_PrefabInstance: {fileID: 0}
  m_PrefabAsset: {fileID: 0}
  m_GameObject: {fileID: 9042511604619950085}
  m_LocalRotation: {x: 0, y: 0, z: 0, w: 1}
  m_LocalPosition: {x: 0.346, y: 0.205, z: -0.6942304}
  m_LocalScale: {x: 1, y: 1, z: 1}
  m_ConstrainProportionsScale: 0
  m_Children:
  - {fileID: 8860776296315833826}
  - {fileID: 9042511604004391495}
  - {fileID: 6570429497846329673}
  - {fileID: 7465190618549936018}
  - {fileID: 5158973987219583664}
  m_Father: {fileID: 0}
  m_RootOrder: 0
  m_LocalEulerAnglesHint: {x: 0, y: 0, z: 0}
--- !u!114 &9042511604619950083
MonoBehaviour:
  m_ObjectHideFlags: 0
  m_CorrespondingSourceObject: {fileID: 0}
  m_PrefabInstance: {fileID: 0}
  m_PrefabAsset: {fileID: 0}
  m_GameObject: {fileID: 9042511604619950085}
  m_Enabled: 1
  m_EditorHideFlags: 0
  m_Script: {fileID: 11500000, guid: 926d2692cbf74cefb9bde63d562cf607, type: 3}
  m_Name: 
  m_EditorClassIdentifier: 
  InputDeviceHandler: {fileID: 3177256332137240472}
  CustomPointerAnchor: {fileID: 9042511604004391495}
  PlatformOffsetInfos:
  - Name: Varwin OpenXR Display
    AngleOffset: {x: 0, y: 180, z: 0}
    Anchor: {fileID: 6570429497846329673}
    IsDesktopOnly: 0
  - Name: oculus display
    AngleOffset: {x: 0, y: 0, z: 0}
    Anchor: {fileID: 7465190618549936018}
    IsDesktopOnly: 0
  _controlTooltipHandlers:
  - {fileID: 3945742842364800389}
  - {fileID: 6086421622642040663}
  - {fileID: 2903345432975282998}
  - {fileID: 3020320465460687923}
  - {fileID: 508127937608615476}
  - {fileID: 9110093919165062988}
  - {fileID: 3222382460007679161}
  - {fileID: 5613192981311094439}
  - {fileID: 3448700857692516294}
  TeleportOnThumbstick: 1
  Is3Dof: 0
  GrabAnchor: {fileID: 4694125276827089904}
--- !u!114 &9042511604619950082
MonoBehaviour:
  m_ObjectHideFlags: 0
  m_CorrespondingSourceObject: {fileID: 0}
  m_PrefabInstance: {fileID: 0}
  m_PrefabAsset: {fileID: 0}
  m_GameObject: {fileID: 9042511604619950085}
  m_Enabled: 1
  m_EditorHideFlags: 0
  m_Script: {fileID: 11500000, guid: e92dc823f4034a4dabdef690e2c1a7c0, type: 3}
  m_Name: 
  m_EditorClassIdentifier: 
  Animator: {fileID: 3177256332137240472}
  Indicators:
  - {fileID: 9042511604618766879}
  - {fileID: 9042511604618766878}
  - {fileID: 9042511606066416099}
  - {fileID: 9042511606066416096}
  TimeSwitching: 0.05
--- !u!1001 &9042511604618766857
PrefabInstance:
  m_ObjectHideFlags: 0
  serializedVersion: 2
  m_Modification:
    m_TransformParent: {fileID: 9042511604619950080}
    m_Modifications:
    - target: {fileID: -8679921383154817045, guid: f066f92ef11fa764bb76895e2e30f85d,
        type: 3}
      propertyPath: m_RootOrder
      value: 0
      objectReference: {fileID: 0}
    - target: {fileID: -8679921383154817045, guid: f066f92ef11fa764bb76895e2e30f85d,
        type: 3}
      propertyPath: m_LocalScale.x
      value: -1
      objectReference: {fileID: 0}
    - target: {fileID: -8679921383154817045, guid: f066f92ef11fa764bb76895e2e30f85d,
        type: 3}
      propertyPath: m_LocalPosition.x
      value: 0
      objectReference: {fileID: 0}
    - target: {fileID: -8679921383154817045, guid: f066f92ef11fa764bb76895e2e30f85d,
        type: 3}
      propertyPath: m_LocalPosition.y
      value: 0
      objectReference: {fileID: 0}
    - target: {fileID: -8679921383154817045, guid: f066f92ef11fa764bb76895e2e30f85d,
        type: 3}
      propertyPath: m_LocalPosition.z
      value: 0
      objectReference: {fileID: 0}
    - target: {fileID: -8679921383154817045, guid: f066f92ef11fa764bb76895e2e30f85d,
        type: 3}
      propertyPath: m_LocalRotation.w
      value: 1
      objectReference: {fileID: 0}
    - target: {fileID: -8679921383154817045, guid: f066f92ef11fa764bb76895e2e30f85d,
        type: 3}
      propertyPath: m_LocalRotation.x
      value: -0
      objectReference: {fileID: 0}
    - target: {fileID: -8679921383154817045, guid: f066f92ef11fa764bb76895e2e30f85d,
        type: 3}
      propertyPath: m_LocalRotation.y
      value: -0
      objectReference: {fileID: 0}
    - target: {fileID: -8679921383154817045, guid: f066f92ef11fa764bb76895e2e30f85d,
        type: 3}
      propertyPath: m_LocalRotation.z
      value: -0
      objectReference: {fileID: 0}
    - target: {fileID: -8679921383154817045, guid: f066f92ef11fa764bb76895e2e30f85d,
        type: 3}
      propertyPath: m_LocalEulerAnglesHint.x
      value: 0
      objectReference: {fileID: 0}
    - target: {fileID: -8679921383154817045, guid: f066f92ef11fa764bb76895e2e30f85d,
        type: 3}
      propertyPath: m_LocalEulerAnglesHint.y
      value: 0
      objectReference: {fileID: 0}
    - target: {fileID: -8679921383154817045, guid: f066f92ef11fa764bb76895e2e30f85d,
        type: 3}
      propertyPath: m_LocalEulerAnglesHint.z
      value: 0
      objectReference: {fileID: 0}
    - target: {fileID: -7761653290824669072, guid: f066f92ef11fa764bb76895e2e30f85d,
        type: 3}
      propertyPath: m_Materials.Array.data[0]
      value: 
      objectReference: {fileID: 2100000, guid: 857bccbcd4080c3428a7b2b47aa9ce0d, type: 2}
    - target: {fileID: -4796266564536600923, guid: f066f92ef11fa764bb76895e2e30f85d,
        type: 3}
      propertyPath: m_Materials.Array.data[0]
      value: 
      objectReference: {fileID: 2100000, guid: 857bccbcd4080c3428a7b2b47aa9ce0d, type: 2}
    - target: {fileID: -1983120319597383265, guid: f066f92ef11fa764bb76895e2e30f85d,
        type: 3}
      propertyPath: m_Materials.Array.data[0]
      value: 
      objectReference: {fileID: 2100000, guid: 857bccbcd4080c3428a7b2b47aa9ce0d, type: 2}
    - target: {fileID: 919132149155446097, guid: f066f92ef11fa764bb76895e2e30f85d,
        type: 3}
      propertyPath: m_Name
      value: Oculus_quest_controller_left
      objectReference: {fileID: 0}
    - target: {fileID: 2545228181402026268, guid: f066f92ef11fa764bb76895e2e30f85d,
        type: 3}
      propertyPath: m_Mesh
      value: 
      objectReference: {fileID: -1400252653696632910, guid: b6b6e82f462f28a42aad856bd2159f95,
        type: 3}
    - target: {fileID: 2545228181402026268, guid: f066f92ef11fa764bb76895e2e30f85d,
        type: 3}
      propertyPath: m_Materials.Array.data[0]
      value: 
      objectReference: {fileID: 2100000, guid: 98f191acca91cc14ebcd02c5c1277539, type: 2}
    - target: {fileID: 2628389529492363703, guid: f066f92ef11fa764bb76895e2e30f85d,
        type: 3}
      propertyPath: m_LocalPosition.x
      value: -0.008
      objectReference: {fileID: 0}
    - target: {fileID: 2680031633361485198, guid: f066f92ef11fa764bb76895e2e30f85d,
        type: 3}
      propertyPath: m_Materials.Array.data[0]
      value: 
      objectReference: {fileID: 2100000, guid: 857bccbcd4080c3428a7b2b47aa9ce0d, type: 2}
    - target: {fileID: 5302020411613980871, guid: f066f92ef11fa764bb76895e2e30f85d,
        type: 3}
      propertyPath: m_Materials.Array.data[0]
      value: 
      objectReference: {fileID: 2100000, guid: 857bccbcd4080c3428a7b2b47aa9ce0d, type: 2}
    - target: {fileID: 5866666021909216657, guid: f066f92ef11fa764bb76895e2e30f85d,
        type: 3}
      propertyPath: m_Controller
      value: 
      objectReference: {fileID: 9100000, guid: e276c40c89760d649b5e4303bf18c043, type: 2}
    - target: {fileID: 7269875724241359754, guid: f066f92ef11fa764bb76895e2e30f85d,
        type: 3}
      propertyPath: m_Materials.Array.data[0]
      value: 
      objectReference: {fileID: 2100000, guid: 857bccbcd4080c3428a7b2b47aa9ce0d, type: 2}
    - target: {fileID: 8452402308636366295, guid: f066f92ef11fa764bb76895e2e30f85d,
        type: 3}
      propertyPath: m_Materials.Array.data[0]
      value: 
      objectReference: {fileID: 2100000, guid: 857bccbcd4080c3428a7b2b47aa9ce0d, type: 2}
    m_RemovedComponents: []
  m_SourcePrefab: {fileID: 100100000, guid: f066f92ef11fa764bb76895e2e30f85d, type: 3}
--- !u!95 &3177256332137240472 stripped
Animator:
  m_CorrespondingSourceObject: {fileID: 5866666021909216657, guid: f066f92ef11fa764bb76895e2e30f85d,
    type: 3}
  m_PrefabInstance: {fileID: 9042511604618766857}
  m_PrefabAsset: {fileID: 0}
--- !u!4 &3633663611714863459 stripped
Transform:
  m_CorrespondingSourceObject: {fileID: 5697099333093108586, guid: f066f92ef11fa764bb76895e2e30f85d,
    type: 3}
  m_PrefabInstance: {fileID: 9042511604618766857}
  m_PrefabAsset: {fileID: 0}
--- !u!1 &3782637582511512033 stripped
GameObject:
  m_CorrespondingSourceObject: {fileID: 5261282651423257576, guid: f066f92ef11fa764bb76895e2e30f85d,
    type: 3}
  m_PrefabInstance: {fileID: 9042511604618766857}
  m_PrefabAsset: {fileID: 0}
--- !u!114 &9042511604618766879
MonoBehaviour:
  m_ObjectHideFlags: 0
  m_CorrespondingSourceObject: {fileID: 0}
  m_PrefabInstance: {fileID: 0}
  m_PrefabAsset: {fileID: 0}
  m_GameObject: {fileID: 3782637582511512033}
  m_Enabled: 1
  m_EditorHideFlags: 0
  m_Script: {fileID: 11500000, guid: 42a14b2b31e04e42ace502a2acb818ea, type: 3}
  m_Name: 
  m_EditorClassIdentifier: 
  PrimaryInputFeatureName: PrimaryButton
  LayerIndex: 4
  AnimatorParameterName: ButtonA
--- !u!4 &5137370628667965201 stripped
Transform:
  m_CorrespondingSourceObject: {fileID: -5028568896964045544, guid: f066f92ef11fa764bb76895e2e30f85d,
    type: 3}
  m_PrefabInstance: {fileID: 9042511604618766857}
  m_PrefabAsset: {fileID: 0}
--- !u!4 &5617707984657087242 stripped
Transform:
  m_CorrespondingSourceObject: {fileID: -5725359627424870141, guid: f066f92ef11fa764bb76895e2e30f85d,
    type: 3}
  m_PrefabInstance: {fileID: 9042511604618766857}
  m_PrefabAsset: {fileID: 0}
--- !u!1 &5833033722195249213 stripped
GameObject:
  m_CorrespondingSourceObject: {fileID: -5940690844839009740, guid: f066f92ef11fa764bb76895e2e30f85d,
    type: 3}
  m_PrefabInstance: {fileID: 9042511604618766857}
  m_PrefabAsset: {fileID: 0}
--- !u!114 &9042511604618766878
MonoBehaviour:
  m_ObjectHideFlags: 0
  m_CorrespondingSourceObject: {fileID: 0}
  m_PrefabInstance: {fileID: 0}
  m_PrefabAsset: {fileID: 0}
  m_GameObject: {fileID: 5833033722195249213}
  m_Enabled: 1
  m_EditorHideFlags: 0
  m_Script: {fileID: 11500000, guid: 42a14b2b31e04e42ace502a2acb818ea, type: 3}
  m_Name: 
  m_EditorClassIdentifier: 
  PrimaryInputFeatureName: SecondaryButton
  LayerIndex: 5
  AnimatorParameterName: ButtonB
--- !u!1 &6188086912073772598 stripped
GameObject:
  m_CorrespondingSourceObject: {fileID: 2926763783881786431, guid: f066f92ef11fa764bb76895e2e30f85d,
    type: 3}
  m_PrefabInstance: {fileID: 9042511604618766857}
  m_PrefabAsset: {fileID: 0}
--- !u!114 &9042511606066416096
MonoBehaviour:
  m_ObjectHideFlags: 0
  m_CorrespondingSourceObject: {fileID: 0}
  m_PrefabInstance: {fileID: 0}
  m_PrefabAsset: {fileID: 0}
  m_GameObject: {fileID: 6188086912073772598}
  m_Enabled: 1
  m_EditorHideFlags: 0
  m_Script: {fileID: 11500000, guid: 42a14b2b31e04e42ace502a2acb818ea, type: 3}
  m_Name: 
  m_EditorClassIdentifier: 
  PrimaryInputFeatureName: Primary2DAxisTouch
  LayerIndex: 2
  AnimatorParameterName: 
--- !u!114 &9042511606066416099
MonoBehaviour:
  m_ObjectHideFlags: 0
  m_CorrespondingSourceObject: {fileID: 0}
  m_PrefabInstance: {fileID: 0}
  m_PrefabAsset: {fileID: 0}
  m_GameObject: {fileID: 6188086912073772598}
  m_Enabled: 1
  m_EditorHideFlags: 0
  m_Script: {fileID: 11500000, guid: fb959ab8eca546139141a13f20354e8e, type: 3}
  m_Name: 
  m_EditorClassIdentifier: 
  PrimaryInputFeatureName: Primary2DAxis
  LayerIndex: 2
  AnimatorParameterXName: AxisX
  AnimatorParameterYName: AxisY
  InvertedX: 1
  InvertedY: 0
--- !u!1 &7131041985600424545 stripped
GameObject:
  m_CorrespondingSourceObject: {fileID: 2273183675388141672, guid: f066f92ef11fa764bb76895e2e30f85d,
    type: 3}
  m_PrefabInstance: {fileID: 9042511604618766857}
  m_PrefabAsset: {fileID: 0}
--- !u!114 &472160372164740736
MonoBehaviour:
  m_ObjectHideFlags: 0
  m_CorrespondingSourceObject: {fileID: 0}
  m_PrefabInstance: {fileID: 0}
  m_PrefabAsset: {fileID: 0}
  m_GameObject: {fileID: 7131041985600424545}
  m_Enabled: 1
  m_EditorHideFlags: 0
  m_Script: {fileID: 11500000, guid: 7fbc17ab92734d1fbb0edb12e8e31bbd, type: 3}
  m_Name: 
  m_EditorClassIdentifier: 
  PrimaryInputFeatureName: Trigger
  LayerIndex: 0
  AnimatorParameterName: Trigger
--- !u!4 &7354725456428036285 stripped
Transform:
  m_CorrespondingSourceObject: {fileID: 1976041957269199540, guid: f066f92ef11fa764bb76895e2e30f85d,
    type: 3}
  m_PrefabInstance: {fileID: 9042511604618766857}
  m_PrefabAsset: {fileID: 0}
--- !u!1 &7379025303398111731 stripped
GameObject:
  m_CorrespondingSourceObject: {fileID: 1953124144900994042, guid: f066f92ef11fa764bb76895e2e30f85d,
    type: 3}
  m_PrefabInstance: {fileID: 9042511604618766857}
  m_PrefabAsset: {fileID: 0}
--- !u!114 &9042511604618766849
MonoBehaviour:
  m_ObjectHideFlags: 0
  m_CorrespondingSourceObject: {fileID: 0}
  m_PrefabInstance: {fileID: 0}
  m_PrefabAsset: {fileID: 0}
  m_GameObject: {fileID: 7379025303398111731}
  m_Enabled: 1
  m_EditorHideFlags: 0
  m_Script: {fileID: 11500000, guid: 7fbc17ab92734d1fbb0edb12e8e31bbd, type: 3}
  m_Name: 
  m_EditorClassIdentifier: 
  PrimaryInputFeatureName: Grip
  LayerIndex: 3
  AnimatorParameterName: Grip
--- !u!4 &7488588196213178971 stripped
Transform:
  m_CorrespondingSourceObject: {fileID: 1914517118269679698, guid: f066f92ef11fa764bb76895e2e30f85d,
    type: 3}
  m_PrefabInstance: {fileID: 9042511604618766857}
  m_PrefabAsset: {fileID: 0}
--- !u!4 &7524636965203663559 stripped
Transform:
  m_CorrespondingSourceObject: {fileID: -7705213561569873714, guid: f066f92ef11fa764bb76895e2e30f85d,
    type: 3}
  m_PrefabInstance: {fileID: 9042511604618766857}
  m_PrefabAsset: {fileID: 0}
--- !u!4 &7976146565822788045 stripped
Transform:
  m_CorrespondingSourceObject: {fileID: 1426941173653019588, guid: f066f92ef11fa764bb76895e2e30f85d,
    type: 3}
  m_PrefabInstance: {fileID: 9042511604618766857}
  m_PrefabAsset: {fileID: 0}
--- !u!4 &8860776296315833826 stripped
Transform:
  m_CorrespondingSourceObject: {fileID: -8679921383154817045, guid: f066f92ef11fa764bb76895e2e30f85d,
    type: 3}
  m_PrefabInstance: {fileID: 9042511604618766857}
  m_PrefabAsset: {fileID: 0}
