{
  "ObjectsToBuild": [
    {
      "ObjectName": "FoodChain4",
      "ObjectGuid": "a781e090-1635-4330-88e0-9b8a9db4e25e",
      "PrefabPath": "Assets/Objects/FoodChain4/FoodChain4.prefab",
      "RootGuid": "a781e090-1635-4330-88e0-9b8a9db4e25e",
      "NewGuid": "c66d89bf-cd90-4067-95d5-2d6200bb266c",
      "FolderPath": "Assets/Objects/FoodChain4",
      "ConfigBlockly": "{\"Name\":{\"en\":\"Food Chain 4\",\"ru\":\"Пищевая цепочка 4\"},\"Description\":{\"en\":\"Food Chain 4\",\"ru\":\"Пищевая цепочка 4\"},\"Guid\":\"c66d89bf-cd90-4067-95d5-2d6200bb266c\",\"RootGuid\":\"a781e090-1635-4330-88e0-9b8a9db4e25e\",\"Locked\":false,\"Embedded\":false,\"MobileReady\":true,\"LinuxReady\":false,\"SourcesIncluded\":false,\"DisableSceneLogic\":false,\"Config\":{\"type\":\"FoodChain4_a781e0901635433088e09b8a9db4e25e.FoodChain4Wrapper\",\"blocks\":[{\"name\":\"FoodChainController_0_IsCompleteGetter\",\"type\":\"getter\",\"isCoroutine\":false,\"isObsolete\":false,\"items\":[{\"i18n\":{\"en\":\"Is Complete\",\"ru\":\"Цепочка завершена\"},\"property\":\"FoodChainController_0_IsComplete\"}],\"valueType\":\"System.Boolean\"},{\"name\":\"FoodChainController_0_IsCompleteSetter\",\"type\":\"setter\",\"isCoroutine\":false,\"isObsolete\":false,\"items\":[{\"i18n\":{\"en\":\"Is Complete\",\"ru\":\"Цепочка завершена\"},\"property\":\"FoodChainController_0_IsComplete\"}],\"valueType\":\"System.Boolean\"},{\"name\":\"FoodChainController_0_onCompleteEvent\",\"type\":\"eventWithArguments\",\"isCoroutine\":false,\"isObsolete\":false,\"items\":[{\"method\":\"FoodChainController_0_onCompleteEvent\",\"i18n\":{\"en\":\"On complete\",\"ru\":\"Событие цепочка собрана\"}}],\"params\":[{\"name\":\"sender\",\"valueType\":\"Varwin.Wrapper\",\"i18n\":{\"en\":\"Food Chain 4\",\"cn\":\"Food Chain 4\",\"ko\":\"Food Chain 4\",\"ru\":\"Пищевая цепочка 4\"}}]}]},\"Author\":{\"Name\":\"Anonymous\",\"Email\":\"\",\"Url\":\"\"},\"License\":{\"Code\":\"cc-by\",\"Version\":\"4.0\"},\"BuiltAt\":\"2024-06-17T17:57:04Z\",\"SdkVersion\":\"17.7.77\",\"UnityVersion\":\"2021.3.0f1\",\"Changelog\":{\"en\":\"\",\"ru\":\"\"}}",
      "ConfigAssetBundle": "{\"AssetName\":\"FoodChain4\",\"Assembly\":[\"Scripts_e8911fa6862b449ab895fa5fc806cad5_30a28b6a.dll\",\"FoodChain4_a781e0901635433088e09b8a9db4e25e.dll\"]}",
      "StartTime": "2024-06-17T20:57:03.0397525+03:00",
      "HasError": false,
      "Assemblies": [
        "D:/Projects/Glint/Glint Unity/Library/ScriptAssemblies/FoodChain4_a781e0901635433088e09b8a9db4e25e.dll",
        "D:/Projects/Glint/Glint Unity/Library/ScriptAssemblies/Scripts_e8911fa6862b449ab895fa5fc806cad5_30a28b6a.dll"
      ],
      "TagsPath": "Assets/Objects/FoodChain4/tags.txt",
      "IconPath": "Assets/Objects/FoodChain4/icon.png"
    }
  ],
  "CurrentBuildingSceneIndex": 0,
  "CompletedStateCount": 12,
  "BuildType": "Default",
  "Data": {
    "OldAssemblyNames": [
      "FoodChain4_a781e0901635433088e09b8a9db4e25e",
      "Scripts_e8911fa6862b449ab895fa5fc806cad5"
    ],
    "NewAssemblyNames": [
      "FoodChain4_a781e0901635433088e09b8a9db4e25e",
      "Scripts_e8911fa6862b449ab895fa5fc806cad5_30a28b6a"
    ]
  },
  "Progress": 0.75,
  "Label": "Building asset bundles...",
  "DisplayProgress": 0.742321134,
  "IsFinished": false,
  "IsStopped": false,
  "StateCount": 16
}