%YAML 1.1
%TAG !u! tag:unity3d.com,2011:
--- !u!1 &996048724503081530
GameObject:
  m_ObjectHideFlags: 0
  m_CorrespondingSourceObject: {fileID: 0}
  m_PrefabInstance: {fileID: 0}
  m_PrefabAsset: {fileID: 0}
  serializedVersion: 6
  m_Component:
  - component: {fileID: 3919083100237723911}
  - component: {fileID: 6540843727516056247}
  m_Layer: 0
  m_Name: Tooltip
  m_TagString: Untagged
  m_Icon: {fileID: 0}
  m_NavMeshLayer: 0
  m_StaticEditorFlags: 0
  m_IsActive: 1
--- !u!4 &3919083100237723911
Transform:
  m_ObjectHideFlags: 0
  m_CorrespondingSourceObject: {fileID: 0}
  m_PrefabInstance: {fileID: 0}
  m_PrefabAsset: {fileID: 0}
  m_GameObject: {fileID: 996048724503081530}
  m_LocalRotation: {x: 0, y: 0, z: 0, w: 1}
  m_LocalPosition: {x: 0, y: 0, z: 0}
  m_LocalScale: {x: 1, y: 1, z: 1}
  m_ConstrainProportionsScale: 0
  m_Children: []
  m_Father: {fileID: 6252541584641871654}
  m_RootOrder: 0
  m_LocalEulerAnglesHint: {x: 0, y: 0, z: 0}
--- !u!114 &6540843727516056247
MonoBehaviour:
  m_ObjectHideFlags: 0
  m_CorrespondingSourceObject: {fileID: 0}
  m_PrefabInstance: {fileID: 0}
  m_PrefabAsset: {fileID: 0}
  m_GameObject: {fileID: 996048724503081530}
  m_Enabled: 1
  m_EditorHideFlags: 0
  m_Script: {fileID: 11500000, guid: b46c4909cebc470fbcfc052ab0ba2827, type: 3}
  m_Name: 
  m_EditorClassIdentifier: 
  Type: 4
--- !u!1 &1080210048611032504
GameObject:
  m_ObjectHideFlags: 0
  m_CorrespondingSourceObject: {fileID: 0}
  m_PrefabInstance: {fileID: 0}
  m_PrefabAsset: {fileID: 0}
  serializedVersion: 6
  m_Component:
  - component: {fileID: 8102932944562563385}
  - component: {fileID: 1477899390473038815}
  m_Layer: 0
  m_Name: Tooltip
  m_TagString: Untagged
  m_Icon: {fileID: 0}
  m_NavMeshLayer: 0
  m_StaticEditorFlags: 0
  m_IsActive: 1
--- !u!4 &8102932944562563385
Transform:
  m_ObjectHideFlags: 0
  m_CorrespondingSourceObject: {fileID: 0}
  m_PrefabInstance: {fileID: 0}
  m_PrefabAsset: {fileID: 0}
  m_GameObject: {fileID: 1080210048611032504}
  m_LocalRotation: {x: 0, y: 0, z: 0, w: 1}
  m_LocalPosition: {x: 0.00806744, y: 0.0032620328, z: 0.0000000018626451}
  m_LocalScale: {x: 1, y: 1, z: 1}
  m_ConstrainProportionsScale: 0
  m_Children: []
  m_Father: {fileID: 6297831121372358504}
  m_RootOrder: 0
  m_LocalEulerAnglesHint: {x: 0, y: 0, z: 0}
--- !u!114 &1477899390473038815
MonoBehaviour:
  m_ObjectHideFlags: 0
  m_CorrespondingSourceObject: {fileID: 0}
  m_PrefabInstance: {fileID: 0}
  m_PrefabAsset: {fileID: 0}
  m_GameObject: {fileID: 1080210048611032504}
  m_Enabled: 1
  m_EditorHideFlags: 0
  m_Script: {fileID: 11500000, guid: b46c4909cebc470fbcfc052ab0ba2827, type: 3}
  m_Name: 
  m_EditorClassIdentifier: 
  Type: 1
--- !u!1 &3618637612552914670
GameObject:
  m_ObjectHideFlags: 0
  m_CorrespondingSourceObject: {fileID: 0}
  m_PrefabInstance: {fileID: 0}
  m_PrefabAsset: {fileID: 0}
  serializedVersion: 6
  m_Component:
  - component: {fileID: 8734467386927683417}
  - component: {fileID: 2443470526616515418}
  m_Layer: 0
  m_Name: Tooltip
  m_TagString: Untagged
  m_Icon: {fileID: 0}
  m_NavMeshLayer: 0
  m_StaticEditorFlags: 0
  m_IsActive: 1
--- !u!4 &8734467386927683417
Transform:
  m_ObjectHideFlags: 0
  m_CorrespondingSourceObject: {fileID: 0}
  m_PrefabInstance: {fileID: 0}
  m_PrefabAsset: {fileID: 0}
  m_GameObject: {fileID: 3618637612552914670}
  m_LocalRotation: {x: 0, y: 0, z: 0, w: 1}
  m_LocalPosition: {x: 0, y: 0, z: 0}
  m_LocalScale: {x: 1, y: 1, z: 1}
  m_ConstrainProportionsScale: 0
  m_Children: []
  m_Father: {fileID: 1891298922429364916}
  m_RootOrder: 0
  m_LocalEulerAnglesHint: {x: 0, y: 0, z: 0}
--- !u!114 &2443470526616515418
MonoBehaviour:
  m_ObjectHideFlags: 0
  m_CorrespondingSourceObject: {fileID: 0}
  m_PrefabInstance: {fileID: 0}
  m_PrefabAsset: {fileID: 0}
  m_GameObject: {fileID: 3618637612552914670}
  m_Enabled: 1
  m_EditorHideFlags: 0
  m_Script: {fileID: 11500000, guid: b46c4909cebc470fbcfc052ab0ba2827, type: 3}
  m_Name: 
  m_EditorClassIdentifier: 
  Type: 8
--- !u!1 &3961046621849010940
GameObject:
  m_ObjectHideFlags: 0
  m_CorrespondingSourceObject: {fileID: 0}
  m_PrefabInstance: {fileID: 0}
  m_PrefabAsset: {fileID: 0}
  serializedVersion: 6
  m_Component:
  - component: {fileID: 279804913049031855}
  m_Layer: 0
  m_Name: GrabAnchor
  m_TagString: Untagged
  m_Icon: {fileID: 0}
  m_NavMeshLayer: 0
  m_StaticEditorFlags: 0
  m_IsActive: 1
--- !u!4 &279804913049031855
Transform:
  m_ObjectHideFlags: 0
  m_CorrespondingSourceObject: {fileID: 0}
  m_PrefabInstance: {fileID: 0}
  m_PrefabAsset: {fileID: 0}
  m_GameObject: {fileID: 3961046621849010940}
  m_LocalRotation: {x: -0.043386772, y: -0, z: -0, w: 0.9990584}
  m_LocalPosition: {x: 0, y: -0.0038000047, z: -0.1144}
  m_LocalScale: {x: 1, y: 1, z: 1}
  m_ConstrainProportionsScale: 0
  m_Children: []
  m_Father: {fileID: 6252541585700315719}
  m_RootOrder: 3
  m_LocalEulerAnglesHint: {x: -4.973, y: 0, z: 0}
--- !u!1 &3969082090681823045
GameObject:
  m_ObjectHideFlags: 0
  m_CorrespondingSourceObject: {fileID: 0}
  m_PrefabInstance: {fileID: 0}
  m_PrefabAsset: {fileID: 0}
  serializedVersion: 6
  m_Component:
  - component: {fileID: 423632345199374170}
  - component: {fileID: 390259760674648704}
  - component: {fileID: 5229368046195328895}
  m_Layer: 0
  m_Name: Tooltip
  m_TagString: Untagged
  m_Icon: {fileID: 0}
  m_NavMeshLayer: 0
  m_StaticEditorFlags: 0
  m_IsActive: 1
--- !u!4 &423632345199374170
Transform:
  m_ObjectHideFlags: 0
  m_CorrespondingSourceObject: {fileID: 0}
  m_PrefabInstance: {fileID: 0}
  m_PrefabAsset: {fileID: 0}
  m_GameObject: {fileID: 3969082090681823045}
  m_LocalRotation: {x: 0, y: 0, z: 0, w: 1}
  m_LocalPosition: {x: 0.0037115817, y: -0.0028163195, z: 0.00016259507}
  m_LocalScale: {x: 1, y: 1, z: 1}
  m_ConstrainProportionsScale: 0
  m_Children: []
  m_Father: {fileID: 2819153491326582915}
  m_RootOrder: 0
  m_LocalEulerAnglesHint: {x: 0, y: 0, z: 0}
--- !u!114 &390259760674648704
MonoBehaviour:
  m_ObjectHideFlags: 0
  m_CorrespondingSourceObject: {fileID: 0}
  m_PrefabInstance: {fileID: 0}
  m_PrefabAsset: {fileID: 0}
  m_GameObject: {fileID: 3969082090681823045}
  m_Enabled: 1
  m_EditorHideFlags: 0
  m_Script: {fileID: 11500000, guid: b46c4909cebc470fbcfc052ab0ba2827, type: 3}
  m_Name: 
  m_EditorClassIdentifier: 
  Type: 3
--- !u!114 &5229368046195328895
MonoBehaviour:
  m_ObjectHideFlags: 0
  m_CorrespondingSourceObject: {fileID: 0}
  m_PrefabInstance: {fileID: 0}
  m_PrefabAsset: {fileID: 0}
  m_GameObject: {fileID: 3969082090681823045}
  m_Enabled: 1
  m_EditorHideFlags: 0
  m_Script: {fileID: 11500000, guid: b46c4909cebc470fbcfc052ab0ba2827, type: 3}
  m_Name: 
  m_EditorClassIdentifier: 
  Type: 2
--- !u!1 &4164551276390611747
GameObject:
  m_ObjectHideFlags: 0
  m_CorrespondingSourceObject: {fileID: 0}
  m_PrefabInstance: {fileID: 0}
  m_PrefabAsset: {fileID: 0}
  serializedVersion: 6
  m_Component:
  - component: {fileID: 7513689488566503623}
  - component: {fileID: 3752719644525970272}
  m_Layer: 0
  m_Name: Tooltip
  m_TagString: Untagged
  m_Icon: {fileID: 0}
  m_NavMeshLayer: 0
  m_StaticEditorFlags: 0
  m_IsActive: 1
--- !u!4 &7513689488566503623
Transform:
  m_ObjectHideFlags: 0
  m_CorrespondingSourceObject: {fileID: 0}
  m_PrefabInstance: {fileID: 0}
  m_PrefabAsset: {fileID: 0}
  m_GameObject: {fileID: 4164551276390611747}
  m_LocalRotation: {x: 0, y: 0, z: 0, w: 1}
  m_LocalPosition: {x: -0.011922105, y: 0.0000004665926, z: 0.0000013648532}
  m_LocalScale: {x: 1, y: 1, z: 1}
  m_ConstrainProportionsScale: 0
  m_Children: []
  m_Father: {fileID: 3525216073075807963}
  m_RootOrder: 0
  m_LocalEulerAnglesHint: {x: 0, y: 0, z: 0}
--- !u!114 &3752719644525970272
MonoBehaviour:
  m_ObjectHideFlags: 0
  m_CorrespondingSourceObject: {fileID: 0}
  m_PrefabInstance: {fileID: 0}
  m_PrefabAsset: {fileID: 0}
  m_GameObject: {fileID: 4164551276390611747}
  m_Enabled: 1
  m_EditorHideFlags: 0
  m_Script: {fileID: 11500000, guid: b46c4909cebc470fbcfc052ab0ba2827, type: 3}
  m_Name: 
  m_EditorClassIdentifier: 
  Type: 10
--- !u!1 &4415181648123668768
GameObject:
  m_ObjectHideFlags: 0
  m_CorrespondingSourceObject: {fileID: 0}
  m_PrefabInstance: {fileID: 0}
  m_PrefabAsset: {fileID: 0}
  serializedVersion: 6
  m_Component:
  - component: {fileID: 8886451095664668438}
  - component: {fileID: 8371071278865663605}
  - component: {fileID: 4993552939196060723}
  m_Layer: 0
  m_Name: Tooltip
  m_TagString: Untagged
  m_Icon: {fileID: 0}
  m_NavMeshLayer: 0
  m_StaticEditorFlags: 0
  m_IsActive: 1
--- !u!4 &8886451095664668438
Transform:
  m_ObjectHideFlags: 0
  m_CorrespondingSourceObject: {fileID: 0}
  m_PrefabInstance: {fileID: 0}
  m_PrefabAsset: {fileID: 0}
  m_GameObject: {fileID: 4415181648123668768}
  m_LocalRotation: {x: 0, y: 0, z: 0, w: 1}
  m_LocalPosition: {x: 0, y: 0, z: 0}
  m_LocalScale: {x: 1, y: 1, z: 1}
  m_ConstrainProportionsScale: 0
  m_Children: []
  m_Father: {fileID: 8709542147418359187}
  m_RootOrder: 0
  m_LocalEulerAnglesHint: {x: 0, y: 0, z: 0}
--- !u!114 &8371071278865663605
MonoBehaviour:
  m_ObjectHideFlags: 0
  m_CorrespondingSourceObject: {fileID: 0}
  m_PrefabInstance: {fileID: 0}
  m_PrefabAsset: {fileID: 0}
  m_GameObject: {fileID: 4415181648123668768}
  m_Enabled: 1
  m_EditorHideFlags: 0
  m_Script: {fileID: 11500000, guid: b46c4909cebc470fbcfc052ab0ba2827, type: 3}
  m_Name: 
  m_EditorClassIdentifier: 
  Type: 7
--- !u!114 &4993552939196060723
MonoBehaviour:
  m_ObjectHideFlags: 0
  m_CorrespondingSourceObject: {fileID: 0}
  m_PrefabInstance: {fileID: 0}
  m_PrefabAsset: {fileID: 0}
  m_GameObject: {fileID: 4415181648123668768}
  m_Enabled: 1
  m_EditorHideFlags: 0
  m_Script: {fileID: 11500000, guid: b46c4909cebc470fbcfc052ab0ba2827, type: 3}
  m_Name: 
  m_EditorClassIdentifier: 
  Type: 9
--- !u!1 &5739262110000578365
GameObject:
  m_ObjectHideFlags: 0
  m_CorrespondingSourceObject: {fileID: 0}
  m_PrefabInstance: {fileID: 0}
  m_PrefabAsset: {fileID: 0}
  serializedVersion: 6
  m_Component:
  - component: {fileID: 8118950994832561212}
  - component: {fileID: 840663578892742093}
  m_Layer: 0
  m_Name: Tooltip
  m_TagString: Untagged
  m_Icon: {fileID: 0}
  m_NavMeshLayer: 0
  m_StaticEditorFlags: 0
  m_IsActive: 1
--- !u!4 &8118950994832561212
Transform:
  m_ObjectHideFlags: 0
  m_CorrespondingSourceObject: {fileID: 0}
  m_PrefabInstance: {fileID: 0}
  m_PrefabAsset: {fileID: 0}
  m_GameObject: {fileID: 5739262110000578365}
  m_LocalRotation: {x: 0, y: 0, z: 0, w: 1}
  m_LocalPosition: {x: 0.0013448589, y: 0.00000003632158, z: -0.0000005538459}
  m_LocalScale: {x: 1, y: 1, z: 1}
  m_ConstrainProportionsScale: 0
  m_Children: []
  m_Father: {fileID: 5547913378584876371}
  m_RootOrder: 0
  m_LocalEulerAnglesHint: {x: 0, y: 0, z: 0}
--- !u!114 &840663578892742093
MonoBehaviour:
  m_ObjectHideFlags: 0
  m_CorrespondingSourceObject: {fileID: 0}
  m_PrefabInstance: {fileID: 0}
  m_PrefabAsset: {fileID: 0}
  m_GameObject: {fileID: 5739262110000578365}
  m_Enabled: 1
  m_EditorHideFlags: 0
  m_Script: {fileID: 11500000, guid: b46c4909cebc470fbcfc052ab0ba2827, type: 3}
  m_Name: 
  m_EditorClassIdentifier: 
  Type: 5
--- !u!1 &6252541584449068582
GameObject:
  m_ObjectHideFlags: 0
  m_CorrespondingSourceObject: {fileID: 0}
  m_PrefabInstance: {fileID: 0}
  m_PrefabAsset: {fileID: 0}
  serializedVersion: 6
  m_Component:
  - component: {fileID: 6252541584449068581}
  m_Layer: 0
  m_Name: OpenXRAnchor
  m_TagString: Untagged
  m_Icon: {fileID: 0}
  m_NavMeshLayer: 0
  m_StaticEditorFlags: 0
  m_IsActive: 1
--- !u!4 &6252541584449068581
Transform:
  m_ObjectHideFlags: 0
  m_CorrespondingSourceObject: {fileID: 0}
  m_PrefabInstance: {fileID: 0}
  m_PrefabAsset: {fileID: 0}
  m_GameObject: {fileID: 6252541584449068582}
  m_LocalRotation: {x: 0.005693477, y: -0.9905013, z: 0.043246236, w: 0.13040203}
  m_LocalPosition: {x: 0, y: -0.015000001, z: -0.08}
  m_LocalScale: {x: 1, y: 1, z: 1}
  m_ConstrainProportionsScale: 0
  m_Children: []
  m_Father: {fileID: 6252541585700315719}
  m_RootOrder: 1
  m_LocalEulerAnglesHint: {x: 5, y: -165, z: 0}
--- !u!1 &6252541584641871655
GameObject:
  m_ObjectHideFlags: 0
  m_CorrespondingSourceObject: {fileID: 0}
  m_PrefabInstance: {fileID: 0}
  m_PrefabAsset: {fileID: 0}
  serializedVersion: 6
  m_Component:
  - component: {fileID: 6252541584641871654}
  - component: {fileID: 6252541584641871657}
  - component: {fileID: 6252541584641871658}
  - component: {fileID: 6252541584641871653}
  m_Layer: 0
  m_Name: touchpad
  m_TagString: Untagged
  m_Icon: {fileID: 0}
  m_NavMeshLayer: 0
  m_StaticEditorFlags: 0
  m_IsActive: 1
--- !u!4 &6252541584641871654
Transform:
  m_ObjectHideFlags: 0
  m_CorrespondingSourceObject: {fileID: 0}
  m_PrefabInstance: {fileID: 0}
  m_PrefabAsset: {fileID: 0}
  m_GameObject: {fileID: 6252541584641871655}
  m_LocalRotation: {x: 0.16183266, y: 0.7534103, z: 0.20164697, w: 0.6045839}
  m_LocalPosition: {x: 0.0003, y: -0.0005, z: -0.0521}
  m_LocalScale: {x: 0.027, y: 0.001, z: 0.027}
  m_ConstrainProportionsScale: 0
  m_Children:
  - {fileID: 3919083100237723911}
  m_Father: {fileID: 3650976837714203501}
  m_RootOrder: 7
  m_LocalEulerAnglesHint: {x: -6.209, y: 100.879, z: 29.377}
--- !u!33 &6252541584641871657
MeshFilter:
  m_ObjectHideFlags: 0
  m_CorrespondingSourceObject: {fileID: 0}
  m_PrefabInstance: {fileID: 0}
  m_PrefabAsset: {fileID: 0}
  m_GameObject: {fileID: 6252541584641871655}
  m_Mesh: {fileID: 10206, guid: 0000000000000000e000000000000000, type: 0}
--- !u!23 &6252541584641871658
MeshRenderer:
  m_ObjectHideFlags: 0
  m_CorrespondingSourceObject: {fileID: 0}
  m_PrefabInstance: {fileID: 0}
  m_PrefabAsset: {fileID: 0}
  m_GameObject: {fileID: 6252541584641871655}
  m_Enabled: 1
  m_CastShadows: 1
  m_ReceiveShadows: 1
  m_DynamicOccludee: 1
  m_StaticShadowCaster: 0
  m_MotionVectors: 1
  m_LightProbeUsage: 1
  m_ReflectionProbeUsage: 1
  m_RayTracingMode: 2
  m_RayTraceProcedural: 0
  m_RenderingLayerMask: 1
  m_RendererPriority: 0
  m_Materials:
  - {fileID: 2100000, guid: fc932b86e2ea6c848918e0d8036806f7, type: 2}
  m_StaticBatchInfo:
    firstSubMesh: 0
    subMeshCount: 0
  m_StaticBatchRoot: {fileID: 0}
  m_ProbeAnchor: {fileID: 0}
  m_LightProbeVolumeOverride: {fileID: 0}
  m_ScaleInLightmap: 1
  m_ReceiveGI: 1
  m_PreserveUVs: 0
  m_IgnoreNormalsForChartDetection: 0
  m_ImportantGI: 0
  m_StitchLightmapSeams: 1
  m_SelectedEditorRenderState: 3
  m_MinimumChartSize: 4
  m_AutoUVMaxDistance: 0.5
  m_AutoUVMaxAngle: 89
  m_LightmapParameters: {fileID: 0}
  m_SortingLayerID: 0
  m_SortingLayer: 0
  m_SortingOrder: 0
  m_AdditionalVertexStreams: {fileID: 0}
--- !u!114 &6252541584641871653
MonoBehaviour:
  m_ObjectHideFlags: 0
  m_CorrespondingSourceObject: {fileID: 0}
  m_PrefabInstance: {fileID: 0}
  m_PrefabAsset: {fileID: 0}
  m_GameObject: {fileID: 6252541584641871655}
  m_Enabled: 1
  m_EditorHideFlags: 0
  m_Script: {fileID: 11500000, guid: fb959ab8eca546139141a13f20354e8e, type: 3}
  m_Name: 
  m_EditorClassIdentifier: 
  PrimaryInputFeatureName: Secondary2DAxis
  LayerIndex: 2
  AnimatorParameterXName: AxisX
  AnimatorParameterYName: AxisY
  InvertedX: 0
  InvertedY: 0
--- !u!1 &6252541584684178240
GameObject:
  m_ObjectHideFlags: 0
  m_CorrespondingSourceObject: {fileID: 0}
  m_PrefabInstance: {fileID: 0}
  m_PrefabAsset: {fileID: 0}
  serializedVersion: 6
  m_Component:
  - component: {fileID: 6252541584684178247}
  m_Layer: 0
  m_Name: PointerAnchor
  m_TagString: Untagged
  m_Icon: {fileID: 0}
  m_NavMeshLayer: 0
  m_StaticEditorFlags: 0
  m_IsActive: 1
--- !u!4 &6252541584684178247
Transform:
  m_ObjectHideFlags: 0
  m_CorrespondingSourceObject: {fileID: 0}
  m_PrefabInstance: {fileID: 0}
  m_PrefabAsset: {fileID: 0}
  m_GameObject: {fileID: 6252541584684178240}
  m_LocalRotation: {x: 0, y: 0, z: 0, w: 1}
  m_LocalPosition: {x: 0.0202, y: 0.0064, z: 0.0087}
  m_LocalScale: {x: 1, y: 1, z: 1}
  m_ConstrainProportionsScale: 0
  m_Children: []
  m_Father: {fileID: 6252541585700315719}
  m_RootOrder: 2
  m_LocalEulerAnglesHint: {x: 0, y: 0, z: 0}
--- !u!1 &6252541585700315714
GameObject:
  m_ObjectHideFlags: 0
  m_CorrespondingSourceObject: {fileID: 0}
  m_PrefabInstance: {fileID: 0}
  m_PrefabAsset: {fileID: 0}
  serializedVersion: 6
  m_Component:
  - component: {fileID: 6252541585700315719}
  - component: {fileID: 6252541585700315712}
  - component: {fileID: 6252541585700315713}
  - component: {fileID: 6466252759771050946}
  m_Layer: 0
  m_Name: SamsungOdysseyPlusControllerLeft
  m_TagString: Untagged
  m_Icon: {fileID: 0}
  m_NavMeshLayer: 0
  m_StaticEditorFlags: 0
  m_IsActive: 1
--- !u!4 &6252541585700315719
Transform:
  m_ObjectHideFlags: 0
  m_CorrespondingSourceObject: {fileID: 0}
  m_PrefabInstance: {fileID: 0}
  m_PrefabAsset: {fileID: 0}
  m_GameObject: {fileID: 6252541585700315714}
  m_LocalRotation: {x: 0, y: 0, z: 0, w: 1}
  m_LocalPosition: {x: 0, y: 0.138, z: 0}
  m_LocalScale: {x: 1, y: 1, z: 1}
  m_ConstrainProportionsScale: 0
  m_Children:
  - {fileID: 5859117199339517353}
  - {fileID: 6252541584449068581}
  - {fileID: 6252541584684178247}
  - {fileID: 279804913049031855}
  m_Father: {fileID: 0}
  m_RootOrder: 0
  m_LocalEulerAnglesHint: {x: 0, y: 0, z: 0}
--- !u!114 &6252541585700315712
MonoBehaviour:
  m_ObjectHideFlags: 0
  m_CorrespondingSourceObject: {fileID: 0}
  m_PrefabInstance: {fileID: 0}
  m_PrefabAsset: {fileID: 0}
  m_GameObject: {fileID: 6252541585700315714}
  m_Enabled: 1
  m_EditorHideFlags: 0
  m_Script: {fileID: 11500000, guid: 926d2692cbf74cefb9bde63d562cf607, type: 3}
  m_Name: 
  m_EditorClassIdentifier: 
  InputDeviceHandler: {fileID: 553917294699261907}
  CustomPointerAnchor: {fileID: 6252541584684178247}
  PlatformOffsetInfos:
  - Name: Varwin OpenXR Display
    AngleOffset: {x: 0, y: 180, z: 0}
    Anchor: {fileID: 6252541584449068581}
    IsDesktopOnly: 0
  _controlTooltipHandlers:
  - {fileID: 2443470526616515418}
  - {fileID: 390259760674648704}
  - {fileID: 5229368046195328895}
  - {fileID: 840663578892742093}
  - {fileID: 3752719644525970272}
  - {fileID: 1477899390473038815}
  - {fileID: 8371071278865663605}
  - {fileID: 4993552939196060723}
  - {fileID: 6540843727516056247}
  TeleportOnThumbstick: 0
  Is3Dof: 0
  GrabAnchor: {fileID: 3961046621849010940}
--- !u!114 &6252541585700315713
MonoBehaviour:
  m_ObjectHideFlags: 0
  m_CorrespondingSourceObject: {fileID: 0}
  m_PrefabInstance: {fileID: 0}
  m_PrefabAsset: {fileID: 0}
  m_GameObject: {fileID: 6252541585700315714}
  m_Enabled: 1
  m_EditorHideFlags: 0
  m_Script: {fileID: 11500000, guid: e92dc823f4034a4dabdef690e2c1a7c0, type: 3}
  m_Name: 
  m_EditorClassIdentifier: 
  Animator: {fileID: 553917294699261907}
  Indicators:
  - {fileID: 6252541584952230038}
  - {fileID: 6252541585091596878}
  - {fileID: 6252541584641871653}
  TimeSwitching: 0.05
--- !u!114 &6466252759771050946
MonoBehaviour:
  m_ObjectHideFlags: 0
  m_CorrespondingSourceObject: {fileID: 0}
  m_PrefabInstance: {fileID: 0}
  m_PrefabAsset: {fileID: 0}
  m_GameObject: {fileID: 6252541585700315714}
  m_Enabled: 1
  m_EditorHideFlags: 0
  m_Script: {fileID: 11500000, guid: 253f7d71cb954b04913e301aab2036c5, type: 3}
  m_Name: 
  m_EditorClassIdentifier: 
  _map:
  - Key: 0
    FeatureName: Secondary2DAxis
  - Key: 1
    FeatureName: Secondary2DAxisClick
  - Key: 2
    FeatureName: Primary2DAxis
  - Key: 3
    FeatureName: Primary2DAxisClick
--- !u!1001 &6252541585091596866
PrefabInstance:
  m_ObjectHideFlags: 0
  serializedVersion: 2
  m_Modification:
    m_TransformParent: {fileID: 6252541585700315719}
    m_Modifications:
    - target: {fileID: -8679921383154817045, guid: 1418cc14630ac4c42bf80848ea8907a8,
        type: 3}
      propertyPath: m_RootOrder
      value: 0
      objectReference: {fileID: 0}
    - target: {fileID: -8679921383154817045, guid: 1418cc14630ac4c42bf80848ea8907a8,
        type: 3}
      propertyPath: m_LocalPosition.x
      value: 0
      objectReference: {fileID: 0}
    - target: {fileID: -8679921383154817045, guid: 1418cc14630ac4c42bf80848ea8907a8,
        type: 3}
      propertyPath: m_LocalPosition.y
      value: 0
      objectReference: {fileID: 0}
    - target: {fileID: -8679921383154817045, guid: 1418cc14630ac4c42bf80848ea8907a8,
        type: 3}
      propertyPath: m_LocalPosition.z
      value: 0
      objectReference: {fileID: 0}
    - target: {fileID: -8679921383154817045, guid: 1418cc14630ac4c42bf80848ea8907a8,
        type: 3}
      propertyPath: m_LocalRotation.w
      value: 1
      objectReference: {fileID: 0}
    - target: {fileID: -8679921383154817045, guid: 1418cc14630ac4c42bf80848ea8907a8,
        type: 3}
      propertyPath: m_LocalRotation.x
      value: -0
      objectReference: {fileID: 0}
    - target: {fileID: -8679921383154817045, guid: 1418cc14630ac4c42bf80848ea8907a8,
        type: 3}
      propertyPath: m_LocalRotation.y
      value: -0
      objectReference: {fileID: 0}
    - target: {fileID: -8679921383154817045, guid: 1418cc14630ac4c42bf80848ea8907a8,
        type: 3}
      propertyPath: m_LocalRotation.z
      value: -0
      objectReference: {fileID: 0}
    - target: {fileID: -8679921383154817045, guid: 1418cc14630ac4c42bf80848ea8907a8,
        type: 3}
      propertyPath: m_LocalEulerAnglesHint.x
      value: 0
      objectReference: {fileID: 0}
    - target: {fileID: -8679921383154817045, guid: 1418cc14630ac4c42bf80848ea8907a8,
        type: 3}
      propertyPath: m_LocalEulerAnglesHint.y
      value: 0
      objectReference: {fileID: 0}
    - target: {fileID: -8679921383154817045, guid: 1418cc14630ac4c42bf80848ea8907a8,
        type: 3}
      propertyPath: m_LocalEulerAnglesHint.z
      value: 0
      objectReference: {fileID: 0}
    - target: {fileID: -2716112003297251288, guid: 1418cc14630ac4c42bf80848ea8907a8,
        type: 3}
      propertyPath: m_Materials.Array.data[0]
      value: 
      objectReference: {fileID: 2100000, guid: 6e4d91b9b0afb0445b2b97f19f674fc6, type: 2}
    - target: {fileID: -2369896371474195786, guid: 1418cc14630ac4c42bf80848ea8907a8,
        type: 3}
      propertyPath: m_IsActive
      value: 0
      objectReference: {fileID: 0}
    - target: {fileID: 919132149155446097, guid: 1418cc14630ac4c42bf80848ea8907a8,
        type: 3}
      propertyPath: m_Name
      value: Samsung_Odyssey_Plus
      objectReference: {fileID: 0}
    - target: {fileID: 1659140966764593269, guid: 1418cc14630ac4c42bf80848ea8907a8,
        type: 3}
      propertyPath: m_Materials.Array.data[0]
      value: 
      objectReference: {fileID: 2100000, guid: 6e4d91b9b0afb0445b2b97f19f674fc6, type: 2}
    - target: {fileID: 1803175624241342826, guid: 1418cc14630ac4c42bf80848ea8907a8,
        type: 3}
      propertyPath: m_Materials.Array.data[0]
      value: 
      objectReference: {fileID: 2100000, guid: 6e4d91b9b0afb0445b2b97f19f674fc6, type: 2}
    - target: {fileID: 2545228181402026268, guid: 1418cc14630ac4c42bf80848ea8907a8,
        type: 3}
      propertyPath: m_Mesh
      value: 
      objectReference: {fileID: -1400252653696632910, guid: b6b6e82f462f28a42aad856bd2159f95,
        type: 3}
    - target: {fileID: 2545228181402026268, guid: 1418cc14630ac4c42bf80848ea8907a8,
        type: 3}
      propertyPath: m_Materials.Array.data[0]
      value: 
      objectReference: {fileID: 2100000, guid: 98f191acca91cc14ebcd02c5c1277539, type: 2}
    - target: {fileID: 4150135391960568065, guid: 1418cc14630ac4c42bf80848ea8907a8,
        type: 3}
      propertyPath: m_Materials.Array.data[0]
      value: 
      objectReference: {fileID: 2100000, guid: 6e4d91b9b0afb0445b2b97f19f674fc6, type: 2}
    - target: {fileID: 5345171821323890155, guid: 1418cc14630ac4c42bf80848ea8907a8,
        type: 3}
      propertyPath: m_Materials.Array.data[0]
      value: 
      objectReference: {fileID: 2100000, guid: 6e4d91b9b0afb0445b2b97f19f674fc6, type: 2}
    - target: {fileID: 5866666021909216657, guid: 1418cc14630ac4c42bf80848ea8907a8,
        type: 3}
      propertyPath: m_Controller
      value: 
      objectReference: {fileID: 9100000, guid: d6b01f1b77682bf4d9aebf7bbf78b259, type: 2}
    - target: {fileID: 6087921713603601347, guid: 1418cc14630ac4c42bf80848ea8907a8,
        type: 3}
      propertyPath: m_Materials.Array.data[0]
      value: 
      objectReference: {fileID: 2100000, guid: 6e4d91b9b0afb0445b2b97f19f674fc6, type: 2}
    - target: {fileID: 6795442537949102093, guid: 1418cc14630ac4c42bf80848ea8907a8,
        type: 3}
      propertyPath: m_Materials.Array.data[0]
      value: 
      objectReference: {fileID: 2100000, guid: 6e4d91b9b0afb0445b2b97f19f674fc6, type: 2}
    m_RemovedComponents: []
  m_SourcePrefab: {fileID: 100100000, guid: 1418cc14630ac4c42bf80848ea8907a8, type: 3}
--- !u!95 &553917294699261907 stripped
Animator:
  m_CorrespondingSourceObject: {fileID: 5866666021909216657, guid: 1418cc14630ac4c42bf80848ea8907a8,
    type: 3}
  m_PrefabInstance: {fileID: 6252541585091596866}
  m_PrefabAsset: {fileID: 0}
--- !u!4 &1891298922429364916 stripped
Transform:
  m_CorrespondingSourceObject: {fileID: -3676552303331694346, guid: 1418cc14630ac4c42bf80848ea8907a8,
    type: 3}
  m_PrefabInstance: {fileID: 6252541585091596866}
  m_PrefabAsset: {fileID: 0}
--- !u!4 &2819153491326582915 stripped
Transform:
  m_CorrespondingSourceObject: {fileID: 8204107544942924481, guid: 1418cc14630ac4c42bf80848ea8907a8,
    type: 3}
  m_PrefabInstance: {fileID: 6252541585091596866}
  m_PrefabAsset: {fileID: 0}
--- !u!1 &3182196172413441374 stripped
GameObject:
  m_CorrespondingSourceObject: {fileID: -365895485045504228, guid: 1418cc14630ac4c42bf80848ea8907a8,
    type: 3}
  m_PrefabInstance: {fileID: 6252541585091596866}
  m_PrefabAsset: {fileID: 0}
--- !u!114 &6252541585091596878
MonoBehaviour:
  m_ObjectHideFlags: 0
  m_CorrespondingSourceObject: {fileID: 0}
  m_PrefabInstance: {fileID: 0}
  m_PrefabAsset: {fileID: 0}
  m_GameObject: {fileID: 3182196172413441374}
  m_Enabled: 1
  m_EditorHideFlags: 0
  m_Script: {fileID: 11500000, guid: fb959ab8eca546139141a13f20354e8e, type: 3}
  m_Name: 
  m_EditorClassIdentifier: 
  PrimaryInputFeatureName: Primary2DAxis
  LayerIndex: 5
  AnimatorParameterXName: SecondaryAxisX
  AnimatorParameterYName: SecondaryAxisY
  InvertedX: 0
  InvertedY: 0
--- !u!4 &3525216073075807963 stripped
Transform:
  m_CorrespondingSourceObject: {fileID: 7361529582267155609, guid: 1418cc14630ac4c42bf80848ea8907a8,
    type: 3}
  m_PrefabInstance: {fileID: 6252541585091596866}
  m_PrefabAsset: {fileID: 0}
--- !u!4 &3650976837714203501 stripped
Transform:
  m_CorrespondingSourceObject: {fileID: -1986195846322175697, guid: 1418cc14630ac4c42bf80848ea8907a8,
    type: 3}
  m_PrefabInstance: {fileID: 6252541585091596866}
  m_PrefabAsset: {fileID: 0}
--- !u!1 &4270221501388363542 stripped
GameObject:
  m_CorrespondingSourceObject: {fileID: 7892455701757494612, guid: 1418cc14630ac4c42bf80848ea8907a8,
    type: 3}
  m_PrefabInstance: {fileID: 6252541585091596866}
  m_PrefabAsset: {fileID: 0}
--- !u!114 &6252541584952230038
MonoBehaviour:
  m_ObjectHideFlags: 0
  m_CorrespondingSourceObject: {fileID: 0}
  m_PrefabInstance: {fileID: 0}
  m_PrefabAsset: {fileID: 0}
  m_GameObject: {fileID: 4270221501388363542}
  m_Enabled: 1
  m_EditorHideFlags: 0
  m_Script: {fileID: 11500000, guid: 42a14b2b31e04e42ace502a2acb818ea, type: 3}
  m_Name: 
  m_EditorClassIdentifier: 
  PrimaryInputFeatureName: PrimaryButton
  LayerIndex: 4
  AnimatorParameterName: ButtonA
--- !u!1 &4515540796043204881 stripped
GameObject:
  m_CorrespondingSourceObject: {fileID: -1698119721359078573, guid: 1418cc14630ac4c42bf80848ea8907a8,
    type: 3}
  m_PrefabInstance: {fileID: 6252541585091596866}
  m_PrefabAsset: {fileID: 0}
--- !u!114 &6252541584910995105
MonoBehaviour:
  m_ObjectHideFlags: 0
  m_CorrespondingSourceObject: {fileID: 0}
  m_PrefabInstance: {fileID: 0}
  m_PrefabAsset: {fileID: 0}
  m_GameObject: {fileID: 4515540796043204881}
  m_Enabled: 1
  m_EditorHideFlags: 0
  m_Script: {fileID: 11500000, guid: 7fbc17ab92734d1fbb0edb12e8e31bbd, type: 3}
  m_Name: 
  m_EditorClassIdentifier: 
  PrimaryInputFeatureName: Grip
  LayerIndex: 0
  AnimatorParameterName: Grip
--- !u!4 &5547913378584876371 stripped
Transform:
  m_CorrespondingSourceObject: {fileID: -7333170109435984111, guid: 1418cc14630ac4c42bf80848ea8907a8,
    type: 3}
  m_PrefabInstance: {fileID: 6252541585091596866}
  m_PrefabAsset: {fileID: 0}
--- !u!4 &5859117199339517353 stripped
Transform:
  m_CorrespondingSourceObject: {fileID: -8679921383154817045, guid: 1418cc14630ac4c42bf80848ea8907a8,
    type: 3}
  m_PrefabInstance: {fileID: 6252541585091596866}
  m_PrefabAsset: {fileID: 0}
--- !u!4 &6297831121372358504 stripped
Transform:
  m_CorrespondingSourceObject: {fileID: 117966019073586474, guid: 1418cc14630ac4c42bf80848ea8907a8,
    type: 3}
  m_PrefabInstance: {fileID: 6252541585091596866}
  m_PrefabAsset: {fileID: 0}
--- !u!1 &7025970740821044952 stripped
GameObject:
  m_CorrespondingSourceObject: {fileID: 3982376519695809690, guid: 1418cc14630ac4c42bf80848ea8907a8,
    type: 3}
  m_PrefabInstance: {fileID: 6252541585091596866}
  m_PrefabAsset: {fileID: 0}
--- !u!114 &6252541585091596874
MonoBehaviour:
  m_ObjectHideFlags: 0
  m_CorrespondingSourceObject: {fileID: 0}
  m_PrefabInstance: {fileID: 0}
  m_PrefabAsset: {fileID: 0}
  m_GameObject: {fileID: 7025970740821044952}
  m_Enabled: 1
  m_EditorHideFlags: 0
  m_Script: {fileID: 11500000, guid: 7fbc17ab92734d1fbb0edb12e8e31bbd, type: 3}
  m_Name: 
  m_EditorClassIdentifier: 
  PrimaryInputFeatureName: Trigger
  LayerIndex: 0
  AnimatorParameterName: Trigger
--- !u!4 &8709542147418359187 stripped
Transform:
  m_CorrespondingSourceObject: {fileID: 3322529532687423441, guid: 1418cc14630ac4c42bf80848ea8907a8,
    type: 3}
  m_PrefabInstance: {fileID: 6252541585091596866}
  m_PrefabAsset: {fileID: 0}
