sdf@gmail.com, 2015-01-05 10:14:27
mirceasirbu@gmail.com, 2015-01-05 10:15:03
dfg@gmail.com, 2015-01-05 10:21:40
sdf@gmai.com, 2015-01-05 10:22:48
asd@gmail.com, 2015-01-05 10:25:39
sdf@gmail.com, 2015-01-05 10:26:42
sdf@gmail.com, 2015-01-05 10:28:44
ghj@gmail.com, 2015-01-05 11:36:15
asd@gmail.com, 2015-01-05 14:03:17
123123@gmail.com, 2015-01-05 14:03:32
sdf@gmailc.asom, 2015-01-05 21:12:31
ad@gmail.com, 2015-01-05 23:40:23
zxc@gmail.com, 2015-01-05 23:43:43
sdf@fmasd.com, 2015-01-05 23:45:21
mirceasirbu13@gmail.com, 2015-01-05 23:53:53
mirceasirbu@gmail.com, 2015-01-05 23:54:10
sad@gmail.com, 2015-01-10 13:52:56
