{
    "Sms_validation": {
        "en": "Welcome to Gloo. Your validation code is: ",
        "fr": "Bienvenue sur Gloo. Votre code de validation est : "
    },
    
  
    "IdNotExist": {
        "en": "Invalid id Gloo",
        "fr": "Id Gloo invalid"
    },    
    "addSuccess": {
        "en": "add Gloo with success",
        "fr": "Gloo ajouté avec succès"
    },    
    "IdNoUnauthorized": {
        "en": "Idunauthorized ",
        "fr": "Id non autorisé"
    },    
    "duplicateEntry": {
        "en": "duplicate entry",
        "fr": "Entrée en double"
    },
    "checkUserIds": {
        "en": "Invalid Id friend, Please check the list of friends",
        "fr": "Invalide id ami, s'il vous plaît vérifier la liste des amis"
    },
    "ErrorTime": {
        "en": "The time entered is less than today's time + ",
        "fr": "Le temps entré est inférieur à l'heure d'aujourd'hui + "
    },

    "WrongToken": {
        "en": "Incorrect token !",
        "fr": "Jeton incorrect !"
    },
    "InternetError": {
        "en": "Internet problem, please try again later",
        "fr": "Problème internet, veuillez réessayer ultérieurement"
    },
    "ActiveAccount": {
        "en": "You must activate your account first",
        "fr": "You must activate your account first"
    },

    "InvalidLimit": {
        "en": "Invalid value limit",
        "fr": "Invalid value limit"
    },    
    "MissingLimit": {
        "en": "Missing params limit",
        "fr": "Missing params limit"
    },    
    "MissingPaging": {
        "en": "Missing params paging !",
        "fr": "Missing params paging !"
    },    
    "RequiredLimit": {
        "en": "Params limit required",
        "fr": "Params limit required"
    },    
    "RequiredPaging": {
        "en": "Params paging required",
        "fr": "Params paging required"
    },    
    "leftGloo": {
        "en": "You have already left this Gloo !",
        "fr": "You have already left this Gloo !"
    },    
    "ErrorAddImage": {
        "en": "You can not add images for this Gloo because you were not among the members",
        "fr": "You can not add images for this Gloo because you were not among the members"
    },    
    "MissingImage": {
        "en": "Missing file image !",
        "fr": "Missing file image !"
    },    
    "ErrorBigImage": {
        "en": "The image may not be greater than 64Ko",
        "fr": "The image may not be greater than 64Ko"
    },
    "ErrorGoogleApi": {
        "en": "Bug api google",
        "fr": "Bug api google"
    },
    "NotMobileNumber": {
        "en": "The phone number entered does not corresponding to mobile number",
        "fr": "The phone number entered does not corresponding to mobile number"
    },
    "InvalidPhoneNumber": {
        "en": "Invalid phone number",
        "fr": "Invalid phone number"
    },
    "RequiredPhoneNumber": {
        "en": "phone number required",
        "fr": "phone number required"
    },
    "MissingPhoneNumber": {
        "en": "Missing phone number !",
        "fr": "Missing phone number !"
    },
    "InvalidCode": {
        "en": "Invalid activation code",
        "fr": "Code d'activation invalid"
    },
    "InvalidUserId": {
        "en": "Invalid user id",
        "fr": "Invalid user id"
    },
    "ReaquireddUserId": {
        "en": "User id required",
        "fr": "User id required"
    },
    "ReaquiredCode": {
        "en": "Validation code required",
        "fr": "Validation code required"
    },
    "ReaquiredToken": {
        "en": "Registration token required",
        "fr": "Registration token required"
    },
    "ReaquiredDevice": {
        "en": "Device required",
        "fr": "Device required"
    },
    "MissingUserId": {
        "en": "Missing user Id",
        "fr": "Missing user Id"
    },
    "MissingCode": {
        "en": "Missing activation code",
        "fr": "Missing activation code"
    },
    "MissingToken": {
        "en": "Missing registration token",
        "fr": "Missing registration token"
    },
    "MissingDevice": {
        "en": "Missing device",
        "fr": "Missing device"
    },
    "LongUsername": {
        "en": "Your username must be less than 20 characters",
        "fr": "Your username must be less than 20 characters"
    },
   
    "ShortUsername": {
        "en": "Your username must be longer than 3 characters",
        "fr": "Your username must be longer than 3 characters"
    },
    "LongnameTeam": {
        "en": "Your teamname must be less than 20 characters",
        "fr": "Your teamname must be less than 20 characters"
    },
   
    "ShortnameTeam": {
        "en": "Your teamname must be longer than 3 characters",
        "fr": "Your teamname must be longer than 3 characters"
    },
    "RequirednameTeam": {
        "en": "nameTeam required",
        "fr": "nameTeam required"
    },
    "RequiredUsername": {
        "en": "Username required",
        "fr": "Username required"
    },
    "Requiredname": {
        "en": "name required",
        "fr": "name required"
    },
    "MissingUsername": {
        "en": "Missing username !",
        "fr": "Missing username !"
    },
    "MissingnameTeam": {
        "en": "Missing nameTeam !",
        "fr": "Missing nameTeam !"
    },
    "Missingname": {
        "en": "Missing name !",
        "fr": "Missing name !"
    },
    
    "requiredImage": {
        "en": "file image required",
        "fr": "file image required"
    },
    "requiredTeamId": {
        "en": "team id required",
        "fr": "team id required"
    },
    "MissingTeamId": {
        "en": "team id missing",
        "fr": "team id missing"
    },
    "DuplicatePhone": {
        "en": "This is your number, please put another phone number",
        "fr": "This is your number, please put another phone number"
    },
    "MissingListeUsers": {
        "en": "Missing params liste users !",
        "fr": "Missing params liste users !"
    },
    "requiredListeUsers": {
        "en": "Liste Users required",
        "fr": "Liste Users required"
    },

    "NoChanges": {
        "en": "No changes have been made",
        "fr": "Aucune modification n'a été apportée"
    },
    "PhoneNotFound": {
        "en": "phone not found in Gloo",
        "fr": "téléphone non trouvé dans Gloo"
    },
    "InvalidDate": {
        "en": "Invalid date",
        "fr": "Date invalid"
    },
    "checkListPhoneNumber": {
        "en": "Check list phone number",
        "fr": "Vérifiez la liste numéro de téléphone"
    }
}