name,address,phone,email,visitor,date,time,status
Ellette,Åland Islands,2506237138,.@yopmail.com,John,09-03-2022,5,pending
Cristabel,Saudi Arabia,2609774087,.@yopmail.com,Kai,31-08-2022,4,not-approved
Aubrie,Samoa,2696135077,.@yopmail.com,Phill,31-12-2022,4,invoiced
Ofilia,Belarus,2441519491,.@yopmail.com,Robert,18-06-2022,3,not-approved
Dode,Slovenia,428640135,.@yopmail.com,Marcus,17-02-2022,1,not-approved
Cassandra,Costa Rica,8112459152,.@yopmail.com,Benjamin,08-09-2022,1,approved
Harmonia,Bangladesh,5045682929,.@yopmail.com,Robert,23-02-2022,5,pending
Sean,Chad,4597733377,.@yopmail.com,Legend,31-03-2022,1,approved
Philis,Trinidad and Tobago,6601656840,.@yopmail.com,Kai,20-05-2022,5,approved
Heida,Turkmenistan,4130160512,.@yopmail.com,Robert,10-07-2022,1,approved
Lynea,Saint Kitts and Nevis,8939181069,.@yopmail.com,John,12-06-2022,2,pending
Jordan,Somalia,2604536408,.@yopmail.com,Peter,22-12-2022,3,invoiced
Yetty,Cape Verde,6789414509,.@yopmail.com,Robert,30-08-2022,2,approved
Bobbi,Reunion,5504507421,.@yopmail.com,Robert,22-02-2022,5,invoiced
Vevay,Belgium,5566974330,.@yopmail.com,Peter,11-03-2022,4,not-approved
Yolane,Palau,1701323736,.@yopmail.com,Robert,08-05-2022,3,approved
Ayn,Jordan,7009124033,.@yopmail.com,Kai,03-08-2022,5,not-approvesd
Aurore,Morocco,3865633921,.@yopmail.com,Benjamin,11-02-2022,1,invoiced
Marleah,Peru,1142611633,.@yopmail.com,John,15-04-2022,3,pending
Agathe,Heard Island and Mcdonald Islands,7016020585,.@yopmail.com,Robert,12-12-2022,4,pending
Maryellen,India,4680367805,.@yopmail.com,Peter,24-05-2022,2,not-approved
Claudina,Japan,7617157818,.@yopmail.com,Legend,02-06-2022,4,approved
Elyssa,Italy,458270586,.@yopmail.com,Peter,19-04-2022,4,invoiced
Carmela,"Lao People""S Democratic Republic",4504693616,.@yopmail.com,Benjamin,26-05-2022,5,pending
Ashlee,Jordan,2631679849,.@yopmail.com,Jake,17-06-2022,4,not-approved
Jean,Georgia,2257232951,.@yopmail.com,Kai,18-03-2022,4,approved
Adore,Western Sahara,3240261212,.@yopmail.com,Benjamin,17-03-2022,1,invoiced
Bibby,Sierra Leone,6964420500,.@yopmail.com,Phill,27-04-2022,3,approved
Gabi,Monaco,361928700,.@yopmail.com,Peter,27-11-2022,5,approved