{
  "validators": [
    {
      "nodeID": "NodeID-3417yLQiVZsF8jXg7mNLkSua7dregd33o",
      "weighting": 1
    },
    {
      "nodeID": "NodeID-Q2FTyfJfwJ5b1FSJhX6BwTnXgXxmk2gHa",
      "weighting": 1
    },
    {
      "nodeID": "NodeID-9UFZiKiQxCZJpFjmwpGTn93pnPFAzsYxc",
      "weighting": 1
    },
    {
      "nodeID": "NodeID-L6AqPw7iaH2CU7FhzAGDoBonwD2iioAo6",
      "weighting": 1
    }
  ]
}