{
  "spec_dir": "spec",
  "spec_files": [
    "**/*[sS]pec.?(m)js"
  ],
  "helpers": [
    "node_modules/jasmine-dom/dist/jasmine-dom.js"
  ],
  "stopSpecOnExpectationFailure": false,
  "random": true
}
