<svg width="20" height="16" viewBox="0 0 20 16" fill="none" xmlns="http://www.w3.org/2000/svg">
<path fill-rule="evenodd" clip-rule="evenodd" d="M0.595533 0.622482H5.06244L6.35666 3.01846C6.37548 3.1102 6.43604 3.18661 6.5175 3.2267C6.56912 3.25693 6.62748 3.26786 6.68387 3.25703H18.2598V4.93355L2.59878 4.93358C2.50939 4.93358 2.42921 4.97318 2.37464 5.03589C2.3272 5.07584 2.2917 5.13094 2.27631 5.19613L0.595533 12.3156V0.622482ZM0.262798 15.1703C0.286365 15.1731 0.309754 15.1731 0.332567 15.1704C0.340739 15.171 0.349002 15.1713 0.357345 15.1713L17.0688 15.1135C17.157 15.1132 17.2362 15.0743 17.2905 15.0129C17.3635 14.976 17.4212 14.9091 17.4442 14.8235L19.9897 5.34234C20.0278 5.20001 19.9573 5.05395 19.8291 4.99341C19.7793 4.95582 19.7174 4.93355 19.6504 4.93355H18.8552V2.95765C18.8552 2.7923 18.722 2.65827 18.5575 2.65827H6.79879L5.53789 0.323958V0.3231C5.53789 0.196223 5.4594 0.0877808 5.34858 0.0441911C5.27568 -0.00537952 5.18675 -0.0147423 5.10833 0.0237203L0.2978 0.0237199C0.287523 0.0237199 0.277368 0.0242434 0.267359 0.0252655C0.117225 0.0405967 6.76378e-05 0.168091 6.76378e-05 0.3231L6.82341e-05 14.8668C-0.00047084 14.8921 0.00219279 14.9169 0.00775562 14.9409C0.0177964 14.9844 0.0372853 15.0243 0.0639342 15.0583C0.0909242 15.0928 0.125547 15.1215 0.166031 15.1415C0.195812 15.1563 0.22841 15.1662 0.262798 15.1703ZM18.5575 5.53231L2.80895 5.53234L0.674986 14.5714L16.9101 14.5153L19.3218 5.53231H18.5575Z" fill="black"/>
</svg>
