<svg width="15" height="11" viewBox="0 0 15 11" fill="none" xmlns="http://www.w3.org/2000/svg">
<path fill-rule="evenodd" clip-rule="evenodd" d="M11.5087 8.80159C12.7913 8.05248 13.701 6.98334 14.0048 5.76227C13.7873 3.10581 10.7361 1.00004 7.00396 1.00004C5.98596 1.00004 5.01863 1.15671 4.14564 1.4385L4.95146 2.24431C5.58027 2.08784 6.26836 2.00004 7.00396 2.00004C8.6891 2.00004 10.184 2.47671 11.2582 3.21066C12.274 3.90472 12.8603 4.78393 12.9896 5.67986C12.7044 6.58664 11.9203 7.45667 10.7745 8.06738L11.5087 8.80159ZM12.0119 10.0119L2.50004 0.5L2 1.00004L2.93785 1.93789C1.47653 2.69028 0.431666 3.83743 0.101562 5.16385C0.319127 7.82031 3.37036 9.92609 7.10246 9.92609C8.27471 9.92609 9.37979 9.71833 10.351 9.35102L11.5119 10.5119L12.0119 10.0119ZM8.88783 6.18069C8.97758 5.95909 9.027 5.71685 9.027 5.46307C9.027 4.40671 8.17065 3.55035 7.11429 3.55035C6.8605 3.55035 6.61826 3.59978 6.39667 3.68953L8.88783 6.18069ZM9.56697 8.56701L8.10158 7.10162C7.81337 7.27565 7.47552 7.37579 7.11429 7.37579C6.05792 7.37579 5.20157 6.51944 5.20157 5.46307C5.20157 5.10184 5.30171 4.76399 5.47574 4.47578L3.68439 2.68443C2.34699 3.29675 1.43039 4.24929 1.11678 5.24626C1.2461 6.1422 1.83237 7.02141 2.8482 7.71546C3.92242 8.44941 5.41731 8.92609 7.10246 8.92609C8.00221 8.92609 8.83091 8.79472 9.56697 8.56701Z" fill="#262626"/>
</svg>
