<svg width="19" height="20" viewBox="0 0 19 20" fill="none" xmlns="http://www.w3.org/2000/svg">
<path fill-rule="evenodd" clip-rule="evenodd" d="M0.558806 1.84358H3.4646H10.2261V6.48045C10.2261 6.48989 10.2266 6.49922 10.2275 6.50838C10.2266 6.51754 10.2261 6.52687 10.2261 6.53631C10.2261 6.69056 10.3513 6.81564 10.5056 6.81564H14.9047V19.4413H0.558806V1.84358ZM15.1841 20H0.319867C0.313064 20 0.306318 19.9998 0.299636 19.9993C0.292954 19.9998 0.286208 20 0.279404 20C0.125094 20 8.12811e-07 19.8749 8.06066e-07 19.7207L0 1.56425C0 1.40998 0.125093 1.28492 0.279403 1.28492C0.288838 1.28492 0.298163 1.28539 0.307357 1.2863C0.316552 1.28539 0.325876 1.28492 0.335311 1.28492H3.18519V0.27933L3.1852 0.277523C3.18617 0.124085 3.31089 0 3.4646 0L18.4406 1.33332e-06C18.5949 1.3468e-06 18.72 0.125061 18.72 0.279331C18.72 0.288758 18.7196 0.298077 18.7186 0.307264C18.7196 0.316451 18.72 0.325768 18.72 0.335196V17.5978C18.72 17.752 18.5949 17.8771 18.4406 17.8771H15.4635V19.7167V19.7191V19.7207C15.4635 19.8364 15.3931 19.9356 15.2928 19.978C15.2594 19.9922 15.2227 20 15.1841 20ZM15.4635 17.3184H18.1612V0.558659H3.744V1.28492H10.5614C10.6623 1.28492 10.7506 1.33832 10.7998 1.41837C10.8086 1.4257 10.817 1.43366 10.825 1.44223L15.3606 6.28581C15.3897 6.31682 15.4103 6.35274 15.4225 6.39073C15.4485 6.43313 15.4635 6.48296 15.4635 6.53631V17.3184ZM10.785 6.25698H14.5682L10.785 2.21686V6.25698ZM2.55506 17.1508H2.83446H12.9489H13.2283V17.7095H12.9489H2.83446H2.55506V17.1508ZM6.96965 13.7989H6.69025V14.3575H6.96965H12.3342H12.6136V13.7989H12.3342H6.96965ZM2.55506 13.7989H2.83446H5.23733H5.51673V14.3575H5.23733H2.83446H2.55506V13.7989ZM2.83446 11.3966H2.55506V11.9553H2.83446H12.3342H12.6136V11.3966H12.3342H2.83446ZM2.55506 8.37989H2.83446H8.14314H8.42255V8.93855H8.14314H2.83446H2.55506V8.37989ZM9.4284 8.37989H9.14899V8.93855H9.4284H11.8871H12.1665V8.37989H11.8871H9.4284ZM2.55506 5.69832H2.83446H8.86959H9.14899V6.25698H8.86959H2.83446H2.55506V5.69832ZM2.83446 3.46369H2.55506V4.02235H2.83446H5.23733H5.51673V3.46369H5.23733H2.83446Z" fill="black"/>
</svg>
