<svg width="17" height="20" viewBox="0 0 17 20" fill="none" xmlns="http://www.w3.org/2000/svg">
<path fill-rule="evenodd" clip-rule="evenodd" d="M0.269841 0C0.278953 0 0.287959 0.00045355 0.296838 0.0013394C0.305718 0.00045355 0.314725 0 0.323836 0H10.2C10.2974 0 10.3827 0.0518088 10.4302 0.129479C10.4387 0.136592 10.4469 0.144307 10.4546 0.152621L14.835 4.85179C14.8515 4.86952 14.8652 4.88888 14.8761 4.90933C14.9214 4.95781 14.9492 5.02307 14.9492 5.09485V12.0918C16.1776 12.835 17 14.193 17 15.7453C17 18.0951 15.1153 20 12.7905 20C11.3516 20 10.0814 19.2704 9.32221 18.1572H0.32381C0.314702 18.1572 0.305702 18.1567 0.296826 18.1558C0.287951 18.1567 0.278949 18.1572 0.269842 18.1572C0.120813 18.1572 7.84995e-07 18.0358 7.78481e-07 17.8862L0 0.271003C0 0.121332 0.120812 0 0.269841 0ZM14.4095 5.36585V11.8166C13.9111 11.6065 13.3642 11.4905 12.7905 11.4905C11.9681 11.4905 11.2008 11.7288 10.5526 12.1409H10.4159H6.74603H6.47619V12.6829H6.74603H9.86804C9.1528 13.3804 8.68128 14.3315 8.5952 15.393H2.75238H2.48254V15.935H2.75238H8.58505C8.61112 16.5358 8.76051 17.1043 9.00822 17.6152H0.539683V0.542005H9.87619V5.04065C9.87619 5.0498 9.87662 5.05883 9.87754 5.06775C9.87662 5.07666 9.87619 5.0857 9.87619 5.09485C9.87619 5.24452 9.99703 5.36585 10.146 5.36585H14.4095ZM10.4159 0.904163V4.82385H14.0696L10.4159 0.904163ZM2.46762 12.1409H2.73746H5.0581H5.32794V12.6829H5.0581H2.73746H2.46762V12.1409ZM2.73746 9.8103H2.46762V10.3523H2.73746H11.9121H12.1819V9.8103H11.9121H2.73746ZM2.46762 6.88347H2.73746H7.86447H8.13431V7.42547H7.86447H2.73746H2.46762V6.88347ZM9.10574 6.88347H8.8359V7.42547H9.10574H11.4803H11.7502V6.88347H11.4803H9.10574ZM2.46762 4.28184H2.73746H8.56606H8.8359V4.82385H8.56606H2.73746H2.46762V4.28184ZM2.73746 2.11382H2.46762V2.65583H2.73746H5.0581H5.32794V2.11382H5.0581H2.73746ZM12.7905 19.458C14.814 19.458 16.4603 17.799 16.4603 15.7453C16.4603 14.7679 16.0875 13.8799 15.4785 13.2176L10.5867 18.7142C11.2008 19.1814 11.9642 19.458 12.7905 19.458ZM15.0844 12.8471C14.4556 12.3372 13.6577 12.0325 12.7905 12.0325C10.7669 12.0325 9.12064 13.6915 9.12064 15.7453C9.12064 16.7642 9.52588 17.686 10.1814 18.3562L15.0844 12.8471Z" fill="black"/>
</svg>
