find: ‘/run/sudo’: Permiso denegado
find: ‘/run/systemd/unit-root’: Permiso denegado
find: ‘/run/systemd/inaccessible’: Permiso denegado
find: ‘/var/spool/rsyslog’: Permiso denegado
find: ‘/var/spool/cron/crontabs’: Permiso denegado
find: ‘/var/lib/private’: Permiso denegado
find: ‘/var/lib/apt/lists/partial’: Permiso denegado
find: ‘/var/lib/ubuntu-advantage/private’: Permiso denegado
find: ‘/var/cache/apt/archives/partial’: Permiso denegado
find: ‘/var/cache/ldconfig’: Permiso denegado
find: ‘/var/tmp/systemd-private-17d6d7c3149c429abb5d2d383c146885-systemd-resolved.service-faFOr5’: Permiso denegado
find: ‘/var/tmp/systemd-private-17d6d7c3149c429abb5d2d383c146885-systemd-timesyncd.service-8OXoST’: Permiso denegado
find: ‘/sys/kernel/debug’: Permiso denegado
find: ‘/sys/fs/pstore’: Permiso denegado
find: ‘/etc/ssl/private’: Permiso denegado
find: ‘/proc/tty/driver’: Permiso denegado
find: ‘/proc/1/task/1/fd’: Permiso denegado
find: ‘/proc/1/task/1/fdinfo’: Permiso denegado
find: ‘/proc/1/task/1/ns’: Permiso denegado
find: ‘/proc/1/fd’: Permiso denegado
find: ‘/proc/1/map_files’: Permiso denegado
find: ‘/proc/1/fdinfo’: Permiso denegado
find: ‘/proc/1/ns’: Permiso denegado
find: ‘/proc/2/task/2/fd’: Permiso denegado
find: ‘/proc/2/task/2/fdinfo’: Permiso denegado
find: ‘/proc/2/task/2/ns’: Permiso denegado
find: ‘/proc/2/fd’: Permiso denegado
find: ‘/proc/2/map_files’: Permiso denegado
find: ‘/proc/2/fdinfo’: Permiso denegado
find: ‘/proc/2/ns’: Permiso denegado
find: ‘/proc/3/task/3/fd’: Permiso denegado
find: ‘/proc/3/task/3/fdinfo’: Permiso denegado
find: ‘/proc/3/task/3/ns’: Permiso denegado
find: ‘/proc/3/fd’: Permiso denegado
find: ‘/proc/3/map_files’: Permiso denegado
find: ‘/proc/3/fdinfo’: Permiso denegado
find: ‘/proc/3/ns’: Permiso denegado
find: ‘/proc/4/task/4/fd’: Permiso denegado
find: ‘/proc/4/task/4/fdinfo’: Permiso denegado
find: ‘/proc/4/task/4/ns’: Permiso denegado
find: ‘/proc/4/fd’: Permiso denegado
find: ‘/proc/4/map_files’: Permiso denegado
find: ‘/proc/4/fdinfo’: Permiso denegado
find: ‘/proc/4/ns’: Permiso denegado
find: ‘/proc/6/task/6/fd’: Permiso denegado
find: ‘/proc/6/task/6/fdinfo’: Permiso denegado
find: ‘/proc/6/task/6/ns’: Permiso denegado
find: ‘/proc/6/fd’: Permiso denegado
find: ‘/proc/6/map_files’: Permiso denegado
find: ‘/proc/6/fdinfo’: Permiso denegado
find: ‘/proc/6/ns’: Permiso denegado
find: ‘/proc/7/task/7/fd’: Permiso denegado
find: ‘/proc/7/task/7/fdinfo’: Permiso denegado
find: ‘/proc/7/task/7/ns’: Permiso denegado
find: ‘/proc/7/fd’: Permiso denegado
find: ‘/proc/7/map_files’: Permiso denegado
find: ‘/proc/7/fdinfo’: Permiso denegado
find: ‘/proc/7/ns’: Permiso denegado
find: ‘/proc/8/task/8/fd’: Permiso denegado
find: ‘/proc/8/task/8/fdinfo’: Permiso denegado
find: ‘/proc/8/task/8/ns’: Permiso denegado
find: ‘/proc/8/fd’: Permiso denegado
find: ‘/proc/8/map_files’: Permiso denegado
find: ‘/proc/8/fdinfo’: Permiso denegado
find: ‘/proc/8/ns’: Permiso denegado
find: ‘/proc/9/task/9/fd’: Permiso denegado
find: ‘/proc/9/task/9/fdinfo’: Permiso denegado
find: ‘/proc/9/task/9/ns’: Permiso denegado
find: ‘/proc/9/fd’: Permiso denegado
find: ‘/proc/9/map_files’: Permiso denegado
find: ‘/proc/9/fdinfo’: Permiso denegado
find: ‘/proc/9/ns’: Permiso denegado
find: ‘/proc/10/task/10/fd’: Permiso denegado
find: ‘/proc/10/task/10/fdinfo’: Permiso denegado
find: ‘/proc/10/task/10/ns’: Permiso denegado
find: ‘/proc/10/fd’: Permiso denegado
find: ‘/proc/10/map_files’: Permiso denegado
find: ‘/proc/10/fdinfo’: Permiso denegado
find: ‘/proc/10/ns’: Permiso denegado
find: ‘/proc/11/task/11/fd’: Permiso denegado
find: ‘/proc/11/task/11/fdinfo’: Permiso denegado
find: ‘/proc/11/task/11/ns’: Permiso denegado
find: ‘/proc/11/fd’: Permiso denegado
find: ‘/proc/11/map_files’: Permiso denegado
find: ‘/proc/11/fdinfo’: Permiso denegado
find: ‘/proc/11/ns’: Permiso denegado
find: ‘/proc/12/task/12/fd’: Permiso denegado
find: ‘/proc/12/task/12/fdinfo’: Permiso denegado
find: ‘/proc/12/task/12/ns’: Permiso denegado
find: ‘/proc/12/fd’: Permiso denegado
find: ‘/proc/12/map_files’: Permiso denegado
find: ‘/proc/12/fdinfo’: Permiso denegado
find: ‘/proc/12/ns’: Permiso denegado
find: ‘/proc/13/task/13/fd’: Permiso denegado
find: ‘/proc/13/task/13/fdinfo’: Permiso denegado
find: ‘/proc/13/task/13/ns’: Permiso denegado
find: ‘/proc/13/fd’: Permiso denegado
find: ‘/proc/13/map_files’: Permiso denegado
find: ‘/proc/13/fdinfo’: Permiso denegado
find: ‘/proc/13/ns’: Permiso denegado
find: ‘/proc/14/task/14/fd’: Permiso denegado
find: ‘/proc/14/task/14/fdinfo’: Permiso denegado
find: ‘/proc/14/task/14/ns’: Permiso denegado
find: ‘/proc/14/fd’: Permiso denegado
find: ‘/proc/14/map_files’: Permiso denegado
find: ‘/proc/14/fdinfo’: Permiso denegado
find: ‘/proc/14/ns’: Permiso denegado
find: ‘/proc/15/task/15/fd’: Permiso denegado
find: ‘/proc/15/task/15/fdinfo’: Permiso denegado
find: ‘/proc/15/task/15/ns’: Permiso denegado
find: ‘/proc/15/fd’: Permiso denegado
find: ‘/proc/15/map_files’: Permiso denegado
find: ‘/proc/15/fdinfo’: Permiso denegado
find: ‘/proc/15/ns’: Permiso denegado
find: ‘/proc/16/task/16/fd’: Permiso denegado
find: ‘/proc/16/task/16/fdinfo’: Permiso denegado
find: ‘/proc/16/task/16/ns’: Permiso denegado
find: ‘/proc/16/fd’: Permiso denegado
find: ‘/proc/16/map_files’: Permiso denegado
find: ‘/proc/16/fdinfo’: Permiso denegado
find: ‘/proc/16/ns’: Permiso denegado
find: ‘/proc/18/task/18/fd’: Permiso denegado
find: ‘/proc/18/task/18/fdinfo’: Permiso denegado
find: ‘/proc/18/task/18/ns’: Permiso denegado
find: ‘/proc/18/fd’: Permiso denegado
find: ‘/proc/18/map_files’: Permiso denegado
find: ‘/proc/18/fdinfo’: Permiso denegado
find: ‘/proc/18/ns’: Permiso denegado
find: ‘/proc/19/task/19/fd’: Permiso denegado
find: ‘/proc/19/task/19/fdinfo’: Permiso denegado
find: ‘/proc/19/task/19/ns’: Permiso denegado
find: ‘/proc/19/fd’: Permiso denegado
find: ‘/proc/19/map_files’: Permiso denegado
find: ‘/proc/19/fdinfo’: Permiso denegado
find: ‘/proc/19/ns’: Permiso denegado
find: ‘/proc/20/task/20/fd’: Permiso denegado
find: ‘/proc/20/task/20/fdinfo’: Permiso denegado
find: ‘/proc/20/task/20/ns’: Permiso denegado
find: ‘/proc/20/fd’: Permiso denegado
find: ‘/proc/20/map_files’: Permiso denegado
find: ‘/proc/20/fdinfo’: Permiso denegado
find: ‘/proc/20/ns’: Permiso denegado
find: ‘/proc/21/task/21/fd’: Permiso denegado
find: ‘/proc/21/task/21/fdinfo’: Permiso denegado
find: ‘/proc/21/task/21/ns’: Permiso denegado
find: ‘/proc/21/fd’: Permiso denegado
find: ‘/proc/21/map_files’: Permiso denegado
find: ‘/proc/21/fdinfo’: Permiso denegado
find: ‘/proc/21/ns’: Permiso denegado
find: ‘/proc/22/task/22/fd’: Permiso denegado
find: ‘/proc/22/task/22/fdinfo’: Permiso denegado
find: ‘/proc/22/task/22/ns’: Permiso denegado
find: ‘/proc/22/fd’: Permiso denegado
find: ‘/proc/22/map_files’: Permiso denegado
find: ‘/proc/22/fdinfo’: Permiso denegado
find: ‘/proc/22/ns’: Permiso denegado
find: ‘/proc/25/task/25/fd’: Permiso denegado
find: ‘/proc/25/task/25/fdinfo’: Permiso denegado
find: ‘/proc/25/task/25/ns’: Permiso denegado
find: ‘/proc/25/fd’: Permiso denegado
find: ‘/proc/25/map_files’: Permiso denegado
find: ‘/proc/25/fdinfo’: Permiso denegado
find: ‘/proc/25/ns’: Permiso denegado
find: ‘/proc/26/task/26/fd’: Permiso denegado
find: ‘/proc/26/task/26/fdinfo’: Permiso denegado
find: ‘/proc/26/task/26/ns’: Permiso denegado
find: ‘/proc/26/fd’: Permiso denegado
find: ‘/proc/26/map_files’: Permiso denegado
find: ‘/proc/26/fdinfo’: Permiso denegado
find: ‘/proc/26/ns’: Permiso denegado
find: ‘/proc/27/task/27/fd’: Permiso denegado
find: ‘/proc/27/task/27/fdinfo’: Permiso denegado
find: ‘/proc/27/task/27/ns’: Permiso denegado
find: ‘/proc/27/fd’: Permiso denegado
find: ‘/proc/27/map_files’: Permiso denegado
find: ‘/proc/27/fdinfo’: Permiso denegado
find: ‘/proc/27/ns’: Permiso denegado
find: ‘/proc/28/task/28/fd’: Permiso denegado
find: ‘/proc/28/task/28/fdinfo’: Permiso denegado
find: ‘/proc/28/task/28/ns’: Permiso denegado
find: ‘/proc/28/fd’: Permiso denegado
find: ‘/proc/28/map_files’: Permiso denegado
find: ‘/proc/28/fdinfo’: Permiso denegado
find: ‘/proc/28/ns’: Permiso denegado
find: ‘/proc/29/task/29/fd’: Permiso denegado
find: ‘/proc/29/task/29/fdinfo’: Permiso denegado
find: ‘/proc/29/task/29/ns’: Permiso denegado
find: ‘/proc/29/fd’: Permiso denegado
find: ‘/proc/29/map_files’: Permiso denegado
find: ‘/proc/29/fdinfo’: Permiso denegado
find: ‘/proc/29/ns’: Permiso denegado
find: ‘/proc/30/task/30/fd’: Permiso denegado
find: ‘/proc/30/task/30/fdinfo’: Permiso denegado
find: ‘/proc/30/task/30/ns’: Permiso denegado
find: ‘/proc/30/fd’: Permiso denegado
find: ‘/proc/30/map_files’: Permiso denegado
find: ‘/proc/30/fdinfo’: Permiso denegado
find: ‘/proc/30/ns’: Permiso denegado
find: ‘/proc/31/task/31/fd’: Permiso denegado
find: ‘/proc/31/task/31/fdinfo’: Permiso denegado
find: ‘/proc/31/task/31/ns’: Permiso denegado
find: ‘/proc/31/fd’: Permiso denegado
find: ‘/proc/31/map_files’: Permiso denegado
find: ‘/proc/31/fdinfo’: Permiso denegado
find: ‘/proc/31/ns’: Permiso denegado
find: ‘/proc/32/task/32/fd’: Permiso denegado
find: ‘/proc/32/task/32/fdinfo’: Permiso denegado
find: ‘/proc/32/task/32/ns’: Permiso denegado
find: ‘/proc/32/fd’: Permiso denegado
find: ‘/proc/32/map_files’: Permiso denegado
find: ‘/proc/32/fdinfo’: Permiso denegado
find: ‘/proc/32/ns’: Permiso denegado
find: ‘/proc/33/task/33/fd’: Permiso denegado
find: ‘/proc/33/task/33/fdinfo’: Permiso denegado
find: ‘/proc/33/task/33/ns’: Permiso denegado
find: ‘/proc/33/fd’: Permiso denegado
find: ‘/proc/33/map_files’: Permiso denegado
find: ‘/proc/33/fdinfo’: Permiso denegado
find: ‘/proc/33/ns’: Permiso denegado
find: ‘/proc/34/task/34/fd’: Permiso denegado
find: ‘/proc/34/task/34/fdinfo’: Permiso denegado
find: ‘/proc/34/task/34/ns’: Permiso denegado
find: ‘/proc/34/fd’: Permiso denegado
find: ‘/proc/34/map_files’: Permiso denegado
find: ‘/proc/34/fdinfo’: Permiso denegado
find: ‘/proc/34/ns’: Permiso denegado
find: ‘/proc/35/task/35/fd’: Permiso denegado
find: ‘/proc/35/task/35/fdinfo’: Permiso denegado
find: ‘/proc/35/task/35/ns’: Permiso denegado
find: ‘/proc/35/fd’: Permiso denegado
find: ‘/proc/35/map_files’: Permiso denegado
find: ‘/proc/35/fdinfo’: Permiso denegado
find: ‘/proc/35/ns’: Permiso denegado
find: ‘/proc/36/task/36/fd’: Permiso denegado
find: ‘/proc/36/task/36/fdinfo’: Permiso denegado
find: ‘/proc/36/task/36/ns’: Permiso denegado
find: ‘/proc/36/fd’: Permiso denegado
find: ‘/proc/36/map_files’: Permiso denegado
find: ‘/proc/36/fdinfo’: Permiso denegado
find: ‘/proc/36/ns’: Permiso denegado
find: ‘/proc/37/task/37/fd’: Permiso denegado
find: ‘/proc/37/task/37/fdinfo’: Permiso denegado
find: ‘/proc/37/task/37/ns’: Permiso denegado
find: ‘/proc/37/fd’: Permiso denegado
find: ‘/proc/37/map_files’: Permiso denegado
find: ‘/proc/37/fdinfo’: Permiso denegado
find: ‘/proc/37/ns’: Permiso denegado
find: ‘/proc/38/task/38/fd’: Permiso denegado
find: ‘/proc/38/task/38/fdinfo’: Permiso denegado
find: ‘/proc/38/task/38/ns’: Permiso denegado
find: ‘/proc/38/fd’: Permiso denegado
find: ‘/proc/38/map_files’: Permiso denegado
find: ‘/proc/38/fdinfo’: Permiso denegado
find: ‘/proc/38/ns’: Permiso denegado
find: ‘/proc/41/task/41/fd’: Permiso denegado
find: ‘/proc/41/task/41/fdinfo’: Permiso denegado
find: ‘/proc/41/task/41/ns’: Permiso denegado
find: ‘/proc/41/fd’: Permiso denegado
find: ‘/proc/41/map_files’: Permiso denegado
find: ‘/proc/41/fdinfo’: Permiso denegado
find: ‘/proc/41/ns’: Permiso denegado
find: ‘/proc/42/task/42/fd’: Permiso denegado
find: ‘/proc/42/task/42/fdinfo’: Permiso denegado
find: ‘/proc/42/task/42/ns’: Permiso denegado
find: ‘/proc/42/fd’: Permiso denegado
find: ‘/proc/42/map_files’: Permiso denegado
find: ‘/proc/42/fdinfo’: Permiso denegado
find: ‘/proc/42/ns’: Permiso denegado
find: ‘/proc/43/task/43/fd’: Permiso denegado
find: ‘/proc/43/task/43/fdinfo’: Permiso denegado
find: ‘/proc/43/task/43/ns’: Permiso denegado
find: ‘/proc/43/fd’: Permiso denegado
find: ‘/proc/43/map_files’: Permiso denegado
find: ‘/proc/43/fdinfo’: Permiso denegado
find: ‘/proc/43/ns’: Permiso denegado
find: ‘/proc/85/task/85/fd’: Permiso denegado
find: ‘/proc/85/task/85/fdinfo’: Permiso denegado
find: ‘/proc/85/task/85/ns’: Permiso denegado
find: ‘/proc/85/fd’: Permiso denegado
find: ‘/proc/85/map_files’: Permiso denegado
find: ‘/proc/85/fdinfo’: Permiso denegado
find: ‘/proc/85/ns’: Permiso denegado
find: ‘/proc/86/task/86/fd’: Permiso denegado
find: ‘/proc/86/task/86/fdinfo’: Permiso denegado
find: ‘/proc/86/task/86/ns’: Permiso denegado
find: ‘/proc/86/fd’: Permiso denegado
find: ‘/proc/86/map_files’: Permiso denegado
find: ‘/proc/86/fdinfo’: Permiso denegado
find: ‘/proc/86/ns’: Permiso denegado
find: ‘/proc/87/task/87/fd’: Permiso denegado
find: ‘/proc/87/task/87/fdinfo’: Permiso denegado
find: ‘/proc/87/task/87/ns’: Permiso denegado
find: ‘/proc/87/fd’: Permiso denegado
find: ‘/proc/87/map_files’: Permiso denegado
find: ‘/proc/87/fdinfo’: Permiso denegado
find: ‘/proc/87/ns’: Permiso denegado
find: ‘/proc/88/task/88/fd’: Permiso denegado
find: ‘/proc/88/task/88/fdinfo’: Permiso denegado
find: ‘/proc/88/task/88/ns’: Permiso denegado
find: ‘/proc/88/fd’: Permiso denegado
find: ‘/proc/88/map_files’: Permiso denegado
find: ‘/proc/88/fdinfo’: Permiso denegado
find: ‘/proc/88/ns’: Permiso denegado
find: ‘/proc/89/task/89/fd’: Permiso denegado
find: ‘/proc/89/task/89/fdinfo’: Permiso denegado
find: ‘/proc/89/task/89/ns’: Permiso denegado
find: ‘/proc/89/fd’: Permiso denegado
find: ‘/proc/89/map_files’: Permiso denegado
find: ‘/proc/89/fdinfo’: Permiso denegado
find: ‘/proc/89/ns’: Permiso denegado
find: ‘/proc/90/task/90/fd’: Permiso denegado
find: ‘/proc/90/task/90/fdinfo’: Permiso denegado
find: ‘/proc/90/task/90/ns’: Permiso denegado
find: ‘/proc/90/fd’: Permiso denegado
find: ‘/proc/90/map_files’: Permiso denegado
find: ‘/proc/90/fdinfo’: Permiso denegado
find: ‘/proc/90/ns’: Permiso denegado
find: ‘/proc/96/task/96/fd’: Permiso denegado
find: ‘/proc/96/task/96/fdinfo’: Permiso denegado
find: ‘/proc/96/task/96/ns’: Permiso denegado
find: ‘/proc/96/fd’: Permiso denegado
find: ‘/proc/96/map_files’: Permiso denegado
find: ‘/proc/96/fdinfo’: Permiso denegado
find: ‘/proc/96/ns’: Permiso denegado
find: ‘/proc/105/task/105/fd’: Permiso denegado
find: ‘/proc/105/task/105/fdinfo’: Permiso denegado
find: ‘/proc/105/task/105/ns’: Permiso denegado
find: ‘/proc/105/fd’: Permiso denegado
find: ‘/proc/105/map_files’: Permiso denegado
find: ‘/proc/105/fdinfo’: Permiso denegado
find: ‘/proc/105/ns’: Permiso denegado
find: ‘/proc/122/task/122/fd’: Permiso denegado
find: ‘/proc/122/task/122/fdinfo’: Permiso denegado
find: ‘/proc/122/task/122/ns’: Permiso denegado
find: ‘/proc/122/fd’: Permiso denegado
find: ‘/proc/122/map_files’: Permiso denegado
find: ‘/proc/122/fdinfo’: Permiso denegado
find: ‘/proc/122/ns’: Permiso denegado
find: ‘/proc/123/task/123/fd’: Permiso denegado
find: ‘/proc/123/task/123/fdinfo’: Permiso denegado
find: ‘/proc/123/task/123/ns’: Permiso denegado
find: ‘/proc/123/fd’: Permiso denegado
find: ‘/proc/123/map_files’: Permiso denegado
find: ‘/proc/123/fdinfo’: Permiso denegado
find: ‘/proc/123/ns’: Permiso denegado
find: ‘/proc/171/task/171/fd’: Permiso denegado
find: ‘/proc/171/task/171/fdinfo’: Permiso denegado
find: ‘/proc/171/task/171/ns’: Permiso denegado
find: ‘/proc/171/fd’: Permiso denegado
find: ‘/proc/171/map_files’: Permiso denegado
find: ‘/proc/171/fdinfo’: Permiso denegado
find: ‘/proc/171/ns’: Permiso denegado
find: ‘/proc/172/task/172/fd’: Permiso denegado
find: ‘/proc/172/task/172/fdinfo’: Permiso denegado
find: ‘/proc/172/task/172/ns’: Permiso denegado
find: ‘/proc/172/fd’: Permiso denegado
find: ‘/proc/172/map_files’: Permiso denegado
find: ‘/proc/172/fdinfo’: Permiso denegado
find: ‘/proc/172/ns’: Permiso denegado
find: ‘/proc/173/task/173/fd’: Permiso denegado
find: ‘/proc/173/task/173/fdinfo’: Permiso denegado
find: ‘/proc/173/task/173/ns’: Permiso denegado
find: ‘/proc/173/fd’: Permiso denegado
find: ‘/proc/173/map_files’: Permiso denegado
find: ‘/proc/173/fdinfo’: Permiso denegado
find: ‘/proc/173/ns’: Permiso denegado
find: ‘/proc/176/task/176/fd’: Permiso denegado
find: ‘/proc/176/task/176/fdinfo’: Permiso denegado
find: ‘/proc/176/task/176/ns’: Permiso denegado
find: ‘/proc/176/fd’: Permiso denegado
find: ‘/proc/176/map_files’: Permiso denegado
find: ‘/proc/176/fdinfo’: Permiso denegado
find: ‘/proc/176/ns’: Permiso denegado
find: ‘/proc/197/task/197/fd’: Permiso denegado
find: ‘/proc/197/task/197/fdinfo’: Permiso denegado
find: ‘/proc/197/task/197/ns’: Permiso denegado
find: ‘/proc/197/fd’: Permiso denegado
find: ‘/proc/197/map_files’: Permiso denegado
find: ‘/proc/197/fdinfo’: Permiso denegado
find: ‘/proc/197/ns’: Permiso denegado
find: ‘/proc/198/task/198/fd’: Permiso denegado
find: ‘/proc/198/task/198/fdinfo’: Permiso denegado
find: ‘/proc/198/task/198/ns’: Permiso denegado
find: ‘/proc/198/fd’: Permiso denegado
find: ‘/proc/198/map_files’: Permiso denegado
find: ‘/proc/198/fdinfo’: Permiso denegado
find: ‘/proc/198/ns’: Permiso denegado
find: ‘/proc/224/task/224/fd’: Permiso denegado
find: ‘/proc/224/task/224/fdinfo’: Permiso denegado
find: ‘/proc/224/task/224/ns’: Permiso denegado
find: ‘/proc/224/fd’: Permiso denegado
find: ‘/proc/224/map_files’: Permiso denegado
find: ‘/proc/224/fdinfo’: Permiso denegado
find: ‘/proc/224/ns’: Permiso denegado
find: ‘/proc/237/task/237/fd’: Permiso denegado
find: ‘/proc/237/task/237/fdinfo’: Permiso denegado
find: ‘/proc/237/task/237/ns’: Permiso denegado
find: ‘/proc/237/fd’: Permiso denegado
find: ‘/proc/237/map_files’: Permiso denegado
find: ‘/proc/237/fdinfo’: Permiso denegado
find: ‘/proc/237/ns’: Permiso denegado
find: ‘/proc/260/task/260/fd’: Permiso denegado
find: ‘/proc/260/task/260/fdinfo’: Permiso denegado
find: ‘/proc/260/task/260/ns’: Permiso denegado
find: ‘/proc/260/fd’: Permiso denegado
find: ‘/proc/260/map_files’: Permiso denegado
find: ‘/proc/260/fdinfo’: Permiso denegado
find: ‘/proc/260/ns’: Permiso denegado
find: ‘/proc/267/task/267/fd’: Permiso denegado
find: ‘/proc/267/task/267/fdinfo’: Permiso denegado
find: ‘/proc/267/task/267/ns’: Permiso denegado
find: ‘/proc/267/task/289/fd’: Permiso denegado
find: ‘/proc/267/task/289/fdinfo’: Permiso denegado
find: ‘/proc/267/task/289/ns’: Permiso denegado
find: ‘/proc/267/fd’: Permiso denegado
find: ‘/proc/267/map_files’: Permiso denegado
find: ‘/proc/267/fdinfo’: Permiso denegado
find: ‘/proc/267/ns’: Permiso denegado
find: ‘/proc/270/task/270/fd’: Permiso denegado
find: ‘/proc/270/task/270/fdinfo’: Permiso denegado
find: ‘/proc/270/task/270/ns’: Permiso denegado
find: ‘/proc/270/fd’: Permiso denegado
find: ‘/proc/270/map_files’: Permiso denegado
find: ‘/proc/270/fdinfo’: Permiso denegado
find: ‘/proc/270/ns’: Permiso denegado
find: ‘/proc/290/task/290/fd’: Permiso denegado
find: ‘/proc/290/task/290/fdinfo’: Permiso denegado
find: ‘/proc/290/task/290/ns’: Permiso denegado
find: ‘/proc/290/fd’: Permiso denegado
find: ‘/proc/290/map_files’: Permiso denegado
find: ‘/proc/290/fdinfo’: Permiso denegado
find: ‘/proc/290/ns’: Permiso denegado
find: ‘/proc/339/task/339/fd’: Permiso denegado
find: ‘/proc/339/task/339/fdinfo’: Permiso denegado
find: ‘/proc/339/task/339/ns’: Permiso denegado
find: ‘/proc/339/fd’: Permiso denegado
find: ‘/proc/339/map_files’: Permiso denegado
find: ‘/proc/339/fdinfo’: Permiso denegado
find: ‘/proc/339/ns’: Permiso denegado
find: ‘/proc/346/task/346/fd’: Permiso denegado
find: ‘/proc/346/task/346/fdinfo’: Permiso denegado
find: ‘/proc/346/task/346/ns’: Permiso denegado
find: ‘/proc/346/fd’: Permiso denegado
find: ‘/proc/346/map_files’: Permiso denegado
find: ‘/proc/346/fdinfo’: Permiso denegado
find: ‘/proc/346/ns’: Permiso denegado
find: ‘/proc/347/task/347/fd’: Permiso denegado
find: ‘/proc/347/task/347/fdinfo’: Permiso denegado
find: ‘/proc/347/task/347/ns’: Permiso denegado
find: ‘/proc/347/fd’: Permiso denegado
find: ‘/proc/347/map_files’: Permiso denegado
find: ‘/proc/347/fdinfo’: Permiso denegado
find: ‘/proc/347/ns’: Permiso denegado
find: ‘/proc/388/task/388/fd’: Permiso denegado
find: ‘/proc/388/task/388/fdinfo’: Permiso denegado
find: ‘/proc/388/task/388/ns’: Permiso denegado
find: ‘/proc/388/fd’: Permiso denegado
find: ‘/proc/388/map_files’: Permiso denegado
find: ‘/proc/388/fdinfo’: Permiso denegado
find: ‘/proc/388/ns’: Permiso denegado
find: ‘/proc/436/task/436/fd’: Permiso denegado
find: ‘/proc/436/task/436/fdinfo’: Permiso denegado
find: ‘/proc/436/task/436/ns’: Permiso denegado
find: ‘/proc/436/task/467/fd’: Permiso denegado
find: ‘/proc/436/task/467/fdinfo’: Permiso denegado
find: ‘/proc/436/task/467/ns’: Permiso denegado
find: ‘/proc/436/fd’: Permiso denegado
find: ‘/proc/436/map_files’: Permiso denegado
find: ‘/proc/436/fdinfo’: Permiso denegado
find: ‘/proc/436/ns’: Permiso denegado
find: ‘/proc/437/task/437/fd’: Permiso denegado
find: ‘/proc/437/task/437/fdinfo’: Permiso denegado
find: ‘/proc/437/task/437/ns’: Permiso denegado
find: ‘/proc/437/task/452/fd’: Permiso denegado
find: ‘/proc/437/task/452/fdinfo’: Permiso denegado
find: ‘/proc/437/task/452/ns’: Permiso denegado
find: ‘/proc/437/fd’: Permiso denegado
find: ‘/proc/437/map_files’: Permiso denegado
find: ‘/proc/437/fdinfo’: Permiso denegado
find: ‘/proc/437/ns’: Permiso denegado
find: ‘/proc/438/task/438/fd’: Permiso denegado
find: ‘/proc/438/task/438/fdinfo’: Permiso denegado
find: ‘/proc/438/task/438/ns’: Permiso denegado
find: ‘/proc/438/fd’: Permiso denegado
find: ‘/proc/438/map_files’: Permiso denegado
find: ‘/proc/438/fdinfo’: Permiso denegado
find: ‘/proc/438/ns’: Permiso denegado
find: ‘/proc/441/task/441/fd’: Permiso denegado
find: ‘/proc/441/task/441/fdinfo’: Permiso denegado
find: ‘/proc/441/task/441/ns’: Permiso denegado
find: ‘/proc/441/fd’: Permiso denegado
find: ‘/proc/441/map_files’: Permiso denegado
find: ‘/proc/441/fdinfo’: Permiso denegado
find: ‘/proc/441/ns’: Permiso denegado
find: ‘/proc/442/task/442/fd’: Permiso denegado
find: ‘/proc/442/task/442/fdinfo’: Permiso denegado
find: ‘/proc/442/task/442/ns’: Permiso denegado
find: ‘/proc/442/task/457/fd’: Permiso denegado
find: ‘/proc/442/task/457/fdinfo’: Permiso denegado
find: ‘/proc/442/task/457/ns’: Permiso denegado
find: ‘/proc/442/task/465/fd’: Permiso denegado
find: ‘/proc/442/task/465/fdinfo’: Permiso denegado
find: ‘/proc/442/task/465/ns’: Permiso denegado
find: ‘/proc/442/fd’: Permiso denegado
find: ‘/proc/442/map_files’: Permiso denegado
find: ‘/proc/442/fdinfo’: Permiso denegado
find: ‘/proc/442/ns’: Permiso denegado
find: ‘/proc/443/task/443/fd’: Permiso denegado
find: ‘/proc/443/task/443/fdinfo’: Permiso denegado
find: ‘/proc/443/task/443/ns’: Permiso denegado
find: ‘/proc/443/task/458/fd’: Permiso denegado
find: ‘/proc/443/task/458/fdinfo’: Permiso denegado
find: ‘/proc/443/task/458/ns’: Permiso denegado
find: ‘/proc/443/task/459/fd’: Permiso denegado
find: ‘/proc/443/task/459/fdinfo’: Permiso denegado
find: ‘/proc/443/task/459/ns’: Permiso denegado
find: ‘/proc/443/task/460/fd’: Permiso denegado
find: ‘/proc/443/task/460/fdinfo’: Permiso denegado
find: ‘/proc/443/task/460/ns’: Permiso denegado
find: ‘/proc/443/fd’: Permiso denegado
find: ‘/proc/443/map_files’: Permiso denegado
find: ‘/proc/443/fdinfo’: Permiso denegado
find: ‘/proc/443/ns’: Permiso denegado
find: ‘/proc/456/task/456/fd’: Permiso denegado
find: ‘/proc/456/task/456/fdinfo’: Permiso denegado
find: ‘/proc/456/task/456/ns’: Permiso denegado
find: ‘/proc/456/fd’: Permiso denegado
find: ‘/proc/456/map_files’: Permiso denegado
find: ‘/proc/456/fdinfo’: Permiso denegado
find: ‘/proc/456/ns’: Permiso denegado
find: ‘/proc/462/task/462/fd’: Permiso denegado
find: ‘/proc/462/task/462/fdinfo’: Permiso denegado
find: ‘/proc/462/task/462/ns’: Permiso denegado
find: ‘/proc/462/fd’: Permiso denegado
find: ‘/proc/462/map_files’: Permiso denegado
find: ‘/proc/462/fdinfo’: Permiso denegado
find: ‘/proc/462/ns’: Permiso denegado
find: ‘/proc/565/task/565/fd’: Permiso denegado
find: ‘/proc/565/task/565/fdinfo’: Permiso denegado
find: ‘/proc/565/task/565/ns’: Permiso denegado
find: ‘/proc/565/fd’: Permiso denegado
find: ‘/proc/565/map_files’: Permiso denegado
find: ‘/proc/565/fdinfo’: Permiso denegado
find: ‘/proc/565/ns’: Permiso denegado
find: ‘/proc/568/task/568/fd’: Permiso denegado
find: ‘/proc/568/task/568/fdinfo’: Permiso denegado
find: ‘/proc/568/task/568/ns’: Permiso denegado
find: ‘/proc/568/fd’: Permiso denegado
find: ‘/proc/568/map_files’: Permiso denegado
find: ‘/proc/568/fdinfo’: Permiso denegado
find: ‘/proc/568/ns’: Permiso denegado
find: ‘/proc/590/task/590/fd’: Permiso denegado
find: ‘/proc/590/task/590/fdinfo’: Permiso denegado
find: ‘/proc/590/task/590/ns’: Permiso denegado
find: ‘/proc/590/fd’: Permiso denegado
find: ‘/proc/590/map_files’: Permiso denegado
find: ‘/proc/590/fdinfo’: Permiso denegado
find: ‘/proc/590/ns’: Permiso denegado
find: ‘/proc/656/task/656/fd’: Permiso denegado
find: ‘/proc/656/task/656/fdinfo’: Permiso denegado
find: ‘/proc/656/task/656/ns’: Permiso denegado
find: ‘/proc/656/fd’: Permiso denegado
find: ‘/proc/656/map_files’: Permiso denegado
find: ‘/proc/656/fdinfo’: Permiso denegado
find: ‘/proc/656/ns’: Permiso denegado
find: ‘/proc/657/task/657/fd’: Permiso denegado
find: ‘/proc/657/task/657/fdinfo’: Permiso denegado
find: ‘/proc/657/task/657/ns’: Permiso denegado
find: ‘/proc/657/fd’: Permiso denegado
find: ‘/proc/657/map_files’: Permiso denegado
find: ‘/proc/657/fdinfo’: Permiso denegado
find: ‘/proc/657/ns’: Permiso denegado
find: ‘/proc/658/task/658/fd’: Permiso denegado
find: ‘/proc/658/task/658/fdinfo’: Permiso denegado
find: ‘/proc/658/task/658/ns’: Permiso denegado
find: ‘/proc/658/fd’: Permiso denegado
find: ‘/proc/658/map_files’: Permiso denegado
find: ‘/proc/658/fdinfo’: Permiso denegado
find: ‘/proc/658/ns’: Permiso denegado
find: ‘/proc/663/task/663/fd’: Permiso denegado
find: ‘/proc/663/task/663/fdinfo’: Permiso denegado
find: ‘/proc/663/task/663/ns’: Permiso denegado
find: ‘/proc/663/fd’: Permiso denegado
find: ‘/proc/663/map_files’: Permiso denegado
find: ‘/proc/663/fdinfo’: Permiso denegado
find: ‘/proc/663/ns’: Permiso denegado
find: ‘/proc/691/task/691/fd’: Permiso denegado
find: ‘/proc/691/task/691/fdinfo’: Permiso denegado
find: ‘/proc/691/task/691/ns’: Permiso denegado
find: ‘/proc/691/fd’: Permiso denegado
find: ‘/proc/691/map_files’: Permiso denegado
find: ‘/proc/691/fdinfo’: Permiso denegado
find: ‘/proc/691/ns’: Permiso denegado
find: ‘/proc/692/task/692/fd’: Permiso denegado
find: ‘/proc/692/task/692/fdinfo’: Permiso denegado
find: ‘/proc/692/task/692/ns’: Permiso denegado
find: ‘/proc/692/fd’: Permiso denegado
find: ‘/proc/692/map_files’: Permiso denegado
find: ‘/proc/692/fdinfo’: Permiso denegado
find: ‘/proc/692/ns’: Permiso denegado
find: ‘/proc/705/task/705/fd’: Permiso denegado
find: ‘/proc/705/task/705/fdinfo’: Permiso denegado
find: ‘/proc/705/task/705/ns’: Permiso denegado
find: ‘/proc/705/fd’: Permiso denegado
find: ‘/proc/705/map_files’: Permiso denegado
find: ‘/proc/705/fdinfo’: Permiso denegado
find: ‘/proc/705/ns’: Permiso denegado
find: ‘/lost+found’: Permiso denegado
find: ‘/root’: Permiso denegado
find: ‘/tmp/systemd-private-17d6d7c3149c429abb5d2d383c146885-systemd-timesyncd.service-CMtW0j’: Permiso denegado
find: ‘/tmp/systemd-private-17d6d7c3149c429abb5d2d383c146885-systemd-resolved.service-dau6Eu’: Permiso denegado
