{
//VITRINA GENERAL SITIO

    "product-summary.shelf#squid": {
    
        "children": [
          "product-summary-image",
          "product-summary-name",
          "product-summary-space",
          "product-price",
          "product-summary-quantity",
          "add-to-cart-button"
        ],
      
        "props":{
          "blockClass": "vitrina"
        }
      }
}