<svg width="86" height="73" viewBox="0 0 86 73" fill="none" xmlns="http://www.w3.org/2000/svg">
<path d="M46.9104 9.02047C46.1768 3.87824 41.7008 0 36.4995 0C33.1544 0 29.9776 1.61415 28.0024 4.31939C27.599 4.87109 27.7197 5.645 28.2714 6.04844C28.8213 6.45044 29.597 6.33118 29.9997 5.77875C31.5117 3.71005 33.941 2.47469 36.4991 2.47469C40.477 2.47469 43.8993 5.4391 44.4604 9.36954C44.5488 9.98686 45.0784 10.4324 45.6841 10.4324C45.7418 10.4324 45.8012 10.428 45.8603 10.42C46.5367 10.3232 47.0068 9.6965 46.9104 9.02047Z" fill="#4B4B4B"/>
<path d="M64.7806 22.8714L61.0688 16.6849C60.8455 16.3119 60.4428 16.0842 60.0078 16.0842H56.4507C55.7678 16.0842 55.2135 16.6385 55.2135 17.3214C55.2135 18.0043 55.7678 18.5586 56.4507 18.5586H59.3074L61.5346 22.2704H11.464L13.6911 18.5586H15.0015C15.6844 18.5586 16.2386 18.0043 16.2386 17.3214C16.2386 16.6385 15.6844 16.0842 15.0015 16.0842H12.9908C12.5558 16.0842 12.1531 16.3119 11.9298 16.6849L8.21792 22.8714C7.98846 23.2542 7.98303 23.7302 8.20233 24.118C8.42164 24.5059 8.83269 24.7458 9.27891 24.7458H63.7196C64.1658 24.7458 64.5765 24.5059 64.7962 24.118C65.0159 23.7302 65.0101 23.2535 64.7806 22.8714Z" fill="#4B4B4B"/>
<path d="M58.6133 11.463C58.44 11.1835 58.1634 10.9852 57.8437 10.9105L40.9769 6.96559C40.6575 6.89056 40.3211 6.94638 40.042 7.11893C39.7636 7.29219 39.565 7.56877 39.4903 7.88848L38.2184 13.3258C38.0625 13.9909 38.4757 14.6565 39.1413 14.8116C39.8064 14.9675 40.4727 14.5542 40.6278 13.8887L41.6181 9.65669L56.0752 13.0383L53.8035 22.7511C53.6476 23.4163 54.0608 24.0818 54.7264 24.237C54.8217 24.2591 54.9163 24.2696 55.0098 24.2696C55.5717 24.2696 56.0802 23.8846 56.2125 23.3144L58.7663 12.3971C58.8417 12.0777 58.7866 11.7413 58.6133 11.463Z" fill="#4B4B4B"/>
<path d="M37.1538 14.3878L36.0264 4.85259C35.988 4.52672 35.8216 4.22912 35.5635 4.02612C35.3054 3.82313 34.9796 3.73034 34.6522 3.76876L13.9579 6.21482C13.2797 6.29529 12.7947 6.91006 12.8748 7.589L14.7543 23.4924C14.829 24.122 15.3629 24.5849 15.9817 24.5849C16.0299 24.5849 16.0795 24.5816 16.1288 24.5762C16.8067 24.4957 17.2917 23.8809 17.212 23.202L15.4775 8.52639L33.7145 6.37105L34.6961 14.6774C34.7766 15.356 35.3885 15.8381 36.0703 15.7613C36.7485 15.6815 37.2335 15.0664 37.1538 14.3878Z" fill="#4B4B4B"/>
<path d="M46.9391 23.0382L44.4832 12.8256C44.4064 12.5069 44.2059 12.2311 43.9264 12.0596C43.647 11.8896 43.3117 11.8363 42.9909 11.9125L23.0588 16.706C22.3944 16.8655 21.9855 17.5339 22.145 18.1983L23.3724 23.3029C23.5319 23.968 24.2003 24.3773 24.8644 24.2167C25.5288 24.0572 25.9377 23.3888 25.7782 22.7243L24.8397 18.8225L42.3659 14.6083L44.5325 23.6175C44.6685 24.1848 45.1759 24.5654 45.7345 24.5654C45.8306 24.5654 45.9277 24.5542 46.0252 24.5306C46.6897 24.3707 47.0986 23.7027 46.9391 23.0382Z" fill="#4B4B4B"/>
<path d="M64.9565 23.4452C64.9224 22.7877 64.3794 22.2715 63.7204 22.2715H9.27966C8.62066 22.2715 8.07766 22.7873 8.04358 23.4452L5.56889 71.6994C5.55149 72.0379 5.67401 72.3692 5.90745 72.615C6.14126 72.8604 6.46532 73 6.80461 73H66.1943C66.5333 73 66.8577 72.8608 67.0926 72.615C67.3257 72.3692 67.4482 72.0383 67.4311 71.6994L64.9565 23.4452ZM8.10666 70.5253L10.4545 24.7458H62.5441L64.8919 70.5253H8.10666Z" fill="#4B4B4B"/>
<path d="M45.7791 27.2202C43.7321 27.2202 42.0672 28.8851 42.0672 30.9321C42.0672 32.979 43.7321 34.6439 45.7791 34.6439C47.826 34.6439 49.4909 32.979 49.4909 30.9321C49.4909 28.8851 47.826 27.2202 45.7791 27.2202ZM45.7791 32.1696C45.0965 32.1696 44.5419 31.6146 44.5419 30.9324C44.5419 30.2502 45.0969 29.6953 45.7791 29.6953C46.4613 29.6953 47.0163 30.2502 47.0163 30.9324C47.0163 31.6146 46.4613 32.1696 45.7791 32.1696Z" fill="#4B4B4B"/>
<path d="M27.2198 27.2202C25.1728 27.2202 23.5079 28.8851 23.5079 30.9321C23.5079 32.979 25.1728 34.6439 27.2198 34.6439C29.2668 34.6439 30.9317 32.979 30.9317 30.9321C30.9317 28.8851 29.2668 27.2202 27.2198 27.2202ZM27.2198 32.1696C26.5376 32.1696 25.9826 31.6146 25.9826 30.9324C25.9826 30.2502 26.5376 29.6953 27.2198 29.6953C27.902 29.6953 28.457 30.2502 28.457 30.9324C28.457 31.6146 27.902 32.1696 27.2198 32.1696Z" fill="#4B4B4B"/>
<path d="M45.7791 30.932H45.6838C45.0009 30.932 44.4466 31.4862 44.4466 32.1692C44.4466 32.3381 44.48 32.4994 44.542 32.6462V38.9741C44.542 43.4084 40.9341 47.0166 36.4995 47.0166C32.0648 47.0166 28.457 43.4088 28.457 38.9741V32.1695C28.457 31.4866 27.9028 30.9324 27.2198 30.9324C26.5369 30.9324 25.9827 31.4866 25.9827 32.1695V38.9745C25.9827 44.7735 30.7004 49.4913 36.4995 49.4913C42.2985 49.4913 47.0163 44.7735 47.0163 38.9745V32.1695C47.0163 31.4866 46.462 30.932 45.7791 30.932Z" fill="#4B4B4B"/>
<g clip-path="url(#clip0)">
<path d="M81.7291 31.9997H70.8929C68.8523 31.9939 66.8942 32.8047 65.4551 34.2513L46.4563 53.2518C44.5146 55.1955 44.5146 58.3449 46.4563 60.2886L57.7094 71.5433C59.6531 73.4851 62.8025 73.4851 64.7462 71.5433L83.7484 52.5429C85.1852 51.0979 85.9943 49.1446 86 47.1068V36.2706C86 33.9119 84.0879 31.9997 81.7291 31.9997ZM76.604 45.6667C74.2452 45.6667 72.3331 43.7545 72.3331 41.3958C72.3331 39.037 74.2452 37.1248 76.604 37.1248C78.9627 37.1248 80.8749 39.0369 80.8749 41.3957C80.8749 43.7544 78.9627 45.6667 76.604 45.6667Z" fill="#EC5623"/>
<path d="M62.937 62.7507C62.4653 62.7507 62.0828 62.3682 62.0828 61.8965V48.2296C62.0828 47.7578 62.4653 47.3754 62.937 47.3754C63.4088 47.3754 63.7912 47.7578 63.7912 48.2296V61.8966C63.7912 62.3683 63.4088 62.7507 62.937 62.7507Z" fill="#FAFAFA"/>
<path d="M57.8119 55.9172C56.3966 55.9172 55.2493 54.7699 55.2493 53.3547C55.2493 51.9394 56.3966 50.7921 57.8119 50.7921C59.2271 50.7921 60.3744 51.9394 60.3744 53.3547C60.3744 54.7699 59.2271 55.9172 57.8119 55.9172ZM57.8119 52.5005C57.3401 52.5005 56.9577 52.8829 56.9577 53.3547C56.9577 53.8264 57.3401 54.2089 57.8119 54.2089C58.2836 54.2089 58.6661 53.8264 58.6661 53.3547C58.6661 52.8829 58.2836 52.5005 57.8119 52.5005Z" fill="#FAFAFA"/>
<path d="M68.0621 59.334C66.6468 59.334 65.4995 58.1867 65.4995 56.7714C65.4995 55.3562 66.6468 54.2089 68.0621 54.2089C69.4774 54.2089 70.6247 55.3562 70.6247 56.7714C70.6247 58.1867 69.4774 59.334 68.0621 59.334ZM68.0621 55.9172C67.5904 55.9172 67.2079 56.2997 67.2079 56.7714C67.2079 57.2432 67.5904 57.6256 68.0621 57.6256C68.5339 57.6256 68.9163 57.2432 68.9163 56.7714C68.9163 56.2997 68.5339 55.9172 68.0621 55.9172Z" fill="#FAFAFA"/>
</g>
<defs>
<clipPath id="clip0">
<rect width="41" height="41" fill="white" transform="translate(45 32)"/>
</clipPath>
</defs>
</svg>
