<svg width="55" height="55" viewBox="0 0 55 55" fill="none" xmlns="http://www.w3.org/2000/svg">
<g clip-path="url(#clip0)">
<path d="M52.7865 45.4869L50.9047 34.8241C50.5616 32.8799 48.8797 31.4689 46.9055 31.4689H46.196L45.4826 25.9892C45.7475 25.7926 45.9912 25.5635 46.2056 25.3024C46.9801 24.3591 47.288 23.1315 47.0503 21.9343L46.1877 17.5965C46.1009 17.1601 45.6767 16.8765 45.2404 16.9634C44.804 17.0502 44.5206 17.4743 44.6074 17.9107L45.47 22.2481C45.6133 22.9703 45.4275 23.7108 44.9602 24.2799C44.493 24.849 43.8028 25.1754 43.0665 25.1754H11.9335C11.1972 25.1754 10.507 24.849 10.0397 24.2799C9.57246 23.7108 9.38673 22.9703 9.53003 22.2484L11.4926 12.3731C11.7199 11.2301 12.7303 10.4006 13.895 10.4006H41.105C42.2696 10.4006 43.2801 11.2302 43.5074 12.3727L43.8747 14.2236C43.9613 14.66 44.3851 14.9435 44.8218 14.857C45.2582 14.7703 45.5418 14.3463 45.4551 13.91L45.0877 12.0587C44.7618 10.4199 43.4641 9.17061 41.8698 8.86306V2.97591C41.8699 1.33504 40.5349 0 38.8939 0H33.2513C31.6104 0 30.2753 1.33504 30.2753 2.97591V8.78926H24.7242V2.97559C24.7242 1.33482 23.3894 0 21.7486 0H16.1058C14.465 0 13.1302 1.33482 13.1302 2.97559V3.32041C13.1302 3.76546 13.4909 4.12607 13.9358 4.12607C14.3808 4.12607 14.7415 3.76546 14.7415 3.32041V2.97559C14.7415 2.22331 15.3535 1.61133 16.1058 1.61133H21.7486C22.5009 1.61133 23.1129 2.22331 23.1129 2.97559V8.78926H14.7415V7.08018C14.7415 6.63513 14.3808 6.27451 13.9358 6.27451C13.4909 6.27451 13.1302 6.63513 13.1302 7.08018V8.86306C11.5359 9.17061 10.2382 10.42 9.91224 12.0589L7.94953 21.9345C7.71192 23.1315 8.01979 24.359 8.7943 25.3024C9.00871 25.5636 9.25235 25.7926 9.51725 25.9892L8.80386 31.4689H8.09434C6.12014 31.4689 4.43813 32.88 4.09513 34.8241L2.21342 45.4869C1.9483 46.9889 2.35855 48.5205 3.33888 49.689C4.31911 50.8574 5.75609 51.5275 7.28126 51.5275H7.73179C8.03064 52.026 8.39286 52.4911 8.8146 52.9125C10.1596 54.2587 11.9486 55 13.8523 55H41.1478C43.7421 55 46.0162 53.6057 47.2621 51.5276H47.7186C49.2438 51.5276 50.6808 50.8575 51.661 49.6891C52.6413 48.5206 53.0516 46.989 52.7865 45.4869ZM31.8866 2.97591C31.8866 2.22342 32.4988 1.61133 33.2511 1.61133H38.8938C39.6463 1.61133 40.2585 2.22342 40.2585 2.97591V8.78926H31.8866V2.97591ZM4.57337 48.6534C3.89995 47.8508 3.61818 46.7987 3.80026 45.7671L5.68197 35.1043C5.88897 33.9315 6.90357 33.0802 8.09445 33.0802H8.59417L6.78798 46.9547C6.74802 47.256 6.72783 47.5658 6.72783 47.8756C6.72783 48.5731 6.82837 49.255 7.02066 49.9054C6.07137 49.8358 5.19051 49.3889 4.57337 48.6534ZM41.1477 53.3887H13.8523C12.3794 53.3887 10.9952 52.8151 9.95413 51.7732C8.91268 50.7327 8.33915 49.3485 8.33915 47.8757C8.33915 47.6363 8.35473 47.3979 8.38567 47.1646L11.051 26.6903C11.3377 26.7537 11.6332 26.7868 11.9336 26.7868H43.0666C43.3668 26.7868 43.6625 26.7537 43.9492 26.6903L46.6147 47.1666C46.6455 47.3979 46.6609 47.6364 46.6609 47.8758C46.6608 50.9156 44.1877 53.3887 41.1477 53.3887ZM50.4266 48.6534C49.8087 49.3898 48.9265 49.837 47.9759 49.9058C48.1676 49.2621 48.2723 48.581 48.2723 47.8757C48.2723 47.5658 48.2521 47.256 48.2123 46.9567L46.4058 33.0802H46.9055C48.0964 33.0802 49.111 33.9315 49.318 35.1043L51.1997 45.7671C51.3817 46.7987 51.0999 47.8508 50.4266 48.6534Z" fill="#4B4B4B"/>
<path d="M43.5186 37.7523C43.3276 36.2733 42.0591 35.1581 40.5679 35.1581H21.1181C20.6731 35.1581 20.3124 35.5187 20.3124 35.9638C20.3124 36.4088 20.6731 36.7694 21.1181 36.7694H40.5679C41.2515 36.7694 41.833 37.2808 41.9205 37.9589L43.1715 47.6166C43.1824 47.6981 43.1879 47.7852 43.1879 47.8757C43.1879 49.0006 42.2728 49.9156 41.1479 49.9156H13.852C12.7272 49.9156 11.8121 49.0005 11.8121 47.8757C11.8121 47.7852 11.8177 47.6981 11.8291 47.6128L13.0795 37.9586C13.167 37.2807 13.7486 36.7694 14.4321 36.7694H17.3583C17.8032 36.7694 18.164 36.4088 18.164 35.9638C18.164 35.5187 17.8032 35.1581 17.3583 35.1581H14.4321C12.9409 35.1581 11.6723 36.2734 11.4815 37.752L10.2316 47.4022C10.2112 47.5545 10.2008 47.7138 10.2008 47.8757C10.2008 49.889 11.8387 51.5269 13.852 51.5269H41.1479C43.1612 51.5269 44.7992 49.889 44.7992 47.8757C44.7992 47.7138 44.7888 47.5545 44.7689 47.4059L43.5186 37.7523Z" fill="#4B4B4B"/>
<path d="M22.0743 13.51C21.0317 13.51 20.1835 14.3582 20.1835 15.4009V20.1754C20.1835 21.218 21.0317 22.0663 22.0743 22.0663H32.9258C33.9684 22.0663 34.8166 21.2181 34.8166 20.1754V15.4009C34.8166 14.3583 33.9684 13.51 32.9258 13.51H22.0743ZM33.2052 15.4008V20.1753C33.2052 20.3295 33.0798 20.4548 32.9257 20.4548H22.0743C21.9202 20.4548 21.7948 20.3295 21.7948 20.1753V15.4008C21.7948 15.2466 21.9202 15.1212 22.0743 15.1212H32.9258C33.0798 15.1214 33.2052 15.2467 33.2052 15.4008Z" fill="#4B4B4B"/>
<path d="M34.8789 42.8464C35.3239 42.8464 35.6846 42.4858 35.6846 42.0407V40.6761H37.2663C37.7112 40.6761 38.0719 40.3155 38.0719 39.8705C38.0719 39.4254 37.7112 39.0648 37.2663 39.0648H17.7337C17.2888 39.0648 16.9281 39.4254 16.9281 39.8705C16.9281 40.3155 17.2888 40.6761 17.7337 40.6761H34.0731V42.0407C34.0732 42.4858 34.434 42.8464 34.8789 42.8464Z" fill="#4B4B4B"/>
</g>
<defs>
<clipPath id="clip0">
<rect width="55" height="55" fill="white"/>
</clipPath>
</defs>
</svg>
