<svg width="45" height="45" viewBox="0 0 45 45" fill="none" xmlns="http://www.w3.org/2000/svg">
<path d="M29.3961 36.6413L28.2254 34.0013C27.6629 32.7323 27.3763 31.386 27.3748 29.9993C27.3741 29.5853 27.0388 29.25 26.6249 29.25H13.1249C12.7109 29.25 12.3749 29.5852 12.3749 30V30.4942C12.3734 32.0212 12.0096 33.5489 11.3219 34.9146L10.5719 36.4147C9.78521 37.9882 9.37115 39.7484 9.37493 41.5049V44.2499C9.37493 44.6647 9.71094 44.9999 10.1249 44.9999H29.6249C30.0389 44.9999 30.3749 44.6647 30.3757 44.2499V41.25C30.3741 39.6533 30.0441 38.1023 29.3961 36.6413ZM28.8748 43.5H10.8748H10.874V41.5027C10.871 39.9765 11.2302 38.4487 11.9128 37.0845L12.662 35.5867C13.415 34.0905 13.8313 32.4232 13.8711 30.7492H25.8996C25.9873 32.082 26.3069 33.3773 26.8536 34.6088L28.0244 37.2488C28.5869 38.5177 28.8734 39.864 28.8749 41.25V43.5H28.8748Z" fill="#4B4B4B"/>
<path d="M30.1889 7.00575C30.0471 6.84376 29.8409 6.74998 29.6249 6.74998H7.87483C7.59807 6.74998 7.3438 6.90221 7.21337 7.14602C7.08294 7.38983 7.09709 7.68523 7.2509 7.9155L10.1527 12.2685L12.381 30.0929C12.4275 30.468 12.747 30.7499 13.125 30.7499H26.625C27 30.7499 27.318 30.4717 27.3682 30.0989L30.3682 7.59892C30.3966 7.38447 30.3313 7.16852 30.1889 7.00575ZM25.9671 29.25H13.7864L11.6181 11.907C11.6039 11.7907 11.5626 11.6805 11.4981 11.5837L9.2759 8.24993H28.7669L25.9671 29.25Z" fill="#4B4B4B"/>
<path d="M25.8747 2.99995H13.8747C11.393 2.99995 9.37473 5.01819 9.37473 7.49995C9.37473 7.91392 9.71073 8.24992 10.1247 8.24992H29.6247C30.0387 8.24992 30.3747 7.91392 30.3747 7.49995C30.3747 5.01827 28.3565 2.99995 25.8747 2.99995ZM10.9692 6.74998C11.303 5.45773 12.479 4.49998 13.8747 4.49998H25.8747C27.2697 4.49998 28.4457 5.45773 28.7795 6.74998H10.9692Z" fill="#4B4B4B"/>
<path d="M22.8748 0H16.8748C16.4609 0 16.1248 0.336006 16.1248 0.749971V3.74994C16.1248 4.16391 16.4609 4.49991 16.8748 4.49991H22.8748C23.2888 4.49991 23.6248 4.16391 23.6248 3.74994V0.749971C23.6248 0.336006 23.2896 0 22.8748 0ZM22.1249 2.99997H17.6249V1.50003H22.1249V2.99997Z" fill="#4B4B4B"/>
<path d="M35.6247 9.74997H29.6247V11.25H35.6247C36.0387 11.25 36.3747 11.5867 36.3747 12V24.327C36.3837 24.6817 36.1393 24.9975 35.7965 25.0763L27.209 27.0187L27.5397 28.4819L36.1309 26.5387C37.1689 26.2979 37.9016 25.3529 37.8747 24.3074V12C37.8747 10.7595 36.8652 9.74997 35.6247 9.74997Z" fill="#4B4B4B"/>
<path d="M34.124 12.75H28.874V14.2501H33.374V22.6493L27.2113 24.0181L27.5368 25.4828L34.2868 23.9828C34.6302 23.9056 34.8741 23.6018 34.8741 23.2501V13.5C34.8741 13.086 34.5387 12.75 34.124 12.75Z" fill="#4B4B4B"/>
<path d="M16.8747 11.2142L15.3763 11.2856L16.1267 27.0338L17.6251 26.9624L16.8747 11.2142Z" fill="#4B4B4B"/>
<path d="M22.8779 11.2103L22.1243 26.9586L23.6226 27.0304L24.3762 11.282L22.8779 11.2103Z" fill="#4B4B4B"/>
<path d="M19.8749 33.75C17.8072 33.75 16.1248 35.4322 16.1248 37.5C16.1248 39.5678 17.8071 41.2501 19.8749 41.2501C21.9419 41.2501 23.6249 39.5678 23.6249 37.5C23.6249 35.4322 21.9426 33.75 19.8749 33.75ZM19.8749 39.75C18.6344 39.75 17.6249 38.7405 17.6249 37.5C17.6249 36.2595 18.6344 35.25 19.8749 35.25C21.1154 35.25 22.1249 36.2595 22.1249 37.5C22.1249 38.7405 21.1154 39.75 19.8749 39.75Z" fill="#4B4B4B"/>
</svg>
