<svg width="39" height="39" viewBox="0 0 39 39" fill="none" xmlns="http://www.w3.org/2000/svg">
<g clip-path="url(#clip0)">
<path d="M39 4.27812C39 3.30336 38.2073 2.5107 37.2326 2.5107H33.4264V1.36455C33.4264 0.612053 32.8143 0 32.0618 0H24.2093C23.4568 0 22.8447 0.61235 22.8447 1.36455V2.5107H16.1556V1.36455C16.1556 0.612053 15.5432 0 14.7907 0H6.93819C6.18569 0 5.57364 0.61235 5.57364 1.36455V2.5107H1.76743C0.792664 2.5107 0 3.30336 0 4.27812V8.04863C0 8.50953 0.177338 8.92937 0.467445 9.24447C0.177338 9.55927 0 9.97941 0 10.4403V33.7343C0 34.7088 0.792664 35.5017 1.76743 35.5017H1.94863V37.212C1.94863 38.1856 2.7407 38.9774 3.71427 38.9774H21.4332C21.7489 38.9774 22.0047 38.7215 22.0047 38.4061C22.0047 38.0904 21.7489 37.8345 21.4332 37.8345H3.71427C3.3709 37.8345 3.0918 37.5551 3.0918 37.212V35.5017H35.9082V37.212C35.9082 37.5554 35.6291 37.8345 35.2857 37.8345H24.0789C23.7629 37.8345 23.5074 38.0904 23.5074 38.4061C23.5074 38.7215 23.7629 38.9774 24.0789 38.9774H35.2857C36.2593 38.9774 37.0514 38.1856 37.0514 37.212V35.5017H37.2326C38.207 35.5017 39 34.7088 39 33.7343V10.4403C39 9.97941 38.8224 9.55927 38.5326 9.24447C38.8224 8.92937 39 8.50953 39 8.04863V4.27812ZM23.9876 1.36455C23.9876 1.24226 24.087 1.14317 24.2093 1.14317H32.0618C32.1841 1.14317 32.2835 1.24255 32.2835 1.36455V2.5107H23.9876V1.36455ZM6.71651 1.36455C6.71651 1.24226 6.8159 1.14317 6.93819 1.14317H14.7907C14.913 1.14317 15.0124 1.24255 15.0124 1.36455V2.5107H6.71651V1.36455ZM37.8568 33.7343C37.8568 34.0786 37.5768 34.3589 37.2326 34.3589H1.76743C1.42316 34.3589 1.14317 34.0786 1.14317 33.7343V10.4403C1.14317 10.096 1.42316 9.81576 1.76743 9.81576H37.2326C37.5771 9.81576 37.8568 10.096 37.8568 10.4403V33.7343ZM37.8568 8.04863C37.8568 8.39289 37.5768 8.67288 37.2326 8.67288H1.76743C1.42316 8.67288 1.14317 8.39289 1.14317 8.04863V4.27812C1.14317 3.93356 1.42316 3.65357 1.76743 3.65357H37.2326C37.5768 3.65357 37.8568 3.93356 37.8568 4.27812V8.04863Z" fill="#4B4B4B"/>
<path d="M8.08164 4.20107C6.99947 4.20107 6.11932 5.08121 6.11932 6.16309C6.11932 7.24526 6.99947 8.1254 8.08164 8.1254C9.16352 8.1254 10.044 7.24526 10.044 6.16309C10.044 5.08121 9.16352 4.20107 8.08164 4.20107ZM8.08164 6.98253C7.62997 6.98253 7.2625 6.61506 7.2625 6.16338C7.2625 5.71171 7.62997 5.34394 8.08164 5.34394C8.53332 5.34394 8.90079 5.71171 8.90079 6.16338C8.90079 6.61506 8.53332 6.98253 8.08164 6.98253Z" fill="#4B4B4B"/>
<path d="M13.6476 4.20107C12.5654 4.20107 11.6852 5.08121 11.6852 6.16309C11.6852 7.24526 12.5654 8.1254 13.6476 8.1254C14.7294 8.1254 15.6096 7.24526 15.6096 6.16309C15.6096 5.08121 14.7294 4.20107 13.6476 4.20107ZM13.6476 6.98253C13.1956 6.98253 12.8281 6.61506 12.8281 6.16338C12.8281 5.71171 13.1956 5.34394 13.6476 5.34394C14.0992 5.34394 14.4667 5.71171 14.4667 6.16338C14.4667 6.61506 14.0992 6.98253 13.6476 6.98253Z" fill="#4B4B4B"/>
<path d="M25.3525 4.20107C24.2706 4.20107 23.3904 5.08121 23.3904 6.16309C23.3904 7.24526 24.2706 8.1254 25.3525 8.1254C26.4346 8.1254 27.3148 7.24526 27.3148 6.16309C27.3148 5.08121 26.4346 4.20107 25.3525 4.20107ZM25.3525 6.98253C24.9008 6.98253 24.5333 6.61506 24.5333 6.16338C24.5333 5.71171 24.9008 5.34394 25.3525 5.34394C25.8044 5.34394 26.1719 5.71171 26.1719 6.16338C26.1719 6.61506 25.8044 6.98253 25.3525 6.98253Z" fill="#4B4B4B"/>
<path d="M30.9184 4.20107C29.8365 4.20107 28.9561 5.08121 28.9561 6.16309C28.9561 7.24526 29.8365 8.1254 30.9184 8.1254C32.0005 8.1254 32.8807 7.24526 32.8807 6.16309C32.8807 5.08121 32.0005 4.20107 30.9184 4.20107ZM30.9184 6.98253C30.4667 6.98253 30.0992 6.61506 30.0992 6.16338C30.0992 5.71171 30.4667 5.34394 30.9184 5.34394C31.37 5.34394 31.7375 5.71171 31.7375 6.16338C31.7375 6.61506 31.37 6.98253 30.9184 6.98253Z" fill="#4B4B4B"/>
<path d="M33.1151 13.0968H16.4983C16.1826 13.0968 15.9268 13.3527 15.9268 13.6681C15.9268 13.9838 16.1826 14.2397 16.4983 14.2397H33.1151C33.2246 14.2397 33.3136 14.3289 33.3136 14.4384V15.9506C33.3136 16.0601 33.2246 16.1493 33.1151 16.1493H5.88486C5.77536 16.1493 5.68639 16.0601 5.68639 15.9506V14.4384C5.68639 14.3289 5.77536 14.2397 5.88486 14.2397H13.8273C14.143 14.2397 14.3988 13.9838 14.3988 13.6681C14.3988 13.3527 14.143 13.0968 13.8273 13.0968H5.88486C5.14516 13.0968 4.54352 13.6984 4.54352 14.4384V15.9506C4.54352 16.6903 5.14516 17.2922 5.88486 17.2922H6.64925V29.9721C6.64925 31.0597 7.53416 31.9446 8.62169 31.9446H30.3783C31.4658 31.9446 32.3507 31.0597 32.3507 29.9721V17.2922H33.1151C33.8548 17.2922 34.4567 16.6906 34.4567 15.9506V14.4384C34.4567 13.6987 33.8548 13.0968 33.1151 13.0968ZM31.2075 29.9721C31.2075 30.4295 30.8356 30.8014 30.3783 30.8014H8.62169C8.16436 30.8014 7.79213 30.4295 7.79213 29.9721V17.2922H31.2075V29.9721Z" fill="#4B4B4B"/>
<path d="M11.6194 22.46C11.7735 22.46 11.9274 22.3978 12.0401 22.2755L13.793 20.37C14.0069 20.1376 13.9917 19.7761 13.7594 19.5625C13.527 19.3488 13.1658 19.3637 12.9518 19.5961L11.199 21.5016C10.9853 21.7337 11.0002 22.0952 11.2326 22.3091C11.3424 22.41 11.4811 22.46 11.6194 22.46Z" fill="#4B4B4B"/>
<path d="M11.7446 24.6901C11.8544 24.7913 11.9931 24.841 12.1314 24.841C12.2856 24.841 12.4394 24.7788 12.5522 24.6565L16.1564 20.739C16.37 20.5066 16.3551 20.1451 16.1227 19.9312C15.8904 19.7175 15.5288 19.7327 15.3152 19.9648L11.711 23.8826C11.4974 24.1147 11.5126 24.4765 11.7446 24.6901Z" fill="#4B4B4B"/>
</g>
<defs>
<clipPath id="clip0">
<rect width="39" height="39" fill="white"/>
</clipPath>
</defs>
</svg>
