<svg width="60" height="60" viewBox="0 0 60 60" fill="none" xmlns="http://www.w3.org/2000/svg">
<path d="M52.6332 38.5447C47.6412 37.8231 42.9113 35.9426 38.8867 32.8786C37.9868 32.1934 36.9204 33.591 37.8219 34.2772C41.3866 36.9911 45.5449 38.9068 49.9233 39.8561C51.8108 40.2653 53.7868 40.2648 55.4292 41.3994C56.9184 42.4283 57.9362 44.0633 58.182 45.8591H38.9026C37.7715 45.8591 37.7696 47.6169 38.9026 47.6169H58.098C57.731 48.7007 56.7049 49.4827 55.4996 49.4827H30.1625L19.7965 46.444C19.3201 46.3014 18.8176 46.3892 18.4179 46.6848C18.018 46.9805 17.7867 47.4354 17.7836 47.932L17.7741 49.2243C17.7735 49.3119 17.702 49.3832 17.6147 49.3832H6.18797C3.7452 49.3832 1.75781 47.3945 1.75781 44.95V44.252H12.0037C12.0052 44.2521 12.0066 44.2521 12.0081 44.252H18.7605L29.8184 47.5797C29.9005 47.6044 29.9858 47.6169 30.0716 47.6169H34.5396C35.6707 47.6169 35.6726 45.8591 34.5396 45.8591H30.201L19.1433 42.5315C19.0611 42.5067 18.9758 42.4942 18.89 42.4942H12.9545C13.002 41.0057 12.7114 39.6682 12.0855 38.5083C11.1709 36.8132 9.8625 36.0517 8.47734 35.2454C7.47387 34.6613 6.43605 34.0573 5.42836 33.0175C4.16672 31.7155 3.2502 30.0094 2.7 27.9447C2.77711 27.793 2.86359 27.6452 2.96203 27.5037C3.60211 26.5834 3.94055 25.5043 3.94055 24.3832V19.6685C3.94055 18.5374 2.18273 18.5356 2.18273 19.6685V24.3832C2.18273 25.1438 1.95328 25.8757 1.51898 26.5C0.878906 27.4204 0.540469 28.4994 0.540469 29.6204V42.8012C0.211758 43.0615 0 43.463 0 43.9137V44.9499C0 48.3635 2.77594 51.1409 6.18797 51.1409H17.6147C18.6652 51.1409 19.5252 50.2861 19.5319 49.2362L19.5394 48.2004L29.7891 51.205C29.8693 51.2285 29.9527 51.2405 30.0362 51.2405H55.4995C57.9499 51.2405 60 49.1871 60 46.7379C60 42.4692 56.7514 39.1401 52.6332 38.5447ZM2.29805 31.6881C2.82059 32.6414 3.44344 33.4951 4.1659 34.2408C5.34223 35.4546 6.53801 36.1506 7.59293 36.7647C9.85793 38.083 11.3013 39.7177 11.1952 42.4942H2.29805V31.6881Z" fill="#4B4B4B"/>
<path d="M36.4612 30.8122C33.3756 27.8755 31.0217 24.374 29.465 20.4047L25.3887 10.0104C25.1701 9.45295 24.7172 9.03037 24.146 8.85084C23.5751 8.67131 22.9619 8.75897 22.464 9.09119L20.7776 10.2161C19.6441 10.9722 18.7506 11.9951 18.1558 13.1715H7.30088C6.55158 12.5132 5.57061 12.1128 4.49728 12.1128H3.40627C2.73139 12.1128 2.18248 12.6619 2.18248 13.3368V16.1788C2.18248 16.6642 2.57588 17.0577 3.06139 17.0577C3.54689 17.0577 3.94029 16.6642 3.94029 16.1788V13.8706H4.49728C5.87412 13.8706 6.99432 14.9916 6.99432 16.3695V27.779C6.99432 31.0672 9.74764 33.8244 13.037 33.8244C16.3265 33.8244 19.0795 31.0674 19.0795 27.779V16.6772C19.0795 14.6639 20.079 12.7953 21.7531 11.6785L23.4396 10.5536C23.5086 10.5075 23.5753 10.5143 23.6191 10.5279C23.663 10.5417 23.7217 10.5744 23.7521 10.6522L27.8285 21.0464C29.4797 25.2565 31.9765 28.9705 35.2493 32.0855C35.601 32.4202 36.1574 32.4065 36.4919 32.0548C36.8265 31.7032 36.8128 31.1468 36.4612 30.8122ZM17.3218 16.6772V27.779C17.3218 30.1111 15.3698 32.0666 13.037 32.0666C10.704 32.0666 8.75225 30.1112 8.75225 27.779V16.3695C8.75225 15.8642 8.6633 15.3795 8.50111 14.9294H17.5207C17.3901 15.496 17.3218 16.0815 17.3218 16.6772Z" fill="#4B4B4B"/>
</svg>
