{
    "1": {
        "numero_img": "../img/numeros/c1.png",
        "level_img": "../img/numeros/c01_au_musee.png",
        "titre": "au musée"
    },
    "2": {
        "numero_img": "../img/numeros/c2.png",
        "level_img": "../img/numeros/c02_a_la_guerre",
        "titre": "à la guerre"
    },
    "3": {
        "numero_img": "../img/numeros/c3.png",
        "level_img": "../img/numeros/c03_au_terrain_de_camping",
        "titre": "au terrain de camping"
    },
    "4": {
        "numero_img": "../img/numeros/c4.png",
        "level_img": "../img/numeros/c04_au_grand_magasin.png",
        "titre": "au grand magasin"
    },
    "5": {
        "numero_img": "../img/numeros/c5.png",
        "level_img": "../img/numeros/c05_l_age_de_la_pierre.png",
        "titre": "l'age de la pierre"
    },
    "6": {
        "numero_img": "../img/numeros/c6.png",
        "level_img": "../img/numeros/c06_l_enigme_des_pyramides.png",
        "titre": "l'énigme des pyramides"
    },
    "7": {
        "numero_img": "../img/numeros/c7.png",
        "level_img": "../img/numeros/c07_la_terreur_viking.png",
        "titre": "la terreur viking"
    },
    "8": {
        "numero_img": "../img/numeros/c8.png",
        "level_img": "../img/numeros/c08_dernier_jour_des_asteques.png",
        "titre": "dernier jour des asteques"
    },
    "9": {
        "numero_img": "../img/numeros/c9.png",
        "level_img": "../img/numeros/c09_jadis_au_japon.png",
        "titre": "jadis au japon"
    },
    "10": {
        "numero_img": "../img/numeros/c10.png",
        "level_img": "../img/numeros/c10_au_temps_des_pirates.png",
        "titre": "au temps des pirates"
    },
    "11": {
        "numero_img": "../img/numeros/c11.png",
        "level_img": "../img/numeros/c11_les_gloutons_voraces.png",
        "titre": "les gloutons voraces"
    },
    "12": {
        "numero_img": "../img/numeros/c12.png",
        "level_img": "../img/numeros/c12_les_plongeurs_sous-marins.png",
        "titre": "les plongeurs sous-marins"
    },
    "13": {
        "numero_img": "../img/numeros/c13.png",
        "level_img": "../img/numeros/c13_c_est_un_film_muet.png",
        "titre": "c'est un film muet"
    },
    "14": {
        "numero_img": "../img/numeros/c14.png",
        "level_img": "../img/numeros/c14_l_orchestre_depasse_la_mesure.png",
        "titre": "l'orchestre"
    },
    "15": {
        "numero_img": "../img/numeros/c15.png",
        "level_img": "../img/numeros/c15_les_feux_de_la_rampe.png",
        "titre": "Les feux de la rampe"
    },
    "16": {
        "numero_img": "../img/numeros/c16.png",
        "level_img": "../img/numeros/c16_la_bataille_des_fruits.png",
        "titre": "la bataille des fruits"
    },
    "17": {
        "numero_img": "../img/numeros/c17.png",
        "level_img": "../img/numeros/c17_joujoux_par_milliers.png",
        "titre": "joujoux pas milliers"
    },
    "18": {
        "numero_img": "../img/numeros/c18.png",
        "level_img": "../img/numeros/c18_peur_sous_les_projecteurs.png",
        "titre": "peur sous les projecteurs"
    },
    "19": {
        "numero_img": "../img/numeros/c19.png",
        "level_img": "../img/numeros/c19_le_jardin_aux_mille_fleurs.png",
        "titre": "le jardin aux mille fleurs"
    },
    "20": {
        "numero_img": "../img/numeros/c20.png",
        "level_img": "../img/numeros/c20_a_l_assault_du_chateau.png",
        "titre": "à l'assault du chateau"
    }
}