{
    "name": "OptHistoryView_options",
    "required": [],
    "properties": {
        "constr_names": {
            "type": "array"
        }
    },
    "additionalProperties": false,
    "$schema": "http://json-schema.org/draft-04/schema",
    "type": "object"
}
