{
    "name": "SobieskiPropulsion_input",
    "required": [ "y_23","x_3","x_shared"],
    "properties": {
        "y_23": {
            "items": {
                "type": "number"
            },
            "type": "array"
        },
        "x_3": {
            "items": {
                "type": "number"
            },
            "type": "array"
        },
        "x_shared": {
            "items": {
                "type": "number"
            },
            "type": "array"
        }
    },
    "$schema": "http://json-schema.org/draft-04/schema",
    "type": "object",
    "id": "#SobieskiPropulsion_input"
}
