{
	"info": {
		"_postman_id": "0630b91a-4153-4aca-a930-a62f75d48ebc",
		"name": "RetoBack",
		"schema": "https://schema.getpostman.com/json/collection/v2.1.0/collection.json",
		"_exporter_id": "18547641"
	},
	"item": [
		{
			"name": "Country",
			"item": [
				{
					"name": "CrearPaís",
					"request": {
						"method": "POST",
						"header": [],
						"body": {
							"mode": "raw",
							"raw": "{\r\n   \"name\":\"Uruguay\",\r\n   \"code\":\"URU\"\r\n}",
							"options": {
								"raw": {
									"language": "json"
								}
							}
						},
						"url": {
							"raw": "http://localhost:8080/country/create",
							"protocol": "http",
							"host": [
								"localhost"
							],
							"port": "8080",
							"path": [
								"country",
								"create"
							]
						}
					},
					"response": []
				},
				{
					"name": "Buscar Todos",
					"request": {
						"method": "GET",
						"header": [],
						"url": {
							"raw": "http://localhost:8080/country/findAll",
							"protocol": "http",
							"host": [
								"localhost"
							],
							"port": "8080",
							"path": [
								"country",
								"findAll"
							]
						}
					},
					"response": []
				},
				{
					"name": "Buscar por Código",
					"request": {
						"method": "GET",
						"header": []
					},
					"response": []
				},
				{
					"name": "Editar",
					"request": {
						"method": "PUT",
						"header": [],
						"body": {
							"mode": "raw",
							"raw": "{\r\n    \"name\": \"Uruguay\",\r\n    \"code\": \"URU\"\r\n}",
							"options": {
								"raw": {
									"language": "json"
								}
							}
						},
						"url": {
							"raw": "http://localhost:8080/country/update/638394247f959c205a74bb95",
							"protocol": "http",
							"host": [
								"localhost"
							],
							"port": "8080",
							"path": [
								"country",
								"update",
								"638394247f959c205a74bb95"
							]
						}
					},
					"response": []
				},
				{
					"name": "Borrar",
					"request": {
						"method": "DELETE",
						"header": [],
						"url": {
							"raw": "http://localhost:8080/country/delete/638394247f959c205a74bb95",
							"protocol": "http",
							"host": [
								"localhost"
							],
							"port": "8080",
							"path": [
								"country",
								"delete",
								"638394247f959c205a74bb95"
							]
						}
					},
					"response": []
				}
			]
		},
		{
			"name": "Cyclist",
			"item": [
				{
					"name": "CrearCiclista",
					"request": {
						"method": "POST",
						"header": [],
						"body": {
							"mode": "raw",
							"raw": "{\r\n    \"fullName\":\"ElCorredor\",\r\n    \"competitorNumber\":\"a23\",\r\n    \"countryCode\":\"URU\"\r\n}",
							"options": {
								"raw": {
									"language": "json"
								}
							}
						},
						"url": {
							"raw": "http://localhost:8080/cyclist/create",
							"protocol": "http",
							"host": [
								"localhost"
							],
							"port": "8080",
							"path": [
								"cyclist",
								"create"
							]
						}
					},
					"response": []
				},
				{
					"name": "Buscar Todos",
					"request": {
						"method": "GET",
						"header": [],
						"url": {
							"raw": "http://localhost:8080/country/findAll",
							"protocol": "http",
							"host": [
								"localhost"
							],
							"port": "8080",
							"path": [
								"country",
								"findAll"
							]
						}
					},
					"response": []
				},
				{
					"name": "Buscar Por Numero de Competidor",
					"request": {
						"method": "GET",
						"header": [],
						"url": {
							"raw": "http://localhost:8080/cyclist/findByCompetitorNumber/223",
							"protocol": "http",
							"host": [
								"localhost"
							],
							"port": "8080",
							"path": [
								"cyclist",
								"findByCompetitorNumber",
								"223"
							]
						}
					},
					"response": []
				},
				{
					"name": "Buscar Por Codigo Pais",
					"request": {
						"method": "GET",
						"header": [],
						"url": {
							"raw": "http://localhost:8080/cyclist/findByCountry/URU",
							"protocol": "http",
							"host": [
								"localhost"
							],
							"port": "8080",
							"path": [
								"cyclist",
								"findByCountry",
								"URU"
							]
						}
					},
					"response": []
				},
				{
					"name": "Editar",
					"request": {
						"method": "PUT",
						"header": [],
						"body": {
							"mode": "raw",
							"raw": "{\r\n    \"fullName\":\"LaCorredora\",\r\n    \"competitorNumber\":\"223\",\r\n    \"countryCode\":\"URU\"\r\n}",
							"options": {
								"raw": {
									"language": "json"
								}
							}
						},
						"url": {
							"raw": "http://localhost:8080/cyclist/update/6383a3b5b928b20b202b758f",
							"protocol": "http",
							"host": [
								"localhost"
							],
							"port": "8080",
							"path": [
								"cyclist",
								"update",
								"6383a3b5b928b20b202b758f"
							]
						}
					},
					"response": []
				},
				{
					"name": "Borrar",
					"request": {
						"method": "DELETE",
						"header": [],
						"url": {
							"raw": "http://localhost:8080/cyclist/delete/6383a490b928b20b202b7590",
							"protocol": "http",
							"host": [
								"localhost"
							],
							"port": "8080",
							"path": [
								"cyclist",
								"delete",
								"6383a490b928b20b202b7590"
							]
						}
					},
					"response": []
				}
			]
		},
		{
			"name": "CyclistTeam",
			"item": [
				{
					"name": "Crear Equipo",
					"request": {
						"method": "POST",
						"header": [],
						"body": {
							"mode": "raw",
							"raw": "{\r\n    \"name\":\"LosCorredores\",\r\n    \"teamCode\":\"LCD\",\r\n    \"countryCode\":\"URU\"\r\n}",
							"options": {
								"raw": {
									"language": "json"
								}
							}
						},
						"url": {
							"raw": "http://localhost:8080/team/createTeam",
							"protocol": "http",
							"host": [
								"localhost"
							],
							"port": "8080",
							"path": [
								"team",
								"createTeam"
							]
						}
					},
					"response": []
				},
				{
					"name": "Añadir Ciclista al Equipo",
					"request": {
						"method": "POST",
						"header": [],
						"body": {
							"mode": "raw",
							"raw": "{\r\n    \"name\":\"LosCorredores\",\r\n    \"teamCode\":\"LCD\",\r\n    \"countryCode\":\"URU\"\r\n}",
							"options": {
								"raw": {
									"language": "json"
								}
							}
						},
						"url": {
							"raw": "http://localhost:8080/team/addCyclist/6383a6e23c6d4a1464819e06/6383a351b928b20b202b758e",
							"protocol": "http",
							"host": [
								"localhost"
							],
							"port": "8080",
							"path": [
								"team",
								"addCyclist",
								"6383a6e23c6d4a1464819e06",
								"6383a351b928b20b202b758e"
							]
						}
					},
					"response": []
				},
				{
					"name": "Buscar Todos",
					"request": {
						"method": "GET",
						"header": [],
						"url": {
							"raw": "http://localhost:8080/team/findAll",
							"protocol": "http",
							"host": [
								"localhost"
							],
							"port": "8080",
							"path": [
								"team",
								"findAll"
							]
						}
					},
					"response": []
				},
				{
					"name": "Buscar Todos los Ciclistas por Codigo de Equipo",
					"request": {
						"method": "GET",
						"header": []
					},
					"response": []
				},
				{
					"name": "Buscar Por Codigo de Equipo",
					"request": {
						"method": "GET",
						"header": []
					},
					"response": []
				},
				{
					"name": "Buscar Por Codigo de Pais",
					"request": {
						"method": "GET",
						"header": [],
						"url": {
							"raw": "http://localhost:8080/team/findTeamByCountryCode/URU",
							"protocol": "http",
							"host": [
								"localhost"
							],
							"port": "8080",
							"path": [
								"team",
								"findTeamByCountryCode",
								"URU"
							]
						}
					},
					"response": []
				},
				{
					"name": "Editar",
					"request": {
						"method": "PUT",
						"header": [],
						"body": {
							"mode": "raw",
							"raw": "{\r\n    \"name\": \"LosCorredores\",\r\n    \"teamCode\": \"LCD\",\r\n    \"countryCode\": \"URU\",\r\n    \"cyclists\": [\r\n        {\r\n            \"id\": \"6383a351b928b20b202b758e\",\r\n            \"fullName\": \"ElCorredor\",\r\n            \"competitorNumber\": \"a23\",\r\n            \"countryCode\": \"URU\"\r\n        },\r\n        {\r\n            \"id\": \"6383a3b5b928b20b202b758f\",\r\n            \"fullName\": \"LaCorredora\",\r\n            \"competitorNumber\": \"223\",\r\n            \"countryCode\": \"URU\"\r\n        }\r\n    ]\r\n}",
							"options": {
								"raw": {
									"language": "json"
								}
							}
						},
						"url": {
							"raw": "http://localhost:8080/team/update/6383a6e23c6d4a1464819e06",
							"protocol": "http",
							"host": [
								"localhost"
							],
							"port": "8080",
							"path": [
								"team",
								"update",
								"6383a6e23c6d4a1464819e06"
							]
						}
					},
					"response": []
				},
				{
					"name": "Borrar",
					"request": {
						"method": "DELETE",
						"header": [],
						"url": {
							"raw": "http://localhost:8080/team/update/6383a6e23c6d4a1464819e06",
							"protocol": "http",
							"host": [
								"localhost"
							],
							"port": "8080",
							"path": [
								"team",
								"update",
								"6383a6e23c6d4a1464819e06"
							]
						}
					},
					"response": []
				}
			]
		}
	]
}