{
    "label": "Conditions",
    "entries": [
        {
            "id": "Flat-Footed",
            "name": "Flat-Footed (Pris au dépourvu)",
            "description": "<p>Vous êtes distrait, ou quelque chose d’autre vous empêche de vous concentrer entièrement sur vos défenses. Vous subissez un malus de circonstances de −2 à votre CA. Certains effets vous confèrent l’état Pris au dépourvu seulement face à certaines créatures ou certaines attaques. D’autres, notamment les états, vous rendent Pris au dépourvu contre tout. Si une règle ne précise pas que cet état est seulement valable dans une situation donnée, il est valable pour toutes les situations. Par exemple, de nombreux effets précisent simplement : « la cible est Prise au dépourvu ».</p>"
        },
        {
            "id": "Unnoticed",
            "name": "Unnoticed (Inaperçu)",
            "description": "<p>Si vous êtes inaperçu aux yeux d’une créature, elle n’a aucune conscience de votre présence. Quand vous êtes inaperçu par une créature, vous êtes également @Compendium[pf2e.conditionitems.VRSef5y1LmL2Hkjf]{Non détecté} par elle. Cet état intervient dans le cadre de pouvoirs qui peuvent seulement être utilisés contre des cibles qui n’ont aucune conscience de votre présence.</p>"
        },
        {
            "id": "Dying",
            "name": "Dying (Mourant)",
            "description": "<p>Vous vous videz de votre sang ou vous trouvez aux portes de la mort pour une autre raison. Tant que vous êtes dans cet état, vous êtes @Compendium[pf2e.conditionitems.fBnFDH2MTzgFijKf]{Inconscient}. L’état Mourant est toujours associé à une intensité et, si celle-ci atteint mourant 4, vous mourez. Si vous êtes Mourant, vous devez faire un test de récupération au début de chacun de vos tours afin de déterminer si votre état s’améliore ou empire. L’intensité de votre état Mourant augmente de 1 si vous subissez des dégâts pendant que vous êtes Mourant ou de 2 si vous subissez des dégâts infligés par un coup critique ou que vous obtenez un échec critique à votre jet de sauvegarde.</p>\n<p>Si vous quittez l’état mourant parce que vous avez réussi un test de récupération mais que vous êtes toujours à 0 point de vie, vous restez dans l’état Inconscient, mais vous pouvez vous réveiller comme expliqué dans le descriptif de cet état. Si jamais vous regagnez un point de vie ou plus, vous quittez l’état Mourant automatiquement et vous vous réveillez. À chaque fois que vous quittez l’état Mourant, vous gagnez l’état  @Compendium[pf2e.conditionitems.Yl48xTdMh3aeQYL2]{Blessé} 1, ou augmentez l’intensité de votre état Blessé de 1 si vous êtes déjà affecté par cet état.</p>"
        },
        {
            "id": "Grabbed",
            "name": "Grabbed (Agrippé/empoigné)",
            "description": "<p>Vous êtes maintenu en place par une autre créature, ce qui vous confère les états @Compendium[pf2e.conditionitems.AJh5ex99aV6VTggg]{Pris au dépourvu} et @Compendium[pf2e.conditionitems.eIcWbB5o3pP6OIMe]{Immobilisé}. Si vous entreprenez une action de manipulation pendant que vous êtes empoigné, vous devez réussir un test nu <a class=\"inline-roll roll\" title=\"test nu DD 5\" data-mode=\"roll\" data-flavor=\"test nu DD 5\" data-formula=\"1d20\"><i class=\"fas fa-dice-d20\"></i> 1d20</a> DD 5 ou perdre cette action. Vous faites le test après avoir dépensé l’action et avant que ses effets s’appliquent.</p>"
        },
        {
            "id": "Restrained",
            "name": "Restrained (Entravé)",
            "description": "<p>Vous êtes attaché et ne pouvez pas bouger ou une créature vous a saisi et immobilisé. Vous vous trouvez dans les états @Compendium[pf2e.conditionitems.AJh5ex99aV6VTggg]{Pris au dépourvu} et @Compendium[pf2e.conditionitems.eIcWbB5o3pP6OIMe]{Immobilisé}, et vous ne pouvez entreprendre aucune action dotée des traits attaque ou manipulation, sauf si vous tentez ainsi de @Compendium[pf2e.actionspf2e.SkZAQRkLLkmBQNB9]{Vous échapper} ou d’@Compendium[pf2e.actionspf2e.SjmKHgI7a5Z9JzBx]{Ouvrir} vos liens de force. L’état entravé est prépondérant sur l’état @Compendium[pf2e.conditionitems.kWc1fhmv9LBiTuei]{Empoigné/agrippé}.</p>"
        },
        {
            "id": "Broken",
            "name": "Broken (Brisé)",
            "description": "<p>Brisé est un état affectant les objets. Un objet est brisé quand des dégâts ont réduit ses points de vie au niveau de son Seuil de rupture ou moins. On ne peut plus utiliser normalement un objet brisé, pas plus qu’il n’accorde de bonus, à l’exception d’une armure. Une armure brisée accorde toujours son bonus d’objet à la CA, mais inflige en même temps un malus de statut à la CA en fonction de sa catégorie : −1 pour une armure légère brisée, −2 pour une armure intermédiaire brisée ou −3 pour une armure lourde brisée.</p>\n<p>Un objet brisé continue d’imposer les malus et les limitations normalement encourus lorsqu’on le transporte, le tient ou le porte. Par exemple, une armure brisée imposera toujours son bonus de Dextérité maximal, son malus aux tests, etc.</p>\n<p>Si un effet fait se briser un objet automatiquement et que celui-ci a plus de points de vie que son Seuil de rupture, cet effet réduit également les points de vie actuels de l’objet à son Seuil de rupture.</p>"
        },
        {
            "id": "Drained",
            "name": "Drained (Drainé)",
            "description": "<p>Vous vous affaiblissez quand une créature réussit à drainer votre sang ou votre force vitale. L’état Drainé est toujours accompagné d’une intensité. Vous subissez un malus de statut égal à l’intensité de votre état Drainé et qui s’applique à vos tests basés sur la Constitution, comme les jets de Vigueur. Vous perdez également une quantité de points de vie égale à votre niveau (avec un minimum de 1) multiplié par l’intensité de votre état Drainé et votre maximum de points de vie est réduit de ce montant. Par exemple, si vous subissez un effet qui vous inflige drainé 3 et que vous êtes un personnage de niveau 3, vous perdez 9 points de vie et réduisez votre maximum de points de vie de 9. Perdre ces points de vie n’est pas considéré comme subir des dégâts.</p>\n<p>À chaque fois que vous vous reposez une nuit complète, l’intensité de votre état Drainé décroît de 1. Votre maximum de points de vie remonte alors, mais vous ne regagnez pas immédiatement les points de vie que vous avez perdus.</p>"
        },
        {
            "id": "Petrified",
            "name": "Petrified (Pétrifié)",
            "description": "<p>Vous avez été changé en pierre. Vous ne pouvez pas agir ou sentir quoi que ce soit. Vous devenez un objet dont l’Encombrement est le double de votre Encombrement normal (généralement 12 pour une créature Moyenne pétrifiée ou 6 pour une Petite créature pétrifiée) avec CA 9, Solidité 8 et la même quantité de points de vie que vous aviez de votre vivant. Vous n’avez pas de Seuil de rupture. Quand vous redevenez une créature de chair et de sang, vous conservez la même quantité de points de vie que vous aviez en tant que statue. Si la statue est détruite, vous mourrez immédiatement. Tant que vous êtes pétrifié, votre corps et votre esprit se trouvent en stase et vous ne vieillissez pas ni ne remarquez le temps qui passe.</p>"
        },
        {
            "id": "Blinded",
            "name": "Blinded (Aveuglé)",
            "description": "<p>Vous ne pouvez pas voir. Tous les terrains normaux sont pour vous des terrains difficiles. Vous ne pouvez rien détecter à l’aide de votre vue. Vous échouez automatiquement aux tests de Perception qui nécessitent que vous puissiez voir et, si votre vision est votre seul sens précis, vous subissez un malus de statut de −4 à vos tests de Perception. Vous êtes immunisé contre les effets visuels. L’état Aveuglé est prépondérant sur l’état @Compendium[pf2e.conditionitems.TkIyaNPgTZFBCCuh]{Ébloui}.</p>"
        },
        {
            "id": "Fascinated",
            "name": "Fascinated (Fasciné)",
            "description": "<p>Votre attention est irrésistiblement attirée par quelque chose et vous ne faites plus attention à ce qui se déroule autour de vous. Vous subissez un malus de statut de −2 à vos tests de Perception et de compétences et vous ne pouvez pas entreprendre d’actions dotées du trait concentration, sauf si ces actions ou leurs conséquences sont liées à l’objet de votre fascination (avec l’accord du MJ). Par exemple, vous pourrez probablement @Compendium[pf2e.actionspf2e.BlAOM2X92SI6HMtJ]{Chercher} et @Compendium[pf2e.actionspf2e.1OagaWtBpVXExToo]{Vous souvenir} de quelque chose par rapport au sujet de votre fascination, mais vous ne pourrez normalement pas lancer de sort ciblant une autre créature. Cet état prend fin si une créature entreprend une action hostile contre vous ou n’importe lequel de vos alliés.</p>"
        },
        {
            "id": "Fatigued",
            "name": "Fatigued (Fatigué)",
            "description": "<p>Vous êtes fatigué et n’arrivez pas à rassembler vos forces. Vous subissez un malus de statut de −1 à votre CA et à vos jets de sauvegarde. Quand vous explorez, vous ne pouvez pas choisir d’activité d’exploration.</p>\n<p>Vous vous remettez de l’état Fatigué au terme d’une nuit complète de repos.</p>"
        },
        {
            "id": "Confused",
            "name": "Confused (Confus)",
            "description": "<p>Vous êtes déconcerté et vous attaquez à l’aveuglette. Vous êtes @Compendium[pf2e.conditionitems.AJh5ex99aV6VTggg]{Pris au dépourvu} et ne considérez plus personne comme votre allié (ce qui n’empêche pas nécessairement ces créatures de vous considérer comme leur allié) et vous ne pouvez pas utiliser les actions Retarder et Préparer ni utiliser de réactions.</p>\n<p>Vous utilisez toutes vos actions pour @Compendium[pf2e.actionspf2e.VjxZFuUXrCU94MWR]{Frapper} ou lancer des tours de magie offensifs. Le MJ peut cependant vous permettre de faire d’autres actions vous permettant d’attaquer plus facilement, comme dégainer une arme, vous rapprocher d’une cible pour qu’elle soit à portée et ainsi de suite. Le MJ détermine vos cibles aléatoirement. Si vous n’avez pas d’autre cible valide, vous vous prenez vous-même pour cible. Vous réussissez alors automatiquement vos coups, mais ne portez pas de coup critique. Si vous êtes dans l’impossibilité d’attaquer ou de lancer des sorts, vous marmonnez des choses incohérentes et perdez vos actions.</p>\n<p>À chaque fois que vous subissez des dégâts provenant d’une attaque ou d’un sort, vous pouvez faire un test nu <strong>DD 11</strong> afin de vous remettre de votre confusion et mettre un terme à cet état.</p>"
        },
        {
            "id": "Concealed",
            "name": "Concealed (Masqué)",
            "description": "<p>Tant que vous êtes masqué face à une créature (si vous êtes dans un épais brouillard, par exemple), cette créature a du mal à vous voir. Vous pouvez toujours être @Compendium[pf2e.conditionitems.1wQY3JYyhMYeeV2G]{Observé}, mais vous êtes plus difficile à cibler. Une créature face à laquelle vous êtes masqué doit réussir un <a class=\"inline-roll roll\" title=\"test nu DD 5\" data-mode=\"roll\" data-flavor=\"test nu DD 5\" data-formula=\"1d20\"><i class=\"fas fa-dice-d20\"></i> 1d20</a> <strong>DD5</strong> pour pouvoir vous prendre pour cible avec une attaque, un sort ou un autre effet. Les zones d’effet ne sont pas sujettes à ce test nu. Si le test échoue, l’attaque, le sort ou l’effet ne vous affecte pas.</p>"
        },
        {
            "id": "Encumbered",
            "name": "Encumbered (Surchargé)",
            "description": "<p>Vous transportez plus de poids que vous ne pouvez en gérer. Tant que vous êtes surchargé, vous êtes @Compendium[pf2e.conditionitems.i3OJZU2nk64Df3xm]{Maladroit} 1 et vous subissez un malus de 3 mètres à toutes vos Vitesses. Comme pour l’ensemble des malus infligés à votre Vitesse, cette dernière ne peut être réduite à moins de 1,5 mètres.</p>"
        },
        {
            "id": "Hidden",
            "name": "Hidden (Caché)",
            "description": "<p>Quand vous êtes caché d’une créature, celle-ci sait dans quelle case vous vous trouvez, mais elle ne peut pas dire précisément où vous vous trouvez. Vous devenez généralement Caché après avoir utilisé Discrétion pour @Compendium[pf2e.actionspf2e.XMcnh4cSI32tljXa]{Vous cacher}. Quand vous @Compendium[pf2e.actionspf2e.BlAOM2X92SI6HMtJ]{Cherchez} une créature en utilisant seulement un sens imprécis, celle-ci se trouve dans l’état caché plutôt qu’@Compendium[pf2e.conditionitems.1wQY3JYyhMYeeV2G]{Observé}.</p>\n<p>Une créature par rapport à laquelle vous êtes caché est @Compendium[pf2e.conditionitems.AJh5ex99aV6VTggg]{Prise au dépourvu} face à vous. Elle doit réussir un test nu <a class=\"inline-roll roll\" title=\"test nu DD 11\" data-mode=\"roll\" data-flavor=\"test nu DD 11\" data-formula=\"1d20\"><i class=\"fas fa-dice-d20\"></i>1d20</a> <strong>DD 11</strong> quand elle vous cible avec une attaque, un sort ou un autre effet pour avoir une chance de vous affecter. Les effets de zone ne sont pas sujets à ce test nu.</p>\n<p>Une créature peut tenter de faire appel à l’action Chercher pour tenter de changer votre état en Observé.</p>"
        },
        {
            "id": "Hostile",
            "name": "Hostile (Hostile)",
            "description": "<p>Cet état reflète l'attitude d’une créature envers un personnage donné et elle n'affecte que des créatures qui ne sont pas des personnages joueurs. Une créature hostile souhaite activement faire du mal au personnage qui lui inspire cette attitude. Elle ne l’attaquera pas nécessairement mais refusera d’accéder aux @Compendium[pf2e.actionspf2e.DCb62iCBrJXy0Ik6]{Sollicitations} de ce personnage.</p>"
        },
        {
            "id": "Slowed",
            "name": "Slowed (Ralenti)",
            "description": "<p>Vous disposez de moins d'actions. L’état Ralenti est toujours accompagné d’une intensité. Quand vous regagnez des actions au début de votre tour, vous réduisez la quantité d’actions que vous gagnez par l’intensité de votre état ralenti. Dans la mesure où l’état ralenti produit son effet au début de votre tour, vous ne perdez pas immédiatement des actions si vous gagnez cet état lors de votre tour.</p>"
        },
        {
            "id": "Indifferent",
            "name": "Indifferent (Indifférent)",
            "description": "<p>Cet état reflète l'attitude d’une créature envers un personnage donné et n'affecte que les créatures qui  ne sont pas des personnages joueurs. Une créature indifférente n’a aucun préjugé positif ou négatif envers ce personnage. Sauf indication contraire, partez du principe que l’attitude par défaut d’une créature envers un personnage est indifférente.</p>"
        },
        {
            "id": "Quickened",
            "name": "Quickened (Accéléré)",
            "description": "<p>Vous gagnez une action supplémentaire au début de votre tour à chaque round. De nombreux effets qui vous accélèrent précisent le type d’actions que vous pouvez entreprendre avec cette action supplémentaire. Si plusieurs sources vous accélèrent, vous pouvez utiliser l’action supplémentaire que vous gagnez pour entreprendre n’importe quelle action permise par l’une de ces sources. Dans la mesure où l’état accéléré produit son effet au début de votre tour, vous ne gagnez pas immédiatement des actions si vous gagnez cet état lors de votre tour.</p>"
        },
        {
            "id": "Deafened",
            "name": "Deafened (Sourd)",
            "description": "<p>Vous ne pouvez pas entendre. Vous échouez automatiquement à tous les tests de Perception qui reposent sur votre audition. Vous subissez un malus de statut de −2 à vos tests de Perception destinés à déterminer l’initiative et aux tests en rapport avec le son et d’autres sens. Si vous accomplissez une action qui a le trait audible, vous devez réussir un test nu DD 5 ou perdre l’action. Vous faites ce test après avoir dépensé l’action mais avant d’appliquer ses effets. Vous êtes immunisé contre les effets audibles.</p>"
        },
        {
            "id": "Observed",
            "name": "Observed (Observé)",
            "description": "<p>Tout ce qui est dans votre ligne de mire est observé par vos soins. Si une créature prend des mesures pour éviter la détection, comme utiliser sa Discrétion pour @Compendium[pf2e.actionspf2e.XMcnh4cSI32tljXa]{Se cacher}, elle peut devenir @Compendium[pf2e.conditionitems.iU0fEDdBp3rXpTMC]{Cachée} ou @Compendium[pf2e.conditionitems.VRSef5y1LmL2Hkjf]{Non détectée} à la place d'observée. Si vous disposez d'un autre sens précis au lieu de ou en plus de la vue, vous pourriez être capable d'observer une créature ou un objet en utilisant ce sens à la place. Vous pouvez observer une créature seulement avec un sens précis. Lorsque vous @Compendium[pf2e.actionspf2e.BlAOM2X92SI6HMtJ]{Cherchez} une créature en utilisant seulement des sens imprécis, elle reste cachée plutôt qu'observée.</p>"
        },
        {
            "id": "Wounded",
            "name": "Wounded (Blessé)",
            "description": "<p>Vous avez été gravement blessé. Si vous perdez l’état @Compendium[pf2e.conditionitems.yZRUzMqrMmfLu0V1]{Mourant} et que vous n’êtes pas encore dans l’état blessé, vous devenez blessé 1. Si vous êtes déjà dans l’état blessé quand vous perdez l’état Mourant, l’intensité de votre état blessé augmente de 1. Si vous gagnez l’état Mourant alors que vous êtes blessé, vous ajoutez alors à l’intensité de votre état Mourant celle de votre état blessé.</p>\n<p>L’état blessé prend fin si quelqu’un réussit à vous rendre des points de vie grâce à @Compendium[pf2e.actionspf2e.1kGNdIIhuglAjIp9]{Soigner les blessures} ou si vous récupérez l’ensemble de vos points de vie et vous vous reposez pendant 10 minutes.</p>"
        },
        {
            "id": "Persistent Damage",
            "name": "Persistent Damage (Dégâts persistants)",
            "description": "<p>Les dégâts persistants sont causés par des effets comme l’acide, le feu ou de nombreuses autres choses. Ils se présentent sous la forme « X dégâts persistants de [type] », où « X » représente la quantité de dégâts infligés et le « [type] » correspond au type de dégâts. Au lieu de recevoir immédiatement les dégâts persistants, vous les recevez à la fin de chacun de vos tours tant que vous vous trouvez dans cet état et vous devez à chaque fois relancer les dés de dégâts. Après avoir subi des dégâts persistants, faites un test nu <a class=\"inline-roll roll\" title=\"test nu DD 15\" data-mode=\"roll\" data-flavor=\"test nu DD 15\" data-formula=\"1d20\"><i class=\"fas fa-dice-d20\"></i> 1d20</a> DD 15 afin de déterminer si ceux-ci prennent fin. Sur un succès, vous mettez un terme à l’état.</p>"
        },
        {
            "id": "Dazzled",
            "name": "Dazzled (Ébloui)",
            "description": "<p>Vos yeux ont été soumis à un excès de stimuli. Si la vue est votre seul sens précis, toutes les créatures et les objets vous sont @Compendium[pf2e.conditionitems.DmAIPqOBomZ7H95W]{Masqués}.</p>"
        },
        {
            "id": "Unfriendly",
            "name": "Unfriendly (Inamical)",
            "description": "<p>Cet état reflète l'attitude d’une créature envers un personnage donné et seul un effet surnaturel (comme un sort) peut imposer cet état à un personnage joueur. Une créature inamicale n’apprécie pas un personnage en particulier et elle ne lui fait pas confiance. Elle refusera toutes les @Compendium[pf2e.actionspf2e.DCb62iCBrJXy0Ik6]{Sollicitations} de ce personnage.</p>"
        },
        {
            "id": "Frightened",
            "name": "Frightened (Effrayé)",
            "description": "<p>Vous êtes paralysé par la peur et vous luttez pour ne pas céder à la panique. L’état effrayé est toujours accompagné d’une intensité. Vous subissez un malus de statut égal à cette valeur pour tous vos tests et DD. Sauf indication contraire, l’intensité de votre état effrayé décroît de 1 à la fin de chacun de vos tours.</p>"
        },
        {
            "id": "Doomed",
            "name": "Doomed (Condamné)",
            "description": "<p>Votre âme se trouve sous le joug d’une puissante force qui vous pousse toujours plus près de la mort. L’état Condamné est toujours accompagné d’une intensité. L’intensité maximale de l’état @Compendium[pf2e.conditionitems.yZRUzMqrMmfLu0V1]{Mourant} à partir de laquelle vous mourez est diminuée de l’intensité de votre état Condamné. Si votre intensité maximale d'état Mourant est réduite à 0, vous mourez instantanément. Si vous mourez, vous perdez l’état Condamné.</p>\n<p>L'intensité de votre état Condamné est diminuée de 1 à chaque fois que vous vous reposez pendant une nuit complète.</p>"
        },
        {
            "id": "Friendly",
            "name": "Friendly (Amical)",
            "description": "<p>Cet état reflète l'attitude d’une créature envers un personnage donné et n'affecte que les créatures qui ne sont pas des personnages joueurs. Une créature dont l’attitude est amicale envers un personnage l’apprécie. Le personnage peut tenter de @Compendium[pf2e.actionspf2e.DCb62iCBrJXy0Ik6]{Solliciter} l’aide d’une créature amicale et celle-ci répondra probablement favorablement à une requête simple et dénuée de risque qui ne lui coûte pas trop. Si le personnage ou l’un de ses alliés entreprend une action hostile contre la créature, l’attitude de cette dernière se dégrade proportionnellement à l’hostilité de l’action, dont le degré est déterminé par le MJ.</p>"
        },
        {
            "id": "Stunned",
            "name": "Stunned (Étourdi)",
            "description": "<p>Vous êtes hébété. Vous ne pouvez pas agir tant que vous êtes Étourdi. L’état Étourdi est toujours accompagné d’une intensité qui indique la quantité d’actions que vous perdez, parfois pendant plusieurs tours, du fait de cet état. À chaque fois que vous regagnez des actions (au début de votre tour, par exemple), vous déduisez la quantité d’actions regagnées de l’intensité de votre état Étourdi, puis déduisez l’intensité de votre état par le nombre d’actions que vous avez perdues. Par exemple, si vous êtes Étourdi 4, vous perdez vos 3 actions au début de votre tour et vous devenez alors Étourdi 1. Lors de votre prochain tour, vous perdrez une action supplémentaire, puis vous pourrez utiliser vos 2 actions restantes normalement. L’état Étourdi peut également être accompagné d’une durée à la place d’une intensité, comme « étourdi pendant 1 minute ». Dans ce cas-là, vous perdez toutes vos actions pendant la durée indiquée.</p>\n<p>L’état Étourdi est prépondérant sur l’état @Compendium[pf2e.conditionitems.xYTAsEpcJE1Ccni3]{Ralenti}. Si la durée de votre état Étourdi prend fin alors que vous êtes Ralenti, les actions perdues du fait de l’état Étourdi sont prises en compte dans le décompte des actions perdues du fait de l’état Ralenti. Ainsi, si vous êtes Étourdi 1 et Ralenti 2 au début de votre tour, vous perdez 1 action à cause de l’état étourdi puis perdez 1 action supplémentaire car vous êtes Ralenti et il vous reste 1 action à utiliser pour ce tour.</p>"
        },
        {
            "id": "Stupefied",
            "name": "Stupefied (Stupéfié)",
            "description": "<p>Vos pensées et votre instinct sont embrouillés. L’état Stupéfié est toujours accompagné d’une intensité. Vous subissez un malus de statut égal à cette intensité qui s’applique à vos tests et vos DD basés sur l’Intelligence, la Sagesse et le Charisme, dont vos jets de Volonté, vos jets d’attaques de sorts, vos DD de sorts et vos tests de compétences basés sur ces caractéristiques. À chaque fois que vous tentez de @Compendium[pf2e.actionspf2e.aBQ8ajvEBByv45yz]{Lancer un sort} quand vous êtes Stupéfié, ce sort est interrompu, sauf si vous réussissez un test nu dont le DD est égal à 5 + l’intensité de votre état Stupéfié.</p>"
        },
        {
            "id": "Clumsy",
            "name": "Clumsy (Maladroit)",
            "description": "<p>Vos mouvements deviennent maladroits et incertains. L’état Maladroit est toujours accompagné d’une intensité. Vous subissez un malus de statut égal à l’intensité de l’état et qui s’applique à vos tests et vos DD basés sur la Dextérité, comme votre CA, vos jets de Réflexes, vos jets d’attaque à distance et vos tests de compétences basés sur Acrobaties, Discrétion et Vol.</p>"
        },
        {
            "id": "Enfeebled",
            "name": "Enfeebled (Affaibli)",
            "description": "<p>Vous êtes physiquement affaibli. L’état affaibli est toujours accompagné d’une intensité. Quand vous êtes affaibli, vous subissez un malus de statut égal à l’intensité de votre état qui s’applique à vos jets et vos DD basés sur la Force, dont les jets d’attaque basés sur la Force, les jets de dégâts basés sur la Force et les tests d’Athlétisme.</p>"
        },
        {
            "id": "Helpful",
            "name": "Helpful (Serviable)",
            "description": "<p>Cet état reflète l'attitude d’une créature envers un personnage donné et elle n'affecte que les créatures qui ne sont pas des personnages joueurs. Une créature serviable souhaite activement aider le personnage qui lui inspire cette attitude. Elle acceptera que ce personnage lui présente des @Compendium[pf2e.actionspf2e.DCb62iCBrJXy0Ik6]{Sollicitations} raisonnables, tant que ces requêtes ne se font pas aux dépensdes objectifs ou de la qualité de vie de la créature serviable. Si le personnage ou l’un de ses alliés entreprend une action hostile contre la créature, l’attitude de cette dernière se dégrade proportionnellement à l’hostilité de l’action, dont le degré est déterminé par le MJ.</p>"
        },
        {
            "id": "Controlled",
            "name": "Controlled (Contrôlé)",
            "description": "<p>Quelqu’un prend des décisions à votre place, en exerçant généralement un contrôle sur vous par le biais d’une injonction ou d’une domination magique. La créature qui vous contrôle décide de vos actions et peut vous faire utiliser n’importe quelle action, y compris des attaques, des réactions et même l’action @Compendium[pf2e.actionspf2e.A72nHGUtNXgY5Ey9]{Retarder}. En outre, cette créature n’a généralement pas besoin de dépenser elle-même d’action pour vous contrôler.</p>"
        },
        {
            "id": "Paralyzed",
            "name": "Paralyzed (Paralysé)",
            "description": "<p>Votre corps est figé sur place. Vous êtes @Compendium[pf2e.conditionitems.AJh5ex99aV6VTggg]{Pris au dépourvu} et ne pouvez pas agir, sauf pour @Compendium[pf2e.actionspf2e.1OagaWtBpVXExToo]{Vous souvenir} de quelque chose et entreprendre des actions qui font seulement appel à votre esprit (ces actions sont déterminées par le MJ). Vos sens fonctionnent toujours, mais votre perception est limitée aux zones que vous pouvez percevoir sans bouger votre corps, vous n’êtes donc pas capable de @Compendium[pf2e.actionspf2e.BlAOM2X92SI6HMtJ]{Chercher}.</p>"
        },
        {
            "id": "Unconscious",
            "name": "Unconscious (Inconscient)",
            "description": "<p>Vous dormez ou avez été assommé. Vous ne pouvez pas faire d’action. Vous subissez un malus de −4 à votre CA, à votre Perception et à vos jets de Réflexes et vous vous trouvez dans les états @Compendium[pf2e.conditionitems.XgEqL1kFApUbl5Z2]{Aveugle} et @Compendium[pf2e.conditionitems.AJh5ex99aV6VTggg]{Pris au dépourvu}. Quand vous gagnez cet état, vous tombez @Compendium[pf2e.conditionitems.j91X7x0XSomq8d60]{À terre} et lâchez les objets que vous tenez en main, sauf si l’effet précise le contraire ou que le MJ détermine que vous êtes dans une situation qui ne s’y prête pas. Si vous êtes inconscient parce que vous êtes @Compendium[pf2e.conditionitems.yZRUzMqrMmfLu0V1]{Mourant}, vous ne pouvez pas vous réveiller tant que vous êtes réduit à 0 point de vie. Si vous regagnez 1 point de vie ou plus grâce à des soins, vous perdez les états Mourant et Inconscient et vous pouvez agir normalement lors de votre prochain tour.</p> \n<p>Si vous êtes inconscient et avez 0 point de vie mais n’êtes pas Mourant, vous regagnez naturellement 1 point de vie et vous éveillez au bout d’un certain temps. Le MJ détermine alors combien de temps vous êtes inconscient : un intervalle allant de 10 minutes à plusieurs heures. Si vous recevez des soins pendant cet intervalle de temps, vous perdez l’état inconscient et pouvez agir normalement lors de votre prochain tour.</p>\n<p>Si vous êtes inconscient et avez plus de 1 point de vie (généralement parce qu’un effet vous a endormi ou rendu inconscient), vous pouvez vous réveiller pour l’une des raisons suivantes. Chacune vous fait perdre l’état inconscient.</p>\n<ul>\n<li>Vous subissez des dégâts qui ne vous réduisent pas à 0 point de vie. Si ces dégâts vous réduisent à 0 point de vie, vous restez inconscient et gagnez également l’état mourant.</li>\n<li>Vous êtes soumis à un effet de guérison, autre que la guérison naturelle dont vous bénéficiez en vous reposant. </li>\n<li>Quelqu’un vous réveille avec une action d’Interaction.</li>\n<li>Un bruit fort se produit alentour. Vous ne vous réveillez cependant pas automatiquement. Au début de votre tour, vous faites automatiquement un test de Perception contre le DD du bruit (ou, s’il s’agit de plusieurs bruits, le DD le moins élevé). Sur un succès, vous vous réveillez. Si des créatures se trouvent autour de vous et tentent de rester discrètes, ce test de Perception est fait contre leur DD de Discrétion. Certains effets magiques vous font sombrer dans un sommeil si profond que vous ne pouvez pas faire ce test de Perception.</li>\n<li>Si vous êtes simplement endormi, le MJ peut décider que vous vous réveillez parce que vous avez assez dormi ou parce que quelque chose a troublé votre sommeil. </li>\n</ul>"
        },
        {
            "id": "Prone",
            "name": "Prone (À terre)",
            "description": "<p>Vous êtes étendu au sol. Vous êtes @Compendium[pf2e.conditionitems.AJh5ex99aV6VTggg]{Pris au dépourvu} et subissez un malus de circonstances de −2 à vos jets d’attaque. Les seules actions de déplacement que vous pouvez entreprendre quand vous êtes à terre sont @Compendium[pf2e.actionspf2e.Tj055UcNm6UEgtCg]{Ramper} et @Compendium[pf2e.actionspf2e.OdIUybJ3ddfL7wzj]{Vous relever}. Si vous vous relevez, vous mettez un terme à l’état à terre. Quand vous êtes à terre, vous pouvez vous @Compendium[pf2e.actionspf2e.ust1jJSCZQUhBZIz]{Mettre à l’abri} pour vous accroupir et bénéficier d’un abri contre les attaques à distance, même si vous ne vous abritez pas derrière un objet. Vous gagnez alors un bonus de circonstances de +4 à votre CA contre les attaques à distance (mais restez dans l’état Pris au dépourvu.</p>\n<p>Si vous tombez à terre alors que vous étiez en train d’@Compendium[pf2e.actionspf2e.pprgrYQ1QnIDGZiy]{Escalader} ou de @Compendium[pf2e.actionspf2e.cS9nfDRGD83bNU1p]{Voler}, vous chutez. Vous ne pouvez pas être renversé et tomber à terre quand vous @Compendium[pf2e.actionspf2e.c8TGiZ48ygoSPofx]{Nagez}.</p>"
        },
        {
            "id": "Sickened",
            "name": "Sickened (Malade)",
            "description": "<p>Vous vous sentez malade. L’état malade est toujours accompagné d’une intensité. Vous subissez un malus de statut égal à cette valeur à tous vos tests et DD. Quand vous êtes malade, vous ne pouvez pas volontairement ingérer quelque chose, y compris des élixirs et des potions.</p>\n<p>Vous pouvez dépenser une action unique pour tenter de vomir afin de vous remettre de cet état. Vous faites alors immédiatement un jet de Vigueur contre le DD de l’effet qui vous a rendu malade. Sur un succès, vous réduisez l’intensité de l’état malade de 1 (ou de 2 sur un succès critique).</p>"
        },
        {
            "id": "Fleeing",
            "name": "Fleeing (En fuite)",
            "description": "<p>La peur ou une autre forme de compulsion vous contraint à prendre la fuite. Lors de votre tour, vous devez utiliser toutes vos actions pour tenter de vous éloigner de la source de votre état de fuite aussi rapidement que possible (en utilisant des actions de déplacement pour fuir ou ouvrir des portes qui vous barrent le chemin, par exemple). Cette source est généralement l’effet ou l’incantateur qui vous a imposé cet état. Cependant, certains effets peuvent désigner quelque chose d’autre comme source. Vous ne pouvez pas utiliser les actions @Compendium[pf2e.actionspf2e.A72nHGUtNXgY5Ey9]{Retarder} ou @Compendium[pf2e.actionspf2e.dLgAMt3TbkmLkUqE]{Préparer} en fuyant.</p>"
        },
        {
            "id": "Undetected",
            "name": "Undetected (Non détecté)",
            "description": "<p>Quand vous êtes non détecté par une créature, celle-ci ne peut pas vous voir du tout, elle n’a aucune idée de l’espace que vous occupez et elle ne peut pas vous prendre pour cible. Vous pouvez cependant toujours être affecté par les pouvoirs qui ciblent une zone. Quand vous êtes non détecté par une créature, celle-ci se trouve @Compendium[pf2e.conditionitems.AJh5ex99aV6VTggg]{Prise au dépourvu} face à vous.</p>\n<p>Une créature face à laquelle vous êtes non détecté peut tenter de deviner quelle case vous occupez afin de vous prendre pour cible. Elle doit alors désigner une case et tenter une attaque. Le fonctionnement est alors le même que pour cibler une créature cachée (qui nécessite de faire un test nu <a class=\"inline-roll roll\" title=\"test nu DD 11\" data-mode=\"roll\" data-flavor=\"test nu DD 11\" data-formula=\"1d20\"> 1d20</a> <strong>DD 11</strong>), mais le test nu et le jet d’attaque sont faits en secret par le MJ qui ne précise alors pas si l’attaque échoue à cause d’un échec du test nu, du jet d’attaque ou d’un mauvais choix de case.</p>\n<p>Une créature peut entreprendre l’action @Compendium[pf2e.actionspf2e.BlAOM2X92SI6HMtJ]{Chercher} pour tenter de vous trouver.</p>"
        },
        {
            "id": "Immobilized",
            "name": "Immobilized (Immobilisé)",
            "description": "<p>Vous ne pouvez entreprendre aucune action dotée du trait déplacement. Si vous êtes immobilisé par quelque chose qui vous maintient en place et qu’une force extérieure tente de vous faire quitter votre espace, cette force doit réussir un test contre le DD de l’effet ou la défense adaptée (généralement le DD de Vigueur) du monstre qui vous maintient en place.</p>"
        },
        {
            "id": "Invisible",
            "name": "Invisible (Invisible)",
            "description": "<p>Vous ne pouvez pas être vu tant que vous êtes invisible. Vous êtes @Compendium[pf2e.conditionitems.VRSef5y1LmL2Hkjf]{Non détecté} aux yeux de tout le monde. Les créatures peuvent cependant vous @Compendium[pf2e.actionspf2e.BlAOM2X92SI6HMtJ]{Chercher} pour tenter de vous détecter. Si une créature réussit un test de Perception opposé à votre DD de Discrétion, vous vous trouvez dans l’état @Compendium[pf2e.conditionitems.iU0fEDdBp3rXpTMC]{Caché} par rapport à cette créature jusqu’à ce que vous @Compendium[pf2e.actionspf2e.VMozDqMMuK5kpoX4]{soyez Furtif} pour redevenir non détecté. Si vous devenez invisible alors que quelqu’un peut vous voir, vous commencez par vous trouver dans l’état caché par rapport à cet observateur (au lieu de non détecté) jusqu’à ce que vous réussissiez à être Furtif. Tant que vous êtes invisible, vous ne pouvez pas devenir @Compendium[pf2e.conditionitems.1wQY3JYyhMYeeV2G]{Observé}, sauf si une créature fait appel à des pouvoirs spéciaux ou à la magie.</p>"
        }
    ],
    "mapping": {
        "description": "data.description.value"
    }
}