<svg version="1.1" xmlns="http://www.w3.org/2000/svg" viewBox="0 0 957.4171353104199 702.5" width="957.4171353104199" height="702.5">
  <!-- svg-source:excalidraw -->
  
  <defs>
    <style class="style-fonts">
      @font-face {
        font-family: "Virgil";
        src: url("https://excalidraw.com/Virgil.woff2");
      }
      @font-face {
        font-family: "Cascadia";
        src: url("https://excalidraw.com/Cascadia.woff2");
      }
      @font-face {
        font-family: "Assistant";
        src: url("https://excalidraw.com/Assistant-Regular.woff2");
      }
    </style>
    
  </defs>
  <g stroke-linecap="round" transform="translate(164.758331298828 10) rotate(0 112.30833435058594 21.75)"><path d="M2.89 2.52 C2.89 2.52, 2.89 2.52, 2.89 2.52 M2.89 2.52 C2.89 2.52, 2.89 2.52, 2.89 2.52 M0.67 11.18 C3.94 7.41, 7.21 3.65, 9.85 0.61 M0.67 11.18 C3.23 8.23, 5.8 5.28, 9.85 0.61 M0.4 17.58 C6.12 11, 11.83 4.43, 15.49 0.22 M0.4 17.58 C5.26 11.98, 10.12 6.39, 15.49 0.22 M0.8 23.22 C6.64 16.49, 12.49 9.77, 20.48 0.58 M0.8 23.22 C5.03 18.35, 9.26 13.49, 20.48 0.58 M0.54 29.62 C9.36 19.47, 18.18 9.32, 26.12 0.18 M0.54 29.62 C5.97 23.37, 11.41 17.11, 26.12 0.18 M0.93 35.26 C12.49 21.96, 24.06 8.66, 31.11 0.54 M0.93 35.26 C9.1 25.86, 17.28 16.46, 31.11 0.54 M2.64 39.39 C15.16 24.99, 27.68 10.58, 36.75 0.15 M2.64 39.39 C13.99 26.33, 25.34 13.28, 36.75 0.15 M5.66 42.02 C16.86 29.14, 28.05 16.25, 41.74 0.51 M5.66 42.02 C16.9 29.09, 28.14 16.16, 41.74 0.51 M9.99 43.13 C23.14 28.01, 36.29 12.88, 47.38 0.11 M9.99 43.13 C24.02 26.99, 38.05 10.85, 47.38 0.11 M14.97 43.49 C26.93 29.74, 38.89 15.98, 52.37 0.47 M14.97 43.49 C27.37 29.23, 39.77 14.97, 52.37 0.47 M19.96 43.85 C35.17 26.36, 50.38 8.86, 58.01 0.08 M19.96 43.85 C31.82 30.21, 43.68 16.57, 58.01 0.08 M25.6 43.46 C36.75 30.64, 47.89 17.83, 63 0.44 M25.6 43.46 C38.88 28.19, 52.16 12.91, 63 0.44 M30.59 43.82 C42.31 30.34, 54.03 16.86, 68.64 0.05 M30.59 43.82 C41.76 30.97, 52.92 18.13, 68.64 0.05 M36.24 43.42 C46.57 31.53, 56.91 19.64, 73.63 0.41 M36.24 43.42 C48.79 28.98, 61.34 14.55, 73.63 0.41 M41.22 43.78 C51.26 32.24, 61.29 20.7, 78.62 0.77 M41.22 43.78 C54.37 28.66, 67.52 13.53, 78.62 0.77 M46.87 43.39 C59.3 29.08, 71.74 14.78, 84.26 0.37 M46.87 43.39 C56.47 32.34, 66.08 21.28, 84.26 0.37 M51.85 43.75 C65.61 27.92, 79.37 12.09, 89.25 0.73 M51.85 43.75 C62.96 30.97, 74.07 18.19, 89.25 0.73 M57.5 43.35 C68.28 30.94, 79.07 18.53, 94.89 0.34 M57.5 43.35 C66.17 33.37, 74.85 23.39, 94.89 0.34 M62.48 43.71 C73.3 31.27, 84.13 18.82, 99.88 0.7 M62.48 43.71 C70.72 34.23, 78.97 24.75, 99.88 0.7 M68.13 43.32 C76.06 34.2, 83.99 25.07, 105.52 0.3 M68.13 43.32 C75.75 34.55, 83.37 25.78, 105.52 0.3 M73.11 43.68 C80.99 34.62, 88.86 25.57, 110.51 0.66 M73.11 43.68 C87.76 26.83, 102.4 9.98, 110.51 0.66 M78.76 43.29 C90.58 29.68, 102.41 16.07, 116.15 0.27 M78.76 43.29 C87.91 32.75, 97.07 22.22, 116.15 0.27 M83.74 43.65 C95.13 30.54, 106.52 17.44, 121.14 0.63 M83.74 43.65 C97.23 28.13, 110.72 12.61, 121.14 0.63 M89.39 43.25 C99.09 32.09, 108.79 20.93, 126.78 0.23 M89.39 43.25 C99.01 32.18, 108.63 21.12, 126.78 0.23 M94.37 43.61 C103.35 33.29, 112.32 22.97, 131.77 0.59 M94.37 43.61 C103.99 32.54, 113.62 21.48, 131.77 0.59 M100.02 43.22 C109.19 32.67, 118.36 22.12, 137.41 0.2 M100.02 43.22 C110.23 31.47, 120.44 19.73, 137.41 0.2 M105 43.58 C115.49 31.51, 125.98 19.45, 142.4 0.56 M105 43.58 C115.87 31.08, 126.73 18.58, 142.4 0.56 M110.65 43.18 C122.71 29.31, 134.77 15.44, 148.04 0.16 M110.65 43.18 C123.87 27.97, 137.1 12.75, 148.04 0.16 M115.63 43.54 C130.04 26.97, 144.45 10.4, 153.03 0.52 M115.63 43.54 C124.95 32.82, 134.28 22.09, 153.03 0.52 M120.62 43.9 C131.49 31.4, 142.35 18.9, 158.67 0.13 M120.62 43.9 C131.68 31.18, 142.74 18.46, 158.67 0.13 M126.26 43.51 C137.81 30.23, 149.35 16.95, 163.66 0.49 M126.26 43.51 C133.83 34.8, 141.4 26.1, 163.66 0.49 M131.25 43.87 C145.48 27.5, 159.71 11.13, 169.3 0.09 M131.25 43.87 C142.84 30.53, 154.44 17.19, 169.3 0.09 M136.89 43.47 C148.13 30.54, 159.37 17.62, 174.29 0.45 M136.89 43.47 C151.77 26.35, 166.65 9.24, 174.29 0.45 M141.88 43.83 C156.06 27.52, 170.24 11.2, 179.93 0.06 M141.88 43.83 C155.07 28.66, 168.26 13.49, 179.93 0.06 M147.52 43.44 C155.22 34.58, 162.92 25.73, 184.92 0.42 M147.52 43.44 C161.14 27.78, 174.75 12.11, 184.92 0.42 M152.51 43.8 C164.17 30.38, 175.83 16.97, 189.91 0.78 M152.51 43.8 C167.35 26.73, 182.18 9.66, 189.91 0.78 M158.15 43.4 C171.8 27.71, 185.45 12.01, 195.55 0.39 M158.15 43.4 C165.95 34.44, 173.75 25.47, 195.55 0.39 M163.14 43.76 C176.86 27.98, 190.59 12.19, 200.54 0.75 M163.14 43.76 C176.79 28.06, 190.45 12.35, 200.54 0.75 M168.78 43.37 C180.51 29.88, 192.23 16.4, 206.18 0.35 M168.78 43.37 C180.69 29.67, 192.61 15.96, 206.18 0.35 M173.77 43.73 C187.19 28.29, 200.61 12.85, 211.17 0.71 M173.77 43.73 C188.41 26.89, 203.04 10.06, 211.17 0.71 M179.41 43.34 C189.98 31.18, 200.54 19.03, 216.81 0.32 M179.41 43.34 C189.18 32.1, 198.95 20.86, 216.81 0.32 M184.4 43.7 C193.56 33.16, 202.72 22.63, 220.48 2.19 M184.4 43.7 C196.85 29.37, 209.3 15.05, 220.48 2.19 M190.04 43.3 C200.02 31.82, 210 20.34, 223.5 4.81 M190.04 43.3 C199.53 32.39, 209.01 21.48, 223.5 4.81 M195.03 43.66 C202.97 34.53, 210.91 25.4, 225.21 8.94 M195.03 43.66 C204.84 32.37, 214.66 21.08, 225.21 8.94 M200.67 43.27 C207.53 35.38, 214.38 27.5, 224.95 15.34 M200.67 43.27 C205.81 37.36, 210.94 31.46, 224.95 15.34 M205.66 43.63 C212.19 36.11, 218.73 28.59, 224.69 21.74 M205.66 43.63 C212.52 35.74, 219.38 27.85, 224.69 21.74 M211.3 43.23 C216.15 37.66, 221 32.08, 225.08 27.38 M211.3 43.23 C216.15 37.66, 220.99 32.09, 225.08 27.38 M216.29 43.59 C219.02 40.45, 221.75 37.31, 225.48 33.03 M216.29 43.59 C219.13 40.32, 221.98 37.05, 225.48 33.03" stroke="#ececf8" stroke-width="0.5" fill="none"></path><path d="M10.88 0 C55.81 0, 100.75 0, 213.74 0 M10.88 0 C79.31 0, 147.74 0, 213.74 0 M213.74 0 C220.99 0, 224.62 3.63, 224.62 10.88 M213.74 0 C220.99 0, 224.62 3.63, 224.62 10.88 M224.62 10.88 C224.62 15.62, 224.62 20.37, 224.62 32.63 M224.62 10.88 C224.62 18.66, 224.62 26.45, 224.62 32.63 M224.62 32.63 C224.62 39.88, 220.99 43.5, 213.74 43.5 M224.62 32.63 C224.62 39.88, 220.99 43.5, 213.74 43.5 M213.74 43.5 C170.03 43.5, 126.33 43.5, 10.88 43.5 M213.74 43.5 C171.82 43.5, 129.9 43.5, 10.88 43.5 M10.88 43.5 C3.63 43.5, 0 39.88, 0 32.63 M10.88 43.5 C3.63 43.5, 0 39.88, 0 32.63 M0 32.63 C0 26.59, 0 20.55, 0 10.88 M0 32.63 C0 24.31, 0 16, 0 10.88 M0 10.88 C0 3.63, 3.63 0, 10.88 0 M0 10.88 C0 3.63, 3.63 0, 10.88 0" stroke="#1e1e1e" stroke-width="1" fill="none"></path></g><g transform="translate(188.7499999999999 19.25) rotate(0 88.31666564941406 12.5)"><text x="88.31666564941406" y="17.52" font-family="Virgil, Segoe UI Emoji" font-size="20px" fill="#1e1e1e" text-anchor="middle" style="white-space: pre;" direction="ltr" dominant-baseline="alphabetic">Sistema operativo</text></g><g stroke-linecap="round" transform="translate(164.4333267211914 327) rotate(0 138.72500610351562 21.75)"><path d="M2.89 2.52 C2.89 2.52, 2.89 2.52, 2.89 2.52 M2.89 2.52 C2.89 2.52, 2.89 2.52, 2.89 2.52 M0.67 11.18 C3.38 8.05, 6.1 4.92, 9.85 0.61 M0.67 11.18 C2.63 8.92, 4.59 6.66, 9.85 0.61 M0.4 17.58 C6.41 10.67, 12.41 3.76, 15.49 0.22 M0.4 17.58 C4.29 13.1, 8.18 8.63, 15.49 0.22 M0.8 23.22 C7.69 15.29, 14.58 7.36, 20.48 0.58 M0.8 23.22 C5.34 17.99, 9.89 12.76, 20.48 0.58 M0.54 29.62 C7.13 22.03, 13.73 14.44, 26.12 0.18 M0.54 29.62 C5.65 23.73, 10.77 17.84, 26.12 0.18 M0.93 35.26 C11.88 22.66, 22.83 10.07, 31.11 0.54 M0.93 35.26 C9.18 25.78, 17.42 16.29, 31.11 0.54 M2.64 39.39 C9.81 31.14, 16.98 22.9, 36.75 0.15 M2.64 39.39 C15.8 24.25, 28.96 9.11, 36.75 0.15 M5.66 42.02 C16.96 29.01, 28.27 16.01, 41.74 0.51 M5.66 42.02 C19.52 26.07, 33.39 10.11, 41.74 0.51 M9.99 43.13 C21.94 29.38, 33.89 15.64, 47.38 0.11 M9.99 43.13 C17.87 34.06, 25.76 24.99, 47.38 0.11 M14.97 43.49 C25.31 31.61, 35.64 19.72, 52.37 0.47 M14.97 43.49 C29.47 26.82, 43.96 10.15, 52.37 0.47 M19.96 43.85 C35.03 26.52, 50.09 9.2, 58.01 0.08 M19.96 43.85 C27.61 35.06, 35.25 26.27, 58.01 0.08 M25.6 43.46 C37.64 29.61, 49.68 15.77, 63 0.44 M25.6 43.46 C40.04 26.85, 54.47 10.25, 63 0.44 M30.59 43.82 C41.79 30.94, 52.99 18.06, 68.64 0.05 M30.59 43.82 C42.43 30.2, 54.27 16.57, 68.64 0.05 M36.24 43.42 C44.29 34.16, 52.34 24.89, 73.63 0.41 M36.24 43.42 C46.04 32.14, 55.85 20.86, 73.63 0.41 M41.22 43.78 C49.27 34.52, 57.32 25.26, 78.62 0.77 M41.22 43.78 C49.71 34.03, 58.19 24.27, 78.62 0.77 M46.87 43.39 C58.74 29.73, 70.61 16.07, 84.26 0.37 M46.87 43.39 C61.03 27.09, 75.2 10.8, 84.26 0.37 M51.85 43.75 C59.51 34.94, 67.16 26.14, 89.25 0.73 M51.85 43.75 C61.67 32.45, 71.49 21.16, 89.25 0.73 M57.5 43.35 C68.12 31.13, 78.75 18.9, 94.89 0.34 M57.5 43.35 C67.88 31.41, 78.26 19.47, 94.89 0.34 M62.48 43.71 C71.97 32.8, 81.46 21.88, 99.88 0.7 M62.48 43.71 C72.31 32.41, 82.13 21.11, 99.88 0.7 M68.13 43.32 C81.84 27.54, 95.56 11.76, 105.52 0.3 M68.13 43.32 C82.35 26.95, 96.58 10.58, 105.52 0.3 M73.11 43.68 C88.02 26.53, 102.94 9.37, 110.51 0.66 M73.11 43.68 C84.39 30.71, 95.66 17.74, 110.51 0.66 M78.76 43.29 C90.42 29.87, 102.09 16.45, 116.15 0.27 M78.76 43.29 C89.56 30.86, 100.36 18.43, 116.15 0.27 M83.74 43.65 C92.03 34.11, 100.32 24.58, 121.14 0.63 M83.74 43.65 C98.05 27.19, 112.36 10.73, 121.14 0.63 M89.39 43.25 C99.16 32, 108.94 20.76, 126.78 0.23 M89.39 43.25 C100 31.04, 110.61 18.83, 126.78 0.23 M94.37 43.61 C107.44 28.58, 120.5 13.56, 131.77 0.59 M94.37 43.61 C107.07 29.01, 119.76 14.4, 131.77 0.59 M100.02 43.22 C109.46 32.35, 118.91 21.48, 137.41 0.2 M100.02 43.22 C108.48 33.48, 116.94 23.75, 137.41 0.2 M105 43.58 C118.25 28.34, 131.5 13.1, 142.4 0.56 M105 43.58 C117.54 29.15, 130.09 14.72, 142.4 0.56 M110.65 43.18 C122.54 29.5, 134.43 15.82, 148.04 0.16 M110.65 43.18 C120.24 32.14, 129.84 21.1, 148.04 0.16 M115.63 43.54 C125.14 32.61, 134.64 21.68, 153.03 0.52 M115.63 43.54 C129.21 27.92, 142.79 12.3, 153.03 0.52 M120.62 43.9 C135.28 27.03, 149.95 10.17, 158.67 0.13 M120.62 43.9 C131.85 30.98, 143.08 18.06, 158.67 0.13 M126.26 43.51 C134.19 34.39, 142.12 25.27, 163.66 0.49 M126.26 43.51 C139.17 28.66, 152.08 13.81, 163.66 0.49 M131.25 43.87 C145.63 27.32, 160.01 10.78, 169.3 0.09 M131.25 43.87 C144.25 28.91, 157.25 13.96, 169.3 0.09 M136.89 43.47 C145.72 33.31, 154.56 23.15, 174.29 0.45 M136.89 43.47 C145.64 33.42, 154.38 23.36, 174.29 0.45 M141.88 43.83 C153.84 30.08, 165.8 16.32, 179.93 0.06 M141.88 43.83 C156.18 27.39, 170.48 10.94, 179.93 0.06 M147.52 43.44 C158 31.38, 168.48 19.33, 184.92 0.42 M147.52 43.44 C159.15 30.06, 170.78 16.69, 184.92 0.42 M152.51 43.8 C160.29 34.85, 168.07 25.9, 189.91 0.78 M152.51 43.8 C162.11 32.76, 171.71 21.72, 189.91 0.78 M158.15 43.4 C170.99 28.64, 183.82 13.88, 195.55 0.39 M158.15 43.4 C168.93 31.01, 179.71 18.61, 195.55 0.39 M163.14 43.76 C176.92 27.92, 190.69 12.07, 200.54 0.75 M163.14 43.76 C171.49 34.16, 179.84 24.55, 200.54 0.75 M168.78 43.37 C182.59 27.48, 196.4 11.6, 206.18 0.35 M168.78 43.37 C176.52 34.47, 184.25 25.58, 206.18 0.35 M173.77 43.73 C184.98 30.83, 196.19 17.93, 211.17 0.71 M173.77 43.73 C188.52 26.76, 203.27 9.8, 211.17 0.71 M179.41 43.34 C192.43 28.36, 205.45 13.39, 216.81 0.32 M179.41 43.34 C192.04 28.81, 204.67 14.28, 216.81 0.32 M184.4 43.7 C191.95 35.01, 199.5 26.32, 221.8 0.68 M184.4 43.7 C194.43 32.16, 204.46 20.62, 221.8 0.68 M190.04 43.3 C198.07 34.07, 206.09 24.84, 227.44 0.28 M190.04 43.3 C200.58 31.18, 211.11 19.07, 227.44 0.28 M195.03 43.66 C205.12 32.05, 215.21 20.44, 232.43 0.64 M195.03 43.66 C203.36 34.08, 211.69 24.5, 232.43 0.64 M200.67 43.27 C213.71 28.26, 226.76 13.26, 238.07 0.25 M200.67 43.27 C210.73 31.7, 220.79 20.13, 238.07 0.25 M205.66 43.63 C220.39 26.68, 235.12 9.73, 243.06 0.61 M205.66 43.63 C213.72 34.35, 221.79 25.08, 243.06 0.61 M211.3 43.23 C221.63 31.35, 231.97 19.46, 248.7 0.21 M211.3 43.23 C221.01 32.06, 230.72 20.89, 248.7 0.21 M216.29 43.59 C226.01 32.41, 235.72 21.24, 253.69 0.57 M216.29 43.59 C226.92 31.36, 237.55 19.13, 253.69 0.57 M221.93 43.2 C235.69 27.37, 249.45 11.54, 259.33 0.18 M221.93 43.2 C231.04 32.73, 240.14 22.25, 259.33 0.18 M226.92 43.56 C236.21 32.87, 245.51 22.18, 264.32 0.54 M226.92 43.56 C236.11 32.98, 245.31 22.41, 264.32 0.54 M231.91 43.92 C244.62 29.3, 257.33 14.68, 269.3 0.9 M231.91 43.92 C244.61 29.3, 257.31 14.69, 269.3 0.9 M237.55 43.52 C249.68 29.56, 261.82 15.61, 273.63 2.01 M237.55 43.52 C251.87 27.05, 266.2 10.57, 273.63 2.01 M242.54 43.88 C254.6 30.01, 266.66 16.13, 276.65 4.64 M242.54 43.88 C252.69 32.2, 262.84 20.52, 276.65 4.64 M248.18 43.49 C259.83 30.08, 271.49 16.68, 277.7 9.53 M248.18 43.49 C254.5 36.22, 260.82 28.94, 277.7 9.53 M253.17 43.85 C260.83 35.03, 268.5 26.22, 277.44 15.92 M253.17 43.85 C262.78 32.79, 272.39 21.74, 277.44 15.92 M258.81 43.45 C264.34 37.09, 269.88 30.72, 277.84 21.57 M258.81 43.45 C263.63 37.91, 268.46 32.36, 277.84 21.57 M263.8 43.81 C269.01 37.82, 274.23 31.82, 277.58 27.97 M263.8 43.81 C268.52 38.38, 273.25 32.94, 277.58 27.97 M269.44 43.42 C272.49 39.92, 275.53 36.41, 277.31 34.36 M269.44 43.42 C271.42 41.15, 273.39 38.88, 277.31 34.36" stroke="#ececf8" stroke-width="0.5" fill="none"></path><path d="M10.88 0 C90.44 0, 170.01 0, 266.58 0 M10.88 0 C68.7 0, 126.53 0, 266.58 0 M266.58 0 C273.83 0, 277.45 3.63, 277.45 10.88 M266.58 0 C273.83 0, 277.45 3.63, 277.45 10.88 M277.45 10.88 C277.45 18.12, 277.45 25.37, 277.45 32.63 M277.45 10.88 C277.45 16.66, 277.45 22.45, 277.45 32.63 M277.45 32.63 C277.45 39.88, 273.83 43.5, 266.58 43.5 M277.45 32.63 C277.45 39.88, 273.83 43.5, 266.58 43.5 M266.58 43.5 C201.73 43.5, 136.88 43.5, 10.88 43.5 M266.58 43.5 C175.01 43.5, 83.44 43.5, 10.88 43.5 M10.88 43.5 C3.63 43.5, 0 39.88, 0 32.63 M10.88 43.5 C3.63 43.5, 0 39.88, 0 32.63 M0 32.63 C0 24.13, 0 15.63, 0 10.88 M0 32.63 C0 28.03, 0 23.43, 0 10.88 M0 10.88 C0 3.63, 3.63 0, 10.88 0 M0 10.88 C0 3.63, 3.63 0, 10.88 0" stroke="#1e1e1e" stroke-width="1" fill="none"></path></g><g transform="translate(196.25833129882812 336.25) rotate(0 106.9000015258789 12.5)"><text x="106.9000015258789" y="17.52" font-family="Virgil, Segoe UI Emoji" font-size="20px" fill="#1e1e1e" text-anchor="middle" style="white-space: pre;" direction="ltr" dominant-baseline="alphabetic">Modo de configuración</text></g><g stroke-linecap="round" transform="translate(723.750475001582 321.8787743916496) rotate(0 81.73332977294922 21.75)"><path d="M2.89 2.52 C2.89 2.52, 2.89 2.52, 2.89 2.52 M2.89 2.52 C2.89 2.52, 2.89 2.52, 2.89 2.52 M0.67 11.18 C3.51 7.9, 6.36 4.63, 9.85 0.61 M0.67 11.18 C3.45 7.97, 6.24 4.77, 9.85 0.61 M0.4 17.58 C5.47 11.75, 10.53 5.93, 15.49 0.22 M0.4 17.58 C5.03 12.26, 9.65 6.94, 15.49 0.22 M0.8 23.22 C7.23 15.82, 13.66 8.42, 20.48 0.58 M0.8 23.22 C7.94 15, 15.08 6.79, 20.48 0.58 M0.54 29.62 C10.15 18.56, 19.75 7.51, 26.12 0.18 M0.54 29.62 C10.38 18.3, 20.22 6.97, 26.12 0.18 M0.93 35.26 C10.6 24.14, 20.26 13.02, 31.11 0.54 M0.93 35.26 C11.99 22.54, 23.05 9.82, 31.11 0.54 M2.64 39.39 C9.86 31.08, 17.09 22.77, 36.75 0.15 M2.64 39.39 C11.87 28.77, 21.1 18.15, 36.75 0.15 M5.66 42.02 C15.7 30.46, 25.75 18.9, 41.74 0.51 M5.66 42.02 C13.29 33.24, 20.92 24.46, 41.74 0.51 M9.99 43.13 C24.66 26.26, 39.33 9.38, 47.38 0.11 M9.99 43.13 C22.68 28.54, 35.36 13.94, 47.38 0.11 M14.97 43.49 C23.74 33.41, 32.51 23.32, 52.37 0.47 M14.97 43.49 C23.39 33.81, 31.81 24.12, 52.37 0.47 M19.96 43.85 C33.69 28.07, 47.41 12.28, 58.01 0.08 M19.96 43.85 C33.09 28.75, 46.22 13.64, 58.01 0.08 M25.6 43.46 C39.33 27.67, 53.06 11.88, 63 0.44 M25.6 43.46 C35.49 32.08, 45.38 20.71, 63 0.44 M30.59 43.82 C44.13 28.25, 57.66 12.68, 68.64 0.05 M30.59 43.82 C42.86 29.71, 55.12 15.6, 68.64 0.05 M36.24 43.42 C47.46 30.51, 58.69 17.6, 73.63 0.41 M36.24 43.42 C44.31 34.13, 52.38 24.85, 73.63 0.41 M41.22 43.78 C52.87 30.39, 64.51 16.99, 78.62 0.77 M41.22 43.78 C51.88 31.53, 62.53 19.27, 78.62 0.77 M46.87 43.39 C54.46 34.65, 62.05 25.92, 84.26 0.37 M46.87 43.39 C57.93 30.66, 69 17.93, 84.26 0.37 M51.85 43.75 C65.21 28.38, 78.58 13.01, 89.25 0.73 M51.85 43.75 C64.06 29.7, 76.28 15.65, 89.25 0.73 M57.5 43.35 C68.35 30.86, 79.21 18.37, 94.89 0.34 M57.5 43.35 C70.6 28.28, 83.7 13.21, 94.89 0.34 M62.48 43.71 C74.38 30.03, 86.27 16.35, 99.88 0.7 M62.48 43.71 C74.47 29.93, 86.45 16.14, 99.88 0.7 M68.13 43.32 C80.16 29.47, 92.2 15.63, 105.52 0.3 M68.13 43.32 C81.4 28.05, 94.67 12.79, 105.52 0.3 M73.11 43.68 C81.11 34.48, 89.1 25.28, 110.51 0.66 M73.11 43.68 C81.33 34.23, 89.55 24.77, 110.51 0.66 M78.76 43.29 C90.08 30.26, 101.4 17.23, 116.15 0.27 M78.76 43.29 C90.53 29.74, 102.3 16.2, 116.15 0.27 M83.74 43.65 C97.2 28.17, 110.65 12.69, 121.14 0.63 M83.74 43.65 C97.1 28.29, 110.45 12.92, 121.14 0.63 M89.39 43.25 C103.73 26.74, 118.08 10.24, 126.78 0.23 M89.39 43.25 C103.05 27.54, 116.71 11.82, 126.78 0.23 M94.37 43.61 C104.35 32.13, 114.33 20.66, 131.77 0.59 M94.37 43.61 C107.26 28.78, 120.16 13.95, 131.77 0.59 M100.02 43.22 C113.49 27.71, 126.97 12.21, 137.41 0.2 M100.02 43.22 C110.15 31.56, 120.29 19.9, 137.41 0.2 M105 43.58 C117.74 28.92, 130.48 14.27, 142.4 0.56 M105 43.58 C119.02 27.45, 133.04 11.32, 142.4 0.56 M110.65 43.18 C124.63 27.09, 138.62 11, 148.04 0.16 M110.65 43.18 C122.85 29.14, 135.05 15.1, 148.04 0.16 M115.63 43.54 C129.95 27.08, 144.26 10.61, 153.03 0.52 M115.63 43.54 C127.57 29.81, 139.51 16.08, 153.03 0.52 M120.62 43.9 C128.51 34.83, 136.4 25.75, 158.02 0.88 M120.62 43.9 C130.17 32.92, 139.72 21.93, 158.02 0.88 M126.26 43.51 C136.34 31.92, 146.41 20.33, 161.03 3.51 M126.26 43.51 C134.23 34.34, 142.2 25.17, 161.03 3.51 M131.25 43.87 C137.78 36.36, 144.31 28.85, 163.4 6.89 M131.25 43.87 C141.28 32.33, 151.3 20.8, 163.4 6.89 M136.89 43.47 C146.4 32.54, 155.91 21.6, 163.79 12.53 M136.89 43.47 C143.24 36.17, 149.59 28.87, 163.79 12.53 M141.88 43.83 C148.97 35.68, 156.06 27.53, 163.53 18.93 M141.88 43.83 C150.09 34.38, 158.31 24.93, 163.53 18.93 M147.52 43.44 C153.45 36.62, 159.37 29.81, 163.92 24.57 M147.52 43.44 C151.63 38.72, 155.74 33.99, 163.92 24.57 M152.51 43.8 C155.93 39.87, 159.34 35.94, 163.66 30.97 M152.51 43.8 C155.53 40.32, 158.56 36.84, 163.66 30.97 M158.15 43.4 C159.7 41.62, 161.25 39.84, 163.4 37.37 M158.15 43.4 C159.53 41.82, 160.91 40.23, 163.4 37.37" stroke="#ececf8" stroke-width="0.5" fill="none"></path><path d="M10.88 0 C66.64 0, 122.41 0, 152.59 0 M10.88 0 C40.57 0, 70.26 0, 152.59 0 M152.59 0 C159.84 0, 163.47 3.63, 163.47 10.88 M152.59 0 C159.84 0, 163.47 3.63, 163.47 10.88 M163.47 10.88 C163.47 17.34, 163.47 23.81, 163.47 32.63 M163.47 10.88 C163.47 16.8, 163.47 22.72, 163.47 32.63 M163.47 32.63 C163.47 39.88, 159.84 43.5, 152.59 43.5 M163.47 32.63 C163.47 39.88, 159.84 43.5, 152.59 43.5 M152.59 43.5 C121.2 43.5, 89.81 43.5, 10.88 43.5 M152.59 43.5 C98.81 43.5, 45.04 43.5, 10.88 43.5 M10.88 43.5 C3.63 43.5, 0 39.88, 0 32.63 M10.88 43.5 C3.63 43.5, 0 39.88, 0 32.63 M0 32.63 C0 27.93, 0 23.23, 0 10.88 M0 32.63 C0 25.61, 0 18.59, 0 10.88 M0 10.88 C0 3.63, 3.63 0, 10.88 0 M0 10.88 C0 3.63, 3.63 0, 10.88 0" stroke="#1e1e1e" stroke-width="1" fill="none"></path></g><g transform="translate(750.6504727127636 331.1287743916496) rotate(0 54.83333206176758 12.5)"><text x="54.83333206176758" y="17.52" font-family="Virgil, Segoe UI Emoji" font-size="20px" fill="#1e1e1e" text-anchor="middle" style="white-space: pre;" direction="ltr" dominant-baseline="alphabetic">Complejidad</text></g><g stroke-linecap="round" transform="translate(471.1964880760528 170.5) rotate(0 99.11666870117188 21.75)"><path d="M2.89 2.52 C2.89 2.52, 2.89 2.52, 2.89 2.52 M2.89 2.52 C2.89 2.52, 2.89 2.52, 2.89 2.52 M0.67 11.18 C3.57 7.84, 6.48 4.49, 9.85 0.61 M0.67 11.18 C3 8.49, 5.34 5.8, 9.85 0.61 M0.4 17.58 C5.48 11.74, 10.55 5.91, 15.49 0.22 M0.4 17.58 C5.8 11.37, 11.19 5.16, 15.49 0.22 M0.8 23.22 C5.85 17.41, 10.91 11.59, 20.48 0.58 M0.8 23.22 C6.16 17.06, 11.51 10.89, 20.48 0.58 M0.54 29.62 C10.07 18.65, 19.61 7.68, 26.12 0.18 M0.54 29.62 C7.97 21.06, 15.41 12.51, 26.12 0.18 M0.93 35.26 C8.01 27.12, 15.08 18.98, 31.11 0.54 M0.93 35.26 C10.84 23.86, 20.76 12.45, 31.11 0.54 M2.64 39.39 C9.95 30.99, 17.25 22.58, 36.75 0.15 M2.64 39.39 C13.2 27.25, 23.76 15.1, 36.75 0.15 M5.66 42.02 C19.05 26.61, 32.44 11.2, 41.74 0.51 M5.66 42.02 C14.68 31.64, 23.7 21.26, 41.74 0.51 M9.99 43.13 C18.12 33.78, 26.26 24.42, 47.38 0.11 M9.99 43.13 C19.08 32.68, 28.17 22.22, 47.38 0.11 M14.97 43.49 C29.33 26.98, 43.68 10.47, 52.37 0.47 M14.97 43.49 C27.8 28.74, 40.63 13.98, 52.37 0.47 M19.96 43.85 C34.6 27.02, 49.23 10.18, 58.01 0.08 M19.96 43.85 C33.27 28.54, 46.58 13.24, 58.01 0.08 M25.6 43.46 C36.24 31.22, 46.88 18.98, 63 0.44 M25.6 43.46 C36.57 30.85, 47.53 18.24, 63 0.44 M30.59 43.82 C40.6 32.3, 50.61 20.79, 68.64 0.05 M30.59 43.82 C38.87 34.29, 47.15 24.77, 68.64 0.05 M36.24 43.42 C46.74 31.34, 57.24 19.26, 73.63 0.41 M36.24 43.42 C46.18 31.98, 56.13 20.54, 73.63 0.41 M41.22 43.78 C50.4 33.23, 59.57 22.68, 78.62 0.77 M41.22 43.78 C51.11 32.4, 61.01 21.02, 78.62 0.77 M46.87 43.39 C57.18 31.52, 67.49 19.66, 84.26 0.37 M46.87 43.39 C54.6 34.49, 62.33 25.6, 84.26 0.37 M51.85 43.75 C61.93 32.15, 72.02 20.55, 89.25 0.73 M51.85 43.75 C60.76 33.51, 69.66 23.26, 89.25 0.73 M57.5 43.35 C71.24 27.55, 84.98 11.74, 94.89 0.34 M57.5 43.35 C70.22 28.72, 82.95 14.08, 94.89 0.34 M62.48 43.71 C74.42 29.99, 86.35 16.26, 99.88 0.7 M62.48 43.71 C74.28 30.14, 86.08 16.57, 99.88 0.7 M68.13 43.32 C81.19 28.3, 94.25 13.27, 105.52 0.3 M68.13 43.32 C78.27 31.66, 88.41 19.99, 105.52 0.3 M73.11 43.68 C85.18 29.8, 97.24 15.93, 110.51 0.66 M73.11 43.68 C80.73 34.92, 88.35 26.15, 110.51 0.66 M78.76 43.29 C86.61 34.25, 94.46 25.22, 116.15 0.27 M78.76 43.29 C89.36 31.09, 99.97 18.88, 116.15 0.27 M83.74 43.65 C93.24 32.72, 102.73 21.8, 121.14 0.63 M83.74 43.65 C92.69 33.35, 101.64 23.06, 121.14 0.63 M89.39 43.25 C98.13 33.19, 106.88 23.13, 126.78 0.23 M89.39 43.25 C98.42 32.86, 107.46 22.46, 126.78 0.23 M94.37 43.61 C103.06 33.62, 111.75 23.62, 131.77 0.59 M94.37 43.61 C105.16 31.2, 115.95 18.8, 131.77 0.59 M100.02 43.22 C111.24 30.3, 122.47 17.39, 137.41 0.2 M100.02 43.22 C110.81 30.79, 121.61 18.37, 137.41 0.2 M105 43.58 C113.32 34.01, 121.64 24.44, 142.4 0.56 M105 43.58 C114.25 32.94, 123.49 22.31, 142.4 0.56 M110.65 43.18 C125 26.67, 139.35 10.16, 148.04 0.16 M110.65 43.18 C123.67 28.19, 136.7 13.21, 148.04 0.16 M115.63 43.54 C128.13 29.17, 140.63 14.79, 153.03 0.52 M115.63 43.54 C128.39 28.86, 141.16 14.18, 153.03 0.52 M120.62 43.9 C130.31 32.76, 140 21.61, 158.67 0.13 M120.62 43.9 C129.12 34.12, 137.63 24.33, 158.67 0.13 M126.26 43.51 C138.33 29.63, 150.4 15.75, 163.66 0.49 M126.26 43.51 C134.71 33.79, 143.16 24.07, 163.66 0.49 M131.25 43.87 C145.64 27.32, 160.02 10.77, 169.3 0.09 M131.25 43.87 C142.54 30.88, 153.84 17.88, 169.3 0.09 M136.89 43.47 C147.68 31.06, 158.47 18.65, 174.29 0.45 M136.89 43.47 C147.6 31.16, 158.3 18.85, 174.29 0.45 M141.88 43.83 C150.06 34.43, 158.23 25.02, 179.93 0.06 M141.88 43.83 C150.66 33.74, 159.43 23.64, 179.93 0.06 M147.52 43.44 C161.64 27.2, 175.75 10.97, 184.92 0.42 M147.52 43.44 C160.12 28.95, 172.72 14.45, 184.92 0.42 M152.51 43.8 C164.51 29.99, 176.51 16.19, 189.91 0.78 M152.51 43.8 C162.5 32.31, 172.48 20.82, 189.91 0.78 M158.15 43.4 C168.28 31.76, 178.4 20.11, 194.24 1.9 M158.15 43.4 C169.79 30.02, 181.42 16.64, 194.24 1.9 M163.14 43.76 C171.59 34.05, 180.03 24.33, 197.26 4.52 M163.14 43.76 C174.33 30.9, 185.51 18.03, 197.26 4.52 M168.78 43.37 C178.66 32.01, 188.53 20.65, 198.31 9.41 M168.78 43.37 C175.18 36.01, 181.58 28.65, 198.31 9.41 M173.77 43.73 C179.63 36.99, 185.49 30.25, 198.04 15.81 M173.77 43.73 C181.4 34.95, 189.04 26.17, 198.04 15.81 M179.41 43.34 C183.62 38.5, 187.82 33.67, 198.44 21.45 M179.41 43.34 C185.57 36.25, 191.73 29.17, 198.44 21.45 M184.4 43.7 C189.14 38.24, 193.89 32.78, 198.18 27.85 M184.4 43.7 C187.27 40.4, 190.13 37.1, 198.18 27.85 M189.39 44.06 C191.84 41.24, 194.29 38.42, 198.57 33.49 M189.39 44.06 C192.85 40.07, 196.31 36.09, 198.57 33.49" stroke="#ececf8" stroke-width="0.5" fill="none"></path><path d="M10.88 0 C59.74 0, 108.6 0, 187.36 0 M10.88 0 C71 0, 131.12 0, 187.36 0 M187.36 0 C194.61 0, 198.23 3.63, 198.23 10.88 M187.36 0 C194.61 0, 198.23 3.63, 198.23 10.88 M198.23 10.88 C198.23 19.11, 198.23 27.34, 198.23 32.63 M198.23 10.88 C198.23 18.42, 198.23 25.97, 198.23 32.63 M198.23 32.63 C198.23 39.88, 194.61 43.5, 187.36 43.5 M198.23 32.63 C198.23 39.88, 194.61 43.5, 187.36 43.5 M187.36 43.5 C137.88 43.5, 88.41 43.5, 10.88 43.5 M187.36 43.5 C121.32 43.5, 55.27 43.5, 10.88 43.5 M10.88 43.5 C3.63 43.5, 0 39.88, 0 32.63 M10.88 43.5 C3.63 43.5, 0 39.88, 0 32.63 M0 32.63 C0 25.17, 0 17.71, 0 10.88 M0 32.63 C0 26.8, 0 20.97, 0 10.88 M0 10.88 C0 3.63, 3.63 0, 10.88 0 M0 10.88 C0 3.63, 3.63 0, 10.88 0" stroke="#1e1e1e" stroke-width="1" fill="none"></path></g><g transform="translate(508.0964896019317 179.75) rotate(0 62.21666717529297 12.5)"><text x="62.21666717529297" y="17.52" font-family="Virgil, Segoe UI Emoji" font-size="20px" fill="#1e1e1e" text-anchor="middle" style="white-space: pre;" direction="ltr" dominant-baseline="alphabetic">Modo de uso</text></g><a href="mobaxterm.html"><g stroke-linecap="round" transform="translate(83.95169298459348 167.5) rotate(0 72.82085946695747 17.5)"><path d="M8.75 0 C44.46 0, 80.18 0, 136.89 0 C142.73 0, 145.64 2.92, 145.64 8.75 C145.64 14.22, 145.64 19.7, 145.64 26.25 C145.64 32.08, 142.73 35, 136.89 35 C85.91 35, 34.93 35, 8.75 35 C2.92 35, 0 32.08, 0 26.25 C0 19.99, 0 13.74, 0 8.75 C0 2.92, 2.92 0, 8.75 0" stroke="none" stroke-width="0" fill="#ececf8"></path><path d="M8.75 0 C48.46 0, 88.17 0, 136.89 0 M8.75 0 C42.35 0, 75.96 0, 136.89 0 M136.89 0 C142.73 0, 145.64 2.92, 145.64 8.75 M136.89 0 C142.73 0, 145.64 2.92, 145.64 8.75 M145.64 8.75 C145.64 13.78, 145.64 18.81, 145.64 26.25 M145.64 8.75 C145.64 13.95, 145.64 19.15, 145.64 26.25 M145.64 26.25 C145.64 32.08, 142.73 35, 136.89 35 M145.64 26.25 C145.64 32.08, 142.73 35, 136.89 35 M136.89 35 C106.4 35, 75.91 35, 8.75 35 M136.89 35 C107.56 35, 78.23 35, 8.75 35 M8.75 35 C2.92 35, 0 32.08, 0 26.25 M8.75 35 C2.92 35, 0 32.08, 0 26.25 M0 26.25 C0 20.82, 0 15.4, 0 8.75 M0 26.25 C0 22.25, 0 18.24, 0 8.75 M0 8.75 C0 2.92, 2.92 0, 8.75 0 M0 8.75 C0 2.92, 2.92 0, 8.75 0" stroke="#6456ff" stroke-width="1" fill="none"></path></g></a><g transform="translate(104.08921810096501 172.5) rotate(0 52.68333435058594 12.5)"><text x="52.68333435058594" y="17.52" font-family="Virgil, Segoe UI Emoji" font-size="20px" fill="#6456ff" text-anchor="middle" style="white-space: pre;" direction="ltr" dominant-baseline="alphabetic">MobaXterm</text></g><a href="sshfs.html"><g stroke-linecap="round" transform="translate(271.8748505860274 647) rotate(0 49.15833282470703 21.75)"><path d="M10.88 0 C38.59 0, 66.31 0, 87.44 0 C94.69 0, 98.32 3.63, 98.32 10.88 C98.32 16.95, 98.32 23.03, 98.32 32.63 C98.32 39.88, 94.69 43.5, 87.44 43.5 C61.75 43.5, 36.06 43.5, 10.88 43.5 C3.63 43.5, 0 39.88, 0 32.63 C0 25.11, 0 17.59, 0 10.88 C0 3.63, 3.63 0, 10.88 0" stroke="none" stroke-width="0" fill="#ececf8"></path><path d="M10.88 0 C33.15 0, 55.42 0, 87.44 0 M10.88 0 C37.43 0, 63.98 0, 87.44 0 M87.44 0 C94.69 0, 98.32 3.63, 98.32 10.88 M87.44 0 C94.69 0, 98.32 3.63, 98.32 10.88 M98.32 10.88 C98.32 19.32, 98.32 27.76, 98.32 32.63 M98.32 10.88 C98.32 15.36, 98.32 19.85, 98.32 32.63 M98.32 32.63 C98.32 39.88, 94.69 43.5, 87.44 43.5 M98.32 32.63 C98.32 39.88, 94.69 43.5, 87.44 43.5 M87.44 43.5 C67.68 43.5, 47.91 43.5, 10.88 43.5 M87.44 43.5 C60.35 43.5, 33.26 43.5, 10.88 43.5 M10.88 43.5 C3.63 43.5, 0 39.88, 0 32.63 M10.88 43.5 C3.63 43.5, 0 39.88, 0 32.63 M0 32.63 C0 27.93, 0 23.23, 0 10.88 M0 32.63 C0 27.01, 0 21.39, 0 10.88 M0 10.88 C0 3.63, 3.63 0, 10.88 0 M0 10.88 C0 3.63, 3.63 0, 10.88 0" stroke="#6456ff" stroke-width="1" fill="none"></path></g></a><g transform="translate(291.5331834107344 656.25) rotate(0 29.5 12.5)"><text x="29.5" y="17.52" font-family="Virgil, Segoe UI Emoji" font-size="20px" fill="#6456ff" text-anchor="middle" style="white-space: pre;" direction="ltr" dominant-baseline="alphabetic">SSHFS</text></g><a href="fstab.html"><g stroke-linecap="round" transform="translate(486.19151623544144 649) rotate(0 46.841667175293026 21.75)"><path d="M10.88 0 C31.12 0, 51.36 0, 82.81 0 C90.06 0, 93.68 3.63, 93.68 10.88 C93.68 15.53, 93.68 20.18, 93.68 32.63 C93.68 39.88, 90.06 43.5, 82.81 43.5 C58.63 43.5, 34.44 43.5, 10.88 43.5 C3.63 43.5, 0 39.88, 0 32.63 C0 24.11, 0 15.59, 0 10.88 C0 3.63, 3.63 0, 10.88 0" stroke="none" stroke-width="0" fill="#ececf8"></path><path d="M10.88 0 C30.83 0, 50.78 0, 82.81 0 M10.88 0 C35.16 0, 59.45 0, 82.81 0 M82.81 0 C90.06 0, 93.68 3.63, 93.68 10.88 M82.81 0 C90.06 0, 93.68 3.63, 93.68 10.88 M93.68 10.88 C93.68 15.37, 93.68 19.86, 93.68 32.63 M93.68 10.88 C93.68 19.05, 93.68 27.22, 93.68 32.63 M93.68 32.63 C93.68 39.88, 90.06 43.5, 82.81 43.5 M93.68 32.63 C93.68 39.88, 90.06 43.5, 82.81 43.5 M82.81 43.5 C63.39 43.5, 43.97 43.5, 10.88 43.5 M82.81 43.5 C59.53 43.5, 36.25 43.5, 10.88 43.5 M10.88 43.5 C3.63 43.5, 0 39.88, 0 32.63 M10.88 43.5 C3.63 43.5, 0 39.88, 0 32.63 M0 32.63 C0 27.69, 0 22.76, 0 10.88 M0 32.63 C0 27.84, 0 23.06, 0 10.88 M0 10.88 C0 3.63, 3.63 0, 10.88 0 M0 10.88 C0 3.63, 3.63 0, 10.88 0" stroke="#6456ff" stroke-width="1" fill="none"></path></g></a><g transform="translate(499.3498490601486 658.25) rotate(0 33.68333435058594 12.5)"><text x="33.68333435058594" y="17.52" font-family="Virgil, Segoe UI Emoji" font-size="20px" fill="#6456ff" text-anchor="middle" style="white-space: pre;" direction="ltr" dominant-baseline="alphabetic">FSTAB</text></g><g stroke-linecap="round" transform="translate(356.69151623544144 489.5) rotate(0 80.34166717529303 21.75)"><path d="M2.89 2.52 C2.89 2.52, 2.89 2.52, 2.89 2.52 M2.89 2.52 C2.89 2.52, 2.89 2.52, 2.89 2.52 M0.67 11.18 C4.14 7.18, 7.62 3.18, 9.85 0.61 M0.67 11.18 C3.62 7.77, 6.58 4.37, 9.85 0.61 M0.4 17.58 C4.89 12.42, 9.37 7.26, 15.49 0.22 M0.4 17.58 C3.65 13.84, 6.89 10.11, 15.49 0.22 M0.8 23.22 C7.58 15.41, 14.37 7.61, 20.48 0.58 M0.8 23.22 C4.98 18.41, 9.16 13.6, 20.48 0.58 M0.54 29.62 C10.34 18.34, 20.14 7.06, 26.12 0.18 M0.54 29.62 C7.47 21.65, 14.39 13.68, 26.12 0.18 M0.93 35.26 C12.01 22.52, 23.09 9.77, 31.11 0.54 M0.93 35.26 C10.97 23.71, 21.02 12.16, 31.11 0.54 M2.64 39.39 C13.23 27.21, 23.81 15.03, 36.75 0.15 M2.64 39.39 C13.27 27.17, 23.89 14.94, 36.75 0.15 M5.66 42.02 C18.34 27.42, 31.03 12.83, 41.74 0.51 M5.66 42.02 C19.2 26.44, 32.74 10.86, 41.74 0.51 M9.99 43.13 C21.95 29.38, 33.91 15.62, 47.38 0.11 M9.99 43.13 C22.39 28.87, 34.79 14.61, 47.38 0.11 M14.97 43.49 C29.92 26.3, 44.87 9.1, 52.37 0.47 M14.97 43.49 C26.63 30.08, 38.29 16.68, 52.37 0.47 M19.96 43.85 C31.3 30.81, 42.63 17.77, 58.01 0.08 M19.96 43.85 C33.47 28.31, 46.98 12.77, 58.01 0.08 M25.6 43.46 C37.12 30.21, 48.64 16.96, 63 0.44 M25.6 43.46 C36.58 30.84, 47.55 18.21, 63 0.44 M30.59 43.82 C41.11 31.72, 51.63 19.62, 68.64 0.05 M30.59 43.82 C43.36 29.13, 56.14 14.43, 68.64 0.05 M36.24 43.42 C46.27 31.88, 56.3 20.34, 73.63 0.41 M36.24 43.42 C49.38 28.3, 62.53 13.17, 73.63 0.41 M41.22 43.78 C53.66 29.48, 66.09 15.17, 78.62 0.77 M41.22 43.78 C50.83 32.73, 60.44 21.68, 78.62 0.77 M46.87 43.39 C60.62 27.56, 74.38 11.73, 84.26 0.37 M46.87 43.39 C57.98 30.61, 69.09 17.83, 84.26 0.37 M51.85 43.75 C62.64 31.34, 73.43 18.93, 89.25 0.73 M51.85 43.75 C60.53 33.77, 69.21 23.78, 89.25 0.73 M57.5 43.35 C68.32 30.91, 79.14 18.46, 94.89 0.34 M57.5 43.35 C65.74 33.87, 73.98 24.39, 94.89 0.34 M62.48 43.71 C70.41 34.59, 78.35 25.47, 99.88 0.7 M62.48 43.71 C70.11 34.94, 77.73 26.17, 99.88 0.7 M68.13 43.32 C76 34.26, 83.87 25.21, 105.52 0.3 M68.13 43.32 C82.77 26.47, 97.42 9.62, 105.52 0.3 M73.11 43.68 C84.94 30.07, 96.77 16.46, 110.51 0.66 M73.11 43.68 C82.27 33.15, 91.43 22.61, 110.51 0.66 M78.76 43.29 C90.15 30.18, 101.53 17.08, 116.15 0.27 M78.76 43.29 C92.25 27.77, 105.74 12.25, 116.15 0.27 M83.74 43.65 C93.45 32.48, 103.15 21.32, 121.14 0.63 M83.74 43.65 C93.36 32.58, 102.98 21.51, 121.14 0.63 M89.39 43.25 C98.36 32.93, 107.33 22.61, 126.78 0.23 M89.39 43.25 C99.01 32.18, 108.63 21.11, 126.78 0.23 M94.37 43.61 C103.54 33.06, 112.71 22.51, 131.77 0.59 M94.37 43.61 C104.58 31.87, 114.79 20.12, 131.77 0.59 M100.02 43.22 C110.5 31.15, 120.99 19.09, 137.41 0.2 M100.02 43.22 C110.88 30.72, 121.74 18.22, 137.41 0.2 M105 43.58 C117.06 29.7, 129.12 15.83, 142.4 0.56 M105 43.58 C118.23 28.36, 131.46 13.14, 142.4 0.56 M110.65 43.18 C125.05 26.61, 139.46 10.04, 148.04 0.16 M110.65 43.18 C119.97 32.46, 129.29 21.73, 148.04 0.16 M115.63 43.54 C126.31 31.26, 136.99 18.97, 153.03 0.52 M115.63 43.54 C126.5 31.04, 137.37 18.54, 153.03 0.52 M120.62 43.9 C131.76 31.09, 142.9 18.27, 156.7 2.39 M120.62 43.9 C127.92 35.5, 135.22 27.11, 156.7 2.39 M126.26 43.51 C138.78 29.11, 151.29 14.72, 159.72 5.02 M126.26 43.51 C136.46 31.78, 146.65 20.05, 159.72 5.02 M131.25 43.87 C140.12 33.66, 149 23.45, 160.77 9.91 M131.25 43.87 C143 30.35, 154.75 16.84, 160.77 9.91 M136.89 43.47 C145.94 33.07, 154.99 22.66, 161.17 15.55 M136.89 43.47 C145.31 33.79, 153.72 24.11, 161.17 15.55 M141.88 43.83 C145.8 39.33, 149.71 34.82, 160.91 21.95 M141.88 43.83 C148.81 35.86, 155.73 27.9, 160.91 21.95 M147.52 43.44 C151.82 38.5, 156.12 33.55, 161.3 27.59 M147.52 43.44 C152.99 37.15, 158.46 30.86, 161.3 27.59 M153.17 43.04 C155.8 40.01, 158.43 36.99, 160.38 34.74 M153.17 43.04 C154.67 41.31, 156.18 39.58, 160.38 34.74" stroke="#ececf8" stroke-width="0.5" fill="none"></path><path d="M10.88 0 C51.88 0, 92.89 0, 149.81 0 M10.88 0 C51.03 0, 91.19 0, 149.81 0 M149.81 0 C157.06 0, 160.68 3.63, 160.68 10.88 M149.81 0 C157.06 0, 160.68 3.63, 160.68 10.88 M160.68 10.88 C160.68 16.11, 160.68 21.34, 160.68 32.63 M160.68 10.88 C160.68 18.8, 160.68 26.73, 160.68 32.63 M160.68 32.63 C160.68 39.88, 157.06 43.5, 149.81 43.5 M160.68 32.63 C160.68 39.88, 157.06 43.5, 149.81 43.5 M149.81 43.5 C111.28 43.5, 72.75 43.5, 10.88 43.5 M149.81 43.5 C119.53 43.5, 89.26 43.5, 10.88 43.5 M10.88 43.5 C3.63 43.5, 0 39.88, 0 32.63 M10.88 43.5 C3.63 43.5, 0 39.88, 0 32.63 M0 32.63 C0 24.2, 0 15.78, 0 10.88 M0 32.63 C0 27.64, 0 22.65, 0 10.88 M0 10.88 C0 3.63, 3.63 0, 10.88 0 M0 10.88 C0 3.63, 3.63 0, 10.88 0" stroke="#1e1e1e" stroke-width="1" fill="none"></path></g><g transform="translate(377.94985134896683 498.75) rotate(0 59.083332061767635 12.5)"><text x="59.08333206176758" y="17.52" font-family="Virgil, Segoe UI Emoji" font-size="20px" fill="#1e1e1e" text-anchor="middle" style="white-space: pre;" direction="ltr" dominant-baseline="alphabetic">Persistencia</text></g><a href="de.html"><g stroke-linecap="round" transform="translate(10 485.5) rotate(0 88.65833282470703 21.75)"><path d="M10.88 0 C56.91 0, 102.95 0, 166.44 0 C173.69 0, 177.32 3.63, 177.32 10.88 C177.32 16.42, 177.32 21.96, 177.32 32.63 C177.32 39.88, 173.69 43.5, 166.44 43.5 C114.49 43.5, 62.54 43.5, 10.88 43.5 C3.63 43.5, 0 39.88, 0 32.63 C0 27.95, 0 23.27, 0 10.88 C0 3.63, 3.63 0, 10.88 0" stroke="none" stroke-width="0" fill="#ececf8"></path><path d="M10.88 0 C65.01 0, 119.14 0, 166.44 0 M10.88 0 C43.15 0, 75.42 0, 166.44 0 M166.44 0 C173.69 0, 177.32 3.63, 177.32 10.88 M166.44 0 C173.69 0, 177.32 3.63, 177.32 10.88 M177.32 10.88 C177.32 16.72, 177.32 22.57, 177.32 32.63 M177.32 10.88 C177.32 18.07, 177.32 25.26, 177.32 32.63 M177.32 32.63 C177.32 39.88, 173.69 43.5, 166.44 43.5 M177.32 32.63 C177.32 39.88, 173.69 43.5, 166.44 43.5 M166.44 43.5 C109.18 43.5, 51.93 43.5, 10.88 43.5 M166.44 43.5 C125.69 43.5, 84.94 43.5, 10.88 43.5 M10.88 43.5 C3.63 43.5, 0 39.88, 0 32.63 M10.88 43.5 C3.63 43.5, 0 39.88, 0 32.63 M0 32.63 C0 25.48, 0 18.34, 0 10.88 M0 32.63 C0 24.04, 0 15.45, 0 10.88 M0 10.88 C0 3.63, 3.63 0, 10.88 0 M0 10.88 C0 3.63, 3.63 0, 10.88 0" stroke="#6456ff" stroke-width="1" fill="none"></path></g></a><g transform="translate(37.008331298828125 494.75) rotate(0 61.650001525878906 12.5)"><text x="61.650001525878906" y="17.52" font-family="Virgil, Segoe UI Emoji" font-size="20px" fill="#6456ff" text-anchor="middle" style="white-space: pre;" direction="ltr" dominant-baseline="alphabetic">GNOME/KDE</text></g><a href="scp.html"><g stroke-linecap="round" transform="translate(688.540446903463 482.3787743916496) rotate(0 33.19166564941406 21.75)"><path d="M10.88 0 C24.71 0, 38.54 0, 55.51 0 C62.76 0, 66.38 3.63, 66.38 10.88 C66.38 16.02, 66.38 21.17, 66.38 32.63 C66.38 39.88, 62.76 43.5, 55.51 43.5 C43.11 43.5, 30.71 43.5, 10.88 43.5 C3.63 43.5, 0 39.88, 0 32.63 C0 27.6, 0 22.58, 0 10.88 C0 3.63, 3.63 0, 10.88 0" stroke="none" stroke-width="0" fill="#ececf8"></path><path d="M10.88 0 C25.46 0, 40.04 0, 55.51 0 M10.88 0 C28.35 0, 45.83 0, 55.51 0 M55.51 0 C62.76 0, 66.38 3.63, 66.38 10.88 M55.51 0 C62.76 0, 66.38 3.63, 66.38 10.88 M66.38 10.88 C66.38 18.71, 66.38 26.54, 66.38 32.63 M66.38 10.88 C66.38 16.78, 66.38 22.68, 66.38 32.63 M66.38 32.63 C66.38 39.88, 62.76 43.5, 55.51 43.5 M66.38 32.63 C66.38 39.88, 62.76 43.5, 55.51 43.5 M55.51 43.5 C45.53 43.5, 35.55 43.5, 10.88 43.5 M55.51 43.5 C39.12 43.5, 22.73 43.5, 10.88 43.5 M10.88 43.5 C3.63 43.5, 0 39.88, 0 32.63 M10.88 43.5 C3.63 43.5, 0 39.88, 0 32.63 M0 32.63 C0 26.56, 0 20.5, 0 10.88 M0 32.63 C0 27.02, 0 21.42, 0 10.88 M0 10.88 C0 3.63, 3.63 0, 10.88 0 M0 10.88 C0 3.63, 3.63 0, 10.88 0" stroke="#6456ff" stroke-width="1" fill="none"></path></g></a><g transform="translate(702.5987793467003 491.6287743916496) rotate(0 19.133333206176758 12.5)"><text x="19.133333206176758" y="17.52" font-family="Virgil, Segoe UI Emoji" font-size="20px" fill="#6456ff" text-anchor="middle" style="white-space: pre;" direction="ltr" dominant-baseline="alphabetic">SCP</text></g><a href="rsync.html"><g stroke-linecap="round" transform="translate(862.9671383621777 482.3787743916496) rotate(0 42.224998474121094 21.75)"><path d="M10.88 0 C30.71 0, 50.55 0, 73.57 0 C80.82 0, 84.45 3.63, 84.45 10.88 C84.45 17.82, 84.45 24.77, 84.45 32.63 C84.45 39.88, 80.82 43.5, 73.57 43.5 C54.95 43.5, 36.32 43.5, 10.88 43.5 C3.63 43.5, 0 39.88, 0 32.63 C0 24.73, 0 16.84, 0 10.88 C0 3.63, 3.63 0, 10.88 0" stroke="none" stroke-width="0" fill="#ececf8"></path><path d="M10.88 0 C24.61 0, 38.34 0, 73.57 0 M10.88 0 C28.01 0, 45.14 0, 73.57 0 M73.57 0 C80.82 0, 84.45 3.63, 84.45 10.88 M73.57 0 C80.82 0, 84.45 3.63, 84.45 10.88 M84.45 10.88 C84.45 19.2, 84.45 27.53, 84.45 32.63 M84.45 10.88 C84.45 18.8, 84.45 26.72, 84.45 32.63 M84.45 32.63 C84.45 39.88, 80.82 43.5, 73.57 43.5 M84.45 32.63 C84.45 39.88, 80.82 43.5, 73.57 43.5 M73.57 43.5 C53.01 43.5, 32.45 43.5, 10.88 43.5 M73.57 43.5 C50.25 43.5, 26.93 43.5, 10.88 43.5 M10.88 43.5 C3.63 43.5, 0 39.88, 0 32.63 M10.88 43.5 C3.63 43.5, 0 39.88, 0 32.63 M0 32.63 C0 24.53, 0 16.44, 0 10.88 M0 32.63 C0 25.39, 0 18.15, 0 10.88 M0 10.88 C0 3.63, 3.63 0, 10.88 0 M0 10.88 C0 3.63, 3.63 0, 10.88 0" stroke="#6456ff" stroke-width="1" fill="none"></path></g></a><g transform="translate(878.6088028671826 491.6287743916496) rotate(0 26.58333396911621 12.5)"><text x="26.58333396911621" y="17.52" font-family="Virgil, Segoe UI Emoji" font-size="20px" fill="#6456ff" text-anchor="middle" style="white-space: pre;" direction="ltr" dominant-baseline="alphabetic">Rsync</text></g><g mask="url(#mask-TsB-bPR0dRbb-UqxJUO7p)" stroke-linecap="round"><g transform="translate(334.73422059558993 62.25) rotate(0 81.76420277120002 50.75)"><path d="M0 0 C27.25 16.92, 136.27 84.58, 163.53 101.5 M0 0 C27.25 16.92, 136.27 84.58, 163.53 101.5" stroke="#1e1e1e" stroke-width="1" fill="none"></path></g><g transform="translate(334.73422059558993 62.25) rotate(0 81.76420277120002 50.75)"><path d="M139.06 96.38 C144.4 97.49, 149.74 98.61, 163.53 101.5 M139.06 96.38 C147.82 98.21, 156.58 100.05, 163.53 101.5" stroke="#1e1e1e" stroke-width="1" fill="none"></path></g><g transform="translate(334.73422059558993 62.25) rotate(0 81.76420277120002 50.75)"><path d="M148.08 81.85 C151.45 86.14, 154.82 90.42, 163.53 101.5 M148.08 81.85 C153.61 88.88, 159.14 95.92, 163.53 101.5" stroke="#1e1e1e" stroke-width="1" fill="none"></path></g></g><mask id="mask-TsB-bPR0dRbb-UqxJUO7p"><rect x="0" y="0" fill="#fff" width="598.26262613799" height="263.75"></rect><rect x="392.36509016061325" y="100.5" fill="#000" width="48.266666412353516" height="25" opacity="1"></rect></mask><g transform="translate(392.36509016061336 100.5) rotate(0 24.1333332061767 12.5)"><text x="24.133333206176758" y="17.52" font-family="Virgil, Segoe UI Emoji" font-size="20px" fill="#1e1e1e" text-anchor="middle" style="white-space: pre;" direction="ltr" dominant-baseline="alphabetic">Linux</text></g><g mask="url(#mask-InzxzS0tJfKtqXuQ2EVOl)" stroke-linecap="round"><g transform="translate(269.8905049573723 66.17054199612178) rotate(0 -42.457262473887056 43.97635297981944)"><path d="M0 0 C-14.15 14.66, -70.76 73.29, -84.91 87.95 M0 0 C-14.15 14.66, -70.76 73.29, -84.91 87.95" stroke="#1e1e1e" stroke-width="1" fill="none"></path></g><g transform="translate(269.8905049573723 66.17054199612178) rotate(0 -42.457262473887056 43.97635297981944)"><path d="M-74.75 65.11 C-78.14 72.72, -81.52 80.33, -84.91 87.95 M-74.75 65.11 C-77.45 71.19, -80.16 77.27, -84.91 87.95" stroke="#1e1e1e" stroke-width="1" fill="none"></path></g><g transform="translate(269.8905049573723 66.17054199612178) rotate(0 -42.457262473887056 43.97635297981944)"><path d="M-62.45 76.99 C-69.93 80.64, -77.42 84.3, -84.91 87.95 M-62.45 76.99 C-68.42 79.91, -74.4 82.82, -84.91 87.95" stroke="#1e1e1e" stroke-width="1" fill="none"></path></g></g><mask id="mask-InzxzS0tJfKtqXuQ2EVOl"><rect x="0" y="0" fill="#fff" width="454.8050299051464" height="254.12324795576066"></rect><rect x="190.38324324642474" y="97.64689497594122" fill="#000" width="74.0999984741211" height="25" opacity="1"></rect></mask><g transform="translate(190.38324324642474 97.64689497594122) rotate(0 37.04999923706049 12.5)"><text x="37.04999923706055" y="17.52" font-family="Virgil, Segoe UI Emoji" font-size="20px" fill="#1e1e1e" text-anchor="middle" style="white-space: pre;" direction="ltr" dominant-baseline="alphabetic">Windows</text></g><g mask="url(#mask-lIJWZntX9FoZdmf8SHzOw)" stroke-linecap="round"><g transform="translate(520.0045112264364 222.75000000000006) rotate(0 -90.46386932898281 48.24999999999997)"><path d="M0 0 C-30.15 16.08, -150.77 80.42, -180.93 96.5 M0 0 C-30.15 16.08, -150.77 80.42, -180.93 96.5" stroke="#1e1e1e" stroke-width="1" fill="none"></path></g><g transform="translate(520.0045112264364 222.75000000000006) rotate(0 -90.46386932898281 48.24999999999997)"><path d="M-164.22 77.9 C-169.19 83.43, -174.16 88.96, -180.93 96.5 M-164.22 77.9 C-168.77 82.96, -173.32 88.03, -180.93 96.5" stroke="#1e1e1e" stroke-width="1" fill="none"></path></g><g transform="translate(520.0045112264364 222.75000000000006) rotate(0 -90.46386932898281 48.24999999999997)"><path d="M-156.18 92.99 C-163.54 94.03, -170.9 95.08, -180.93 96.5 M-156.18 92.99 C-162.91 93.94, -169.65 94.9, -180.93 96.5" stroke="#1e1e1e" stroke-width="1" fill="none"></path></g></g><mask id="mask-lIJWZntX9FoZdmf8SHzOw"><rect x="0" y="0" fill="#fff" width="800.932249884402" height="419.25"></rect><rect x="348.0906449492113" y="258.49999999999994" fill="#000" width="162.89999389648438" height="25" opacity="1"></rect></mask><g transform="translate(348.0906449492114 258.5) rotate(0 81.44999694824219 12.500000000000028)"><text x="81.44999694824219" y="17.52" font-family="Virgil, Segoe UI Emoji" font-size="20px" fill="#1e1e1e" text-anchor="middle" style="white-space: pre;" direction="ltr" dominant-baseline="alphabetic">Interfaz gráfica</text></g><g mask="url(#mask-utyZb8e_Ice0P_EHfRHOG)" stroke-linecap="round"><g transform="translate(641.5799978401486 225.75) rotate(0 53.32357167675423 40.68938719582479)"><path d="M0 0 C17.77 13.56, 88.87 67.82, 106.65 81.38 M0 0 C17.77 13.56, 88.87 67.82, 106.65 81.38" stroke="#1e1e1e" stroke-width="1" fill="none"></path></g><g transform="translate(641.5799978401486 225.75) rotate(0 53.32357167675423 40.68938719582479)"><path d="M82.78 73.93 C91.82 76.75, 100.85 79.57, 106.65 81.38 M82.78 73.93 C91.06 76.51, 99.34 79.1, 106.65 81.38" stroke="#1e1e1e" stroke-width="1" fill="none"></path></g><g transform="translate(641.5799978401486 225.75) rotate(0 53.32357167675423 40.68938719582479)"><path d="M93.16 60.33 C98.26 68.3, 103.37 76.26, 106.65 81.38 M93.16 60.33 C97.84 67.63, 102.52 74.94, 106.65 81.38" stroke="#1e1e1e" stroke-width="1" fill="none"></path></g></g><mask id="mask-utyZb8e_Ice0P_EHfRHOG"><rect x="0" y="0" fill="#fff" width="848.2271411936571" height="407.1287743916496"></rect><rect x="654.6202366921957" y="253.9393871958248" fill="#000" width="80.56666564941406" height="25" opacity="1"></rect></mask><g transform="translate(654.6202366921957 253.9393871958248) rotate(0 40.28333282470703 12.5)"><text x="40.28333282470703" y="17.52" font-family="Virgil, Segoe UI Emoji" font-size="20px" fill="#1e1e1e" text-anchor="middle" style="white-space: pre;" direction="ltr" dominant-baseline="alphabetic">Terminal</text></g><g mask="url(#mask-6MVtgQ_zrewQ_Pxdx-aaw)" stroke-linecap="round"><g transform="translate(839.3513509483877 374.1287743916496) rotate(0 27.495418101171595 49.25)"><path d="M0 0 C9.17 16.42, 45.83 82.08, 54.99 98.5 M0 0 C9.17 16.42, 45.83 82.08, 54.99 98.5" stroke="#1e1e1e" stroke-width="1" fill="none"></path></g><g transform="translate(839.3513509483877 374.1287743916496) rotate(0 27.495418101171595 49.25)"><path d="M36.07 82.16 C41.51 86.85, 46.95 91.55, 54.99 98.5 M36.07 82.16 C41.69 87.01, 47.32 91.87, 54.99 98.5" stroke="#1e1e1e" stroke-width="1" fill="none"></path></g><g transform="translate(839.3513509483877 374.1287743916496) rotate(0 27.495418101171595 49.25)"><path d="M51.01 73.82 C52.15 80.91, 53.3 88, 54.99 98.5 M51.01 73.82 C52.19 81.15, 53.37 88.49, 54.99 98.5" stroke="#1e1e1e" stroke-width="1" fill="none"></path></g></g><mask id="mask-6MVtgQ_zrewQ_Pxdx-aaw"><rect x="0" y="0" fill="#fff" width="994.3421871507309" height="572.6287743916496"></rect><rect x="820.113435461913" y="410.8787743916496" fill="#000" width="93.46666717529297" height="25" opacity="1"></rect></mask><g transform="translate(820.113435461913 410.8787743916496) rotate(0 46.73333358764637 12.5)"><text x="46.733333587646484" y="17.52" font-family="Virgil, Segoe UI Emoji" font-size="20px" fill="#1e1e1e" text-anchor="middle" style="white-space: pre;" direction="ltr" dominant-baseline="alphabetic">Avanzado</text></g><g mask="url(#mask-Se_TiJTusySRDcdTKl4-t)" stroke-linecap="round"><g transform="translate(783.3759981503548 376.12877439164964) rotate(0 -23.897968475082735 46.74999999999997)"><path d="M0 0 C-7.97 15.58, -39.83 77.92, -47.8 93.5 M0 0 C-7.97 15.58, -39.83 77.92, -47.8 93.5" stroke="#1e1e1e" stroke-width="1" fill="none"></path></g><g transform="translate(783.3759981503548 376.12877439164964) rotate(0 -23.897968475082735 46.74999999999997)"><path d="M-44.72 68.69 C-45.91 78.32, -47.11 87.95, -47.8 93.5 M-44.72 68.69 C-45.35 73.81, -45.99 78.93, -47.8 93.5" stroke="#1e1e1e" stroke-width="1" fill="none"></path></g><g transform="translate(783.3759981503548 376.12877439164964) rotate(0 -23.897968475082735 46.74999999999997)"><path d="M-29.49 76.47 C-36.59 83.08, -43.7 89.69, -47.8 93.5 M-29.49 76.47 C-33.27 79.99, -37.05 83.5, -47.8 93.5" stroke="#1e1e1e" stroke-width="1" fill="none"></path></g></g><mask id="mask-Se_TiJTusySRDcdTKl4-t"><rect x="0" y="0" fill="#fff" width="931.1719351005203" height="569.6287743916496"></rect><rect x="731.8446964690952" y="410.37877439164953" fill="#000" width="55.266666412353516" height="25" opacity="1"></rect></mask><g transform="translate(731.8446964690954 410.3787743916496) rotate(0 27.633333206176758 12.500000000000028)"><text x="27.633333206176758" y="17.52" font-family="Virgil, Segoe UI Emoji" font-size="20px" fill="#1e1e1e" text-anchor="middle" style="white-space: pre;" direction="ltr" dominant-baseline="alphabetic">Simple</text></g><g mask="url(#mask-ODfW3ZSK6jhm_BsUzKOzx)" stroke-linecap="round"><g transform="translate(351.63048288501716 382.2500000000001) rotate(0 40.29240773247909 47.24999999999994)"><path d="M0 0 C13.43 15.75, 67.15 78.75, 80.58 94.5 M0 0 C13.43 15.75, 67.15 78.75, 80.58 94.5" stroke="#1e1e1e" stroke-width="1" fill="none"></path></g><g transform="translate(351.63048288501716 382.2500000000001) rotate(0 40.29240773247909 47.24999999999994)"><path d="M58.84 82.17 C63.33 84.72, 67.82 87.27, 80.58 94.5 M58.84 82.17 C67.01 86.81, 75.18 91.44, 80.58 94.5" stroke="#1e1e1e" stroke-width="1" fill="none"></path></g><g transform="translate(351.63048288501716 382.2500000000001) rotate(0 40.29240773247909 47.24999999999994)"><path d="M71.85 71.08 C73.65 75.92, 75.46 80.75, 80.58 94.5 M71.85 71.08 C75.13 79.88, 78.41 88.68, 80.58 94.5" stroke="#1e1e1e" stroke-width="1" fill="none"></path></g></g><mask id="mask-ODfW3ZSK6jhm_BsUzKOzx"><rect x="0" y="0" fill="#fff" width="532.2152983499753" height="576.75"></rect><rect x="351.6395577927892" y="417.0000000000001" fill="#000" width="80.56666564941406" height="25" opacity="1"></rect></mask><g transform="translate(351.6395577927892 417) rotate(0 40.28333282470703 12.5)"><text x="40.28333282470703" y="17.52" font-family="Virgil, Segoe UI Emoji" font-size="20px" fill="#1e1e1e" text-anchor="middle" style="white-space: pre;" direction="ltr" dominant-baseline="alphabetic">Terminal</text></g><g mask="url(#mask-hzRojMgGlaxcSznt1Gh4w)" stroke-linecap="round"><g transform="translate(225.95202792698421 383.25) rotate(0 -32.40540911505627 46.25)"><path d="M0 0 C-10.8 15.42, -54.01 77.08, -64.81 92.5 M0 0 C-10.8 15.42, -54.01 77.08, -64.81 92.5" stroke="#1e1e1e" stroke-width="1" fill="none"></path></g><g transform="translate(225.95202792698421 383.25) rotate(0 -32.40540911505627 46.25)"><path d="M-58.33 68.35 C-59.89 74.16, -61.45 79.97, -64.81 92.5 M-58.33 68.35 C-60.69 77.16, -63.06 85.96, -64.81 92.5" stroke="#1e1e1e" stroke-width="1" fill="none"></path></g><g transform="translate(225.95202792698421 383.25) rotate(0 -32.40540911505627 46.25)"><path d="M-44.33 78.17 C-49.26 81.62, -54.18 85.06, -64.81 92.5 M-44.33 78.17 C-51.8 83.39, -59.26 88.62, -64.81 92.5" stroke="#1e1e1e" stroke-width="1" fill="none"></path></g></g><mask id="mask-hzRojMgGlaxcSznt1Gh4w"><rect x="0" y="0" fill="#fff" width="390.76284615709676" height="575.75"></rect><rect x="112.09662186368575" y="417" fill="#000" width="162.89999389648438" height="25" opacity="1"></rect></mask><g transform="translate(112.09662186368575 417) rotate(0 81.44999694824219 12.5)"><text x="81.44999694824219" y="17.52" font-family="Virgil, Segoe UI Emoji" font-size="20px" fill="#1e1e1e" text-anchor="middle" style="white-space: pre;" direction="ltr" dominant-baseline="alphabetic">Interfaz gráfica</text></g><g mask="url(#mask-b88HqxuYvMtwNJNbJu341)" stroke-linecap="round"><g transform="translate(414.90994958753106 541.75) rotate(0 -41.83972216824043 47.25)"><path d="M0 0 C-13.95 15.75, -69.73 78.75, -83.68 94.5 M0 0 C-13.95 15.75, -69.73 78.75, -83.68 94.5" stroke="#1e1e1e" stroke-width="1" fill="none"></path></g><g transform="translate(414.90994958753106 541.75) rotate(0 -41.83972216824043 47.25)"><path d="M-74.51 71.24 C-76.97 77.49, -79.44 83.74, -83.68 94.5 M-74.51 71.24 C-77.54 78.93, -80.57 86.62, -83.68 94.5" stroke="#1e1e1e" stroke-width="1" fill="none"></path></g><g transform="translate(414.90994958753106 541.75) rotate(0 -41.83972216824043 47.25)"><path d="M-61.7 82.58 C-67.61 85.78, -73.52 88.99, -83.68 94.5 M-61.7 82.58 C-68.97 86.52, -76.24 90.46, -83.68 94.5" stroke="#1e1e1e" stroke-width="1" fill="none"></path></g></g><mask id="mask-b88HqxuYvMtwNJNbJu341"><rect x="0" y="0" fill="#fff" width="598.5893939240119" height="736.25"></rect><rect x="329.1702258934117" y="576.5" fill="#000" width="87.80000305175781" height="25" opacity="1"></rect></mask><g transform="translate(329.1702258934117 576.5) rotate(0 43.900001525878906 12.5)"><text x="43.900001525878906" y="17.52" font-family="Virgil, Segoe UI Emoji" font-size="20px" fill="#1e1e1e" text-anchor="middle" style="white-space: pre;" direction="ltr" dominant-baseline="alphabetic">Temporal</text></g><g mask="url(#mask-IJ-zpuZup75TrjfMyMX7E)" stroke-linecap="round"><g transform="translate(454.79427213313477 543.75) rotate(0 41.79644411491438 48.75)"><path d="M0 0 C13.93 16.25, 69.66 81.25, 83.59 97.5 M0 0 C13.93 16.25, 69.66 81.25, 83.59 97.5" stroke="#1e1e1e" stroke-width="1" fill="none"></path></g><g transform="translate(454.79427213313477 543.75) rotate(0 41.79644411491438 48.75)"><path d="M61.81 85.23 C69.65 89.65, 77.49 94.06, 83.59 97.5 M61.81 85.23 C67.72 88.56, 73.64 91.89, 83.59 97.5" stroke="#1e1e1e" stroke-width="1" fill="none"></path></g><g transform="translate(454.79427213313477 543.75) rotate(0 41.79644411491438 48.75)"><path d="M74.79 74.1 C77.96 82.52, 81.13 90.95, 83.59 97.5 M74.79 74.1 C77.18 80.45, 79.57 86.8, 83.59 97.5" stroke="#1e1e1e" stroke-width="1" fill="none"></path></g></g><mask id="mask-IJ-zpuZup75TrjfMyMX7E"><rect x="0" y="0" fill="#fff" width="638.3871603629635" height="741.25"></rect><rect x="441.2907170109886" y="580" fill="#000" width="110.5999984741211" height="25" opacity="1"></rect></mask><g transform="translate(441.2907170109886 580) rotate(0 55.29999923706043 12.5)"><text x="55.29999923706055" y="17.52" font-family="Virgil, Segoe UI Emoji" font-size="20px" fill="#1e1e1e" text-anchor="middle" style="white-space: pre;" direction="ltr" dominant-baseline="alphabetic">Permanente</text></g></svg>