<svg id="coso" version="1.1" viewBox="0 0 395.68 181.02" xmlns="http://www.w3.org/2000/svg">
 <defs>
  <style>.cls-5 {
        stroke-width: 0px;
      }</style>
 </defs>
 <g fill="#f7f7fc">
  <rect class="cls-5" x="62.81" y="17.01" width="6.37" height="12.99" rx=".61" ry=".61"/>
  <rect class="cls-5" transform="rotate(-76.88)" x="-12.95" y="78.17" width="9.76" height="6.37" rx=".61" ry=".61"/>
  <rect class="cls-5" transform="rotate(-64.3)" x="6.0568" y="89.127" width="6.37" height="6.37" rx=".61" ry=".61"/>
  <rect class="cls-5" transform="rotate(-13.13)" x="44.043" y="33.174" width="6.37" height="9.76" rx=".61" ry=".61"/>
  <rect class="cls-5" transform="rotate(-25.69)" x="23.492" y="44.822" width="6.37" height="6.37" rx=".61" ry=".61"/>
  <path class="cls-5" d="m66 55.82c-14.71 0-26.23 18.56-26.23 42.24s11.52 42.25 26.23 42.25 26.22-18.56 26.22-42.25-11.52-42.24-26.22-42.24zm0 6.37c9.24 0 17.25 12.11 19.33 27.84l-30.58-20.25c-0.29-0.19-0.36-0.6-0.15-0.88 3.25-4.21 7.2-6.72 11.4-6.72zm-14.44 13.12 29.71 19.67h-34.41c-0.35 0-0.63-0.3-0.61-0.65 0.42-7.01 2.02-13.5 4.41-18.78 0.15-0.34 0.58-0.46 0.89-0.25zm14.44 58.63c-10.03 0-18.61-14.26-19.73-31.94-0.02-0.35 0.26-0.65 0.61-0.65h38.24c0.35 0 0.63 0.3 0.61 0.65-1.12 17.68-9.7 31.94-19.73 31.94z"/>
  <path class="cls-5" d="m105.87 86.09c-5.63 0-10.21-4.58-10.21-10.21 0-0.48 0-1.15 0.17-1.82l3.86-17.54s0.1-0.4 0.1-0.86c0-2.12-1.72-3.84-3.84-3.84-0.41 0-0.81 0.06-1.2 0.19-0.28 0.09-0.59-0.03-0.72-0.3l-2.27-4.68c-0.15-0.31 0-0.68 0.32-0.81 1.23-0.5 2.52-0.76 3.87-0.76 5.63 0 10.21 4.58 10.21 10.21 0 1.16-0.21 2.11-0.3 2.45l-3.82 17.38v0.14c-0.03 2.22 1.75 4.15 3.97 4.08 0.32-0.01 0.64-0.06 0.95-0.15 0.29-0.08 0.6 0.06 0.72 0.33l2.11 4.73c0.15 0.33-0.02 0.7-0.36 0.82-1.13 0.42-2.32 0.63-3.55 0.63z"/>
  <path class="cls-5" d="m26.38 86.11c-1.24 0-2.45-0.22-3.59-0.65-0.31-0.12-0.45-0.49-0.32-0.79l2.12-4.75c0.12-0.27 0.43-0.41 0.71-0.33 0.31 0.09 0.62 0.14 0.95 0.15 2.22 0.07 4-1.86 3.97-4.08v-0.17l-3.82-17.36c-0.09-0.34-0.3-1.29-0.3-2.45 0-5.63 4.58-10.21 10.21-10.21 1.34 0 2.64 0.25 3.87 0.76 0.32 0.13 0.47 0.5 0.32 0.82l-2.27 4.68c-0.13 0.27-0.44 0.39-0.72 0.3-0.38-0.13-0.78-0.19-1.2-0.19-2.12 0-3.84 1.72-3.84 3.84 0 0.48 0.1 0.89 0.1 0.89l0.03 0.13 3.82 17.38c0.17 0.67 0.17 1.33 0.17 1.82 0 5.63-4.58 10.21-10.21 10.21z"/>
  <path class="cls-5" d="m85.84 42.28c0.14-0.29 0.03-0.64-0.25-0.8-4.28-2.29-11.04-4.94-19.47-4.94h-0.47c-8.04 0.1-14.5 2.51-18.98 4.93-0.29 0.15-0.39 0.51-0.25 0.8l2.25 4.65c0.15 0.31 0.53 0.43 0.84 0.27 3.79-2.08 9.32-4.19 16.22-4.27h0.4c7.25 0 13.05 2.32 16.65 4.28 0.3 0.16 0.68 0.04 0.83-0.27l2.24-4.64z"/>
  <path class="cls-5" d="m117.97 117.22c-0.15-0.97-0.64-3.55-2.01-6.48-1.23-2.62-2.48-4.04-3.39-5.08-0.77-0.87-1.12-1.27-1.36-2.18-0.42-1.52-0.38-3.95 1.12-5.82 0.7-0.87 1.56-1.43 2.36-1.77 0.31-0.14 0.46-0.5 0.31-0.81l-2.24-4.66c-0.14-0.3-0.5-0.42-0.8-0.28-1.54 0.7-3.21 1.8-4.6 3.54-2.99 3.74-3.14 8.39-2.29 11.49 0.64 2.32 1.74 3.58 2.72 4.69 0.8 0.91 1.56 1.78 2.41 3.58 1.05 2.23 1.4 4.18 1.48 4.72 0.78 5.19-1.43 9.35-1.88 10.13-2.05 3.55-4.97 5.28-6.54 6.21-1.94 1.15-3.24 1.49-4.9 1.92-1.55 0.4-3.3 0.86-5.7 1.97-3.63 1.68-7.01 4.07-10.05 7.12l-0.17 0.19c-1.89 2.23-4.17 4.02-6.76 5.33-1.64 0.83-5.06 2.23-9.55 2.32-4.49-0.09-7.9-1.49-9.55-2.32-2.59-1.31-4.87-3.1-6.76-5.33l-0.17-0.19c-3.04-3.04-6.42-5.44-10.05-7.12-2.4-1.11-4.15-1.57-5.7-1.97-1.65-0.43-2.96-0.78-4.9-1.92-1.57-0.93-4.49-2.66-6.54-6.21-0.45-0.78-2.66-4.94-1.88-10.13 0.08-0.54 0.43-2.48 1.48-4.72 0.85-1.81 1.61-2.67 2.41-3.58 0.98-1.11 2.08-2.37 2.72-4.69 0.86-3.1 0.7-7.75-2.29-11.49-1.34-1.67-2.92-2.75-4.4-3.45-0.3-0.14-0.66-0.02-0.8 0.28l-2.24 4.65c-0.15 0.3-0.01 0.66 0.29 0.8 0.75 0.35 1.53 0.88 2.18 1.69 1.49 1.87 1.54 4.3 1.12 5.82-0.25 0.91-0.6 1.3-1.37 2.18-0.91 1.04-2.16 2.46-3.39 5.08-1.38 2.93-1.87 5.51-2.01 6.48-1.07 7.1 1.77 12.71 2.66 14.26 2.88 5 7.04 7.46 8.81 8.51 2.71 1.6 4.65 2.11 6.53 2.6 1.41 0.37 2.75 0.72 4.64 1.59 2.9 1.34 5.63 3.27 8.11 5.73l0.03 0.03c2.43 2.82 5.33 5.1 8.64 6.77 2.13 1.08 6.58 2.9 12.36 3h0.12c5.78-0.1 10.22-1.92 12.36-3 3.31-1.67 6.22-3.95 8.64-6.77l0.03-0.03c2.48-2.46 5.21-4.39 8.11-5.73 1.89-0.87 3.22-1.22 4.64-1.59 1.88-0.49 3.82-1 6.53-2.6 1.77-1.05 5.93-3.51 8.81-8.51 0.89-1.55 3.73-7.16 2.66-14.26z"/>
  <path d="m157.57 120.99c3.5613 0 5.8884-1.7277 5.8884-5.0774 0-3.4555-2.9266-4.3722-5.3243-5.1127-1.763-0.59942-3.3144-1.1283-3.3144-2.5035 0-1.4104 1.1283-2.0451 2.8208-2.0451 1.8688 0 3.667 0.49364 5.0422 1.1988 0.0353-1.0931 0.0353-2.3977 0.0353-3.4555-1.1988-0.56416-2.8561-0.95202-4.8306-0.95202-3.3144 0-6.0647 1.8688-6.0647 5.6063 0 3.5613 3.0324 4.5838 5.4653 5.43 1.6925 0.59942 3.1381 1.1283 3.1381 2.3624 0 1.2694-1.0225 1.9393-2.6445 1.9393-2.0451 0-3.8433-0.63468-5.6063-1.7277v3.1381c1.4457 0.7052 3.2792 1.1988 5.3948 1.1988z"/>
  <path d="m174.32 120.99c2.9971 0 4.7248-1.3046 5.0422-3.667-0.91676 0.63468-2.1156 0.98728-3.7023 0.98728-2.1509 0-3.2087-1.0931-3.2087-3.2087v-11.988l-4.3017 0.77572c0.5289 1.1636 0.77572 2.2214 0.77572 3.5613v8.3214c0 3.5965 2.1509 5.2185 5.3948 5.2185zm8.3566 0c1.1636 0 2.0803-0.24682 2.6445-0.56416v-2.2566c-0.31734 0.10578-0.7052 0.14104-1.1283 0.14104-0.8815 0-1.4104-0.49364-1.4104-1.4457 0-1.6572 0.0353-3.526 0.10578-5.5711 0.0705-2.6445 0.14104-5.6416 0.14104-8.1803l-4.4075 0.77572c0.5289 1.0931 0.77572 2.2919 0.77572 3.7023v5.7826c0 1.3751-0.0353 2.7855-0.0353 4.0902 0 2.2214 1.2694 3.526 3.3144 3.526z"/>
  <path d="m189.97 128.47h4.478c-0.31734-0.74046-0.5289-1.622-0.5289-2.9618v-5.289c1.0578 0.49364 2.2566 0.77572 3.8433 0.77572 4.5838 0 7.8982-3.667 7.8982-9.3086 0-5.6063-2.8208-8.6387-6.9462-8.6387-2.6092 0-4.2665 1.3399-4.7954 3.7728 0.81098-0.42312 1.763-0.66994 3.0676-0.66994 3.2792 0 5.1127 2.1509 5.1127 6.1705 0 3.8786-1.904 5.9942-4.8659 5.9942-1.3399 0-2.3272-0.14104-3.3144-0.49364v-14.844l-4.6543 1.5514c0.74046 1.2341 1.1283 2.5035 1.1283 3.7728v17.207c0 1.3399-0.1763 2.2214-0.42312 2.9618z"/>
  <path d="m217.86 120.99c2.3977 0 4.2665-0.45838 5.6769-1.1283v-2.715c-1.3751 0.5289-2.9971 0.98728-5.0069 0.98728-3.8786 0-5.8884-2.1509-5.8884-4.9717v-0.59942h11.318c0.0353-0.45838 0.0353-0.8815 0.0353-1.3046 0-5.4653-2.2919-8.2156-6.8052-8.2156-4.8306 0-7.9335 3.7376-7.9335 9.3086 0 5.6063 3.1029 8.6387 8.6034 8.6387zm-5.0774-10.79c0.31734-2.5035 1.622-4.1254 4.1254-4.1254 2.4682 0 3.5965 1.5867 3.667 4.1254z"/>
  <path d="m228.61 120.71h4.1959c-0.21156-0.81098-0.38786-1.6925-0.38786-2.9618v-14.774l-4.1254 0.81098c0.5289 1.1988 0.66994 2.2566 0.66994 3.5613v10.402c0 1.2694-0.10578 2.1509-0.3526 2.9618zm10.049-13.822 0.0705-3.7728c-0.63468-0.0353-1.3046-0.0353-1.8688 0.0705-2.3977 0.21156-3.9491 1.5162-4.4428 4.0902 1.0578-0.49364 2.2566-0.7052 3.385-0.7052 0.98728 0 1.9746 0.14104 2.8561 0.31734z"/>
  <path d="m248.74 120.99c1.8335 0 3.3497-0.28208 4.6896-0.7052v-2.715c-1.1988 0.42312-2.4682 0.74046-3.9844 0.74046-3.385 0-5.7121-2.0803-5.7121-6.0647 0-3.5613 1.8335-5.9237 5.148-5.9237 1.8335 0 3.2792 0.45838 4.6543 1.0578v-3.4202c-1.1988-0.49364-2.8561-0.91676-5.0069-0.91676-4.6543 0-8.1451 3.6318-8.1451 9.1323 0 5.7826 3.4907 8.815 8.3566 8.815z"/>
  <path d="m261.97 100.61h2.7503l5.0422-5.6063h-4.6544zm2.0803 20.38c4.8659 0 7.9335-3.5965 7.9335-8.9208 0-5.5711-2.9971-9.0266-7.9688-9.0266-4.7601 0-8.004 3.7728-8.004 9.2029s3.2439 8.7445 8.0393 8.7445zm0.10578-2.7855c-2.8208 0-4.5838-2.3977-4.5838-5.9942s1.5162-5.8884 4.4428-5.8884c2.8561 0 4.4075 2.5035 4.4075 6.241 0 3.4555-1.5514 5.6416-4.2665 5.6416z"/>
  <path d="m297.48 120.71h4.0549c-0.21156-0.84624-0.31734-1.7277-0.31734-2.9618v-9.4144c0-3.2792-1.904-5.289-5.1832-5.289-2.8208 0-4.6543 1.2341-5.3243 3.8786-0.45838-2.4329-2.2566-3.8786-5.0422-3.8786-2.8208 0-4.6896 1.2341-5.3243 3.9139 1.1636-0.45838 2.3977-0.7052 3.7376-0.7052 2.1861 0 3.2792 0.95202 3.2792 3.0676v8.4271c0 1.2341-0.10578 2.1156-0.24682 2.9618h4.0549c-0.21156-0.84624-0.31734-1.7277-0.31734-2.9618v-9.4144c0-0.49364-0.0353-0.95202-0.14104-1.3751 1.1636-0.45838 2.3977-0.7052 3.7376-0.7052 2.1861 0 3.2792 0.95202 3.2792 3.0676v8.4271c0 1.2341-0.10578 2.1156-0.24682 2.9618zm-21.191-16.854c0.38786 1.3046 0.5289 2.4329 0.5289 3.8081v10.084c0 1.2341-0.0705 2.1156-0.31734 2.9618h4.1607c-0.1763-0.84624-0.31734-1.7277-0.31734-2.9618v-14.633z"/>
  <path d="m307.67 128.47h4.478c-0.31734-0.74046-0.5289-1.622-0.5289-2.9618v-5.289c1.0578 0.49364 2.2566 0.77572 3.8433 0.77572 4.5838 0 7.8982-3.667 7.8982-9.3086 0-5.6063-2.8208-8.6387-6.9462-8.6387-2.6092 0-4.2665 1.3399-4.7954 3.7728 0.81098-0.42312 1.763-0.66994 3.0676-0.66994 3.2792 0 5.1127 2.1509 5.1127 6.1705 0 3.8786-1.904 5.9942-4.8659 5.9942-1.3399 0-2.3272-0.14104-3.3144-0.49364v-14.844l-4.6543 1.5514c0.74046 1.2341 1.1283 2.5035 1.1283 3.7728v17.207c0 1.3399-0.1763 2.2214-0.42312 2.9618z"/>
  <path d="m333.97 120.99c2.9971 0 4.7248-1.3046 5.0422-3.667-0.91676 0.63468-2.1156 0.98728-3.7023 0.98728-2.1509 0-3.2087-1.0931-3.2087-3.2087v-11.988l-4.3017 0.77572c0.5289 1.1636 0.77572 2.2214 0.77572 3.5613v8.3214c0 3.5965 2.1509 5.2185 5.3948 5.2185zm8.3566 0c1.1636 0 2.0803-0.24682 2.6445-0.56416v-2.2566c-0.31734 0.10578-0.7052 0.14104-1.1283 0.14104-0.8815 0-1.4104-0.49364-1.4104-1.4457 0-1.6572 0.0353-3.526 0.10578-5.5711 0.0705-2.6445 0.14104-5.6416 0.14104-8.1803l-4.4075 0.77572c0.5289 1.0931 0.77572 2.2919 0.77572 3.7023v5.7826c0 1.3751-0.0353 2.7855-0.0353 4.0902 0 2.2214 1.2694 3.526 3.3144 3.526z"/>
  <path d="m355.4 120.99c1.622 0 3.1381-0.28208 4.2312-0.63468v-2.6445c-1.0225 0.24682-2.1861 0.49364-3.4907 0.49364-1.7277 0-2.6092-0.91676-2.6092-2.574v-8.9913h5.9942l0.1763-3.0676h-6.1352v-3.667l-6.3115 6.7347h2.7855l-0.0705 9.2029c-0.0353 3.526 1.9393 5.148 5.43 5.148z"/>
  <path d="m369.9 120.99c4.8659 0 7.9335-3.5965 7.9335-8.9208 0-5.5711-2.9971-9.0266-7.9688-9.0266-4.7601 0-8.004 3.7728-8.004 9.2029s3.2439 8.7445 8.0393 8.7445zm0.10578-2.7855c-2.8208 0-4.5838-2.3977-4.5838-5.9942s1.5162-5.8884 4.4428-5.8884c2.8561 0 4.4075 2.5035 4.4075 6.241 0 3.4555-1.5514 5.6416-4.2665 5.6416z"/>
  <path class="cls-5" d="m173.37 75.08v3.95c-0.98 0.42-2.46 0.74-4.27 0.74-3.11 0-5.06-1.67-5.25-4.97-0.37 3.16-2.56 4.97-6.32 4.97-4.27 0-6.97-2.23-6.97-6.6v-11.47c0-1.81-0.37-3.16-1.16-4.37l7.62-1.39v15.93c0 2.09 1.12 3.34 3.07 3.34 1.58 0 2.74-0.28 3.76-0.74v-0.19c0-1.49 0.09-3.16 0.09-4.79v-7.76c0-1.86-0.46-3.3-1.21-4.41l7.9-1.39c-0.05 3.25-0.28 7.85-0.33 11.38-0.05 2.42-0.09 4.41-0.09 6.04 0 1.21 0.79 1.86 1.81 1.86 0.46 0 0.98-0.05 1.35-0.14z"/>
  <path class="cls-5" d="m179 75.66v-13.19c0-1.86-0.14-3.34-0.51-5.11l6.92-1.21v19.51c0 1.58 0.14 2.79 0.37 3.95h-7.25c0.33-1.16 0.46-2.37 0.46-3.95zm13.51 0v-11.01c0-2.14-1.25-3.02-3.3-3.02-1.49 0-2.56 0.09-3.81 0.37 0.7-3.95 3.11-5.9 7.06-5.9s6.41 2.6 6.41 6.88v12.68c0 1.58 0.19 2.79 0.51 3.95h-7.2c0.23-1.16 0.33-2.37 0.33-3.95z"/>
  <path class="cls-5" d="m205 67.93c0-7.29 4.79-12.03 10.82-12.03 2.83 0 5.2 0.46 6.88 1.11v5.62c-1.72-0.6-3.58-1.07-5.76-1.07-3.9 0-5.85 2.69-5.85 6.83 0 4.41 2.6 6.78 6.41 6.78 1.86 0 3.62-0.42 5.11-0.88v4.55c-1.9 0.6-4.04 0.93-6.55 0.93-6.5 0-11.06-3.9-11.06-11.85z"/>
 </g>
</svg>
