{
  "y1b1": "yellow belt",
  "y1b2": "orange belt",
  "y1b3": "green belt",
  "y1b4": "blue belt",
  "y1b5": "brown belt",
  "y1b6": "red belt",
  "y1b7": "black belt",
  "y1b8": "undefined",
  "y2b1": "yellow belt",
  "y2b2": "orange belt",
  "y2b3": "green belt",
  "y2b4": "blue belt",
  "y2b5": "brown belt",
  "y2b6": "black belt",
  "y2b7": "undefined",
  "y2b8": "undefined"
}

