%YAML 1.1
%TAG !u! tag:unity3d.com,2011:
--- !u!21 &2100000
Material:
  serializedVersion: 6
  m_ObjectHideFlags: 0
  m_CorrespondingSourceObject: {fileID: 0}
  m_PrefabInstance: {fileID: 0}
  m_PrefabAsset: {fileID: 0}
  m_Name: electric_material
  m_Shader: {fileID: -6465566751694194690, guid: a2ce84fd337e7e94482e0242d17878dd,
    type: 3}
  m_ShaderKeywords: 
  m_LightmapFlags: 4
  m_EnableInstancingVariants: 0
  m_DoubleSidedGI: 0
  m_CustomRenderQueue: -1
  stringTagMap:
    MotionVector: User
  disabledShaderPasses:
  - MOTIONVECTORS
  m_SavedProperties:
    serializedVersion: 3
    m_TexEnvs: []
    m_Floats:
    - Vector1_3D4E8892: 1.99
    - Vector1_760783B: 0.76
    - Vector1_83F262D5: 20
    m_Colors:
    - Color_C29E8DA2: {r: 29.857058, g: 29.857058, b: 29.857058, a: 1}
    - Vector2_926A90B4: {r: 0, g: -0.5, b: 0, a: 0}
    - Vector2_BEABB379: {r: -0.1, g: 0.5, b: 0, a: 0}
