     0     pose T
  10-58    ciclo reposo   
  60-114   caminar ,  ciclo  72-102    
 116-173   reposo-apuntar   ,   cargando  173-199   ,   rayo  199-300  (clclo  241-300)   ,   poder agotado y cambio mano   300-440   
 440-520   salto ataque 
 522-590   ataque cola garra 
 592-628   electrocutado    ,   cilco  600-620
 630-760   muerte                        

                                      


                                                  



                                                       


https://www.youtube.com/watch?v=xrXBNDqN2r8    al final


