%YAML 1.1
%TAG !u! tag:unity3d.com,2011:
--- !u!74 &7400000
AnimationClip:
  m_ObjectHideFlags: 0
  m_CorrespondingSourceObject: {fileID: 0}
  m_PrefabInstance: {fileID: 0}
  m_PrefabAsset: {fileID: 0}
  m_Name: bloodidle
  serializedVersion: 6
  m_Legacy: 0
  m_Compressed: 0
  m_UseHighQualityCurve: 1
  m_RotationCurves: []
  m_CompressedRotationCurves: []
  m_EulerCurves: []
  m_PositionCurves: []
  m_ScaleCurves: []
  m_FloatCurves: []
  m_PPtrCurves:
  - curve:
    - time: 0
      value: {fileID: 21300000, guid: 741e78cc8bceac244af4d1a318972423, type: 3}
    - time: 0.016666668
      value: {fileID: 21300000, guid: d411f83db7690ce4cbf8b9bb3f0859a2, type: 3}
    - time: 0.033333335
      value: {fileID: 21300000, guid: 24e095a7b03d5ba4295d4a1fa034709d, type: 3}
    - time: 0.05
      value: {fileID: 21300000, guid: 8fbeb16e3901e0345b567d9595e5f671, type: 3}
    - time: 0.06666667
      value: {fileID: 21300000, guid: da51786213ff74046897c4c5fe43372e, type: 3}
    - time: 0.083333336
      value: {fileID: 21300000, guid: c6484c1869c8ce84197cdcb6c64eadf2, type: 3}
    - time: 0.1
      value: {fileID: 21300000, guid: 91c8818edea7c644889ffc537772430e, type: 3}
    - time: 0.11666667
      value: {fileID: 21300000, guid: 30b61b6d26c162f43bb83760bb5f8bbd, type: 3}
    - time: 0.13333334
      value: {fileID: 21300000, guid: 145c44a79348cf1408ead5bc306e460d, type: 3}
    - time: 0.15
      value: {fileID: 21300000, guid: 9eb79805eda47dd43b4c440ed8340c97, type: 3}
    - time: 0.16666667
      value: {fileID: 21300000, guid: c6fe50762bf90614bbe34e843aaccd7e, type: 3}
    - time: 0.18333334
      value: {fileID: 21300000, guid: 295caa56930b915469d186b9c8df376e, type: 3}
    - time: 0.2
      value: {fileID: 21300000, guid: 59af360266953c7478b6d40927ec4934, type: 3}
    - time: 0.21666667
      value: {fileID: 21300000, guid: 96d55d9c24c6b784d8e9fc210cead12c, type: 3}
    - time: 0.23333333
      value: {fileID: 21300000, guid: 6edb9acb82d636645be9e6074e4309ce, type: 3}
    - time: 0.25
      value: {fileID: 21300000, guid: 570d65a2612ef3749b031682b305103b, type: 3}
    - time: 0.26666668
      value: {fileID: 21300000, guid: 8abfc5b2a8629714396a47c49c97ac3d, type: 3}
    - time: 0.28333333
      value: {fileID: 21300000, guid: 578389b0a74396849b070dc6c74eae6e, type: 3}
    - time: 0.3
      value: {fileID: 21300000, guid: 6c239605d14fa504482f9e227dc79b2c, type: 3}
    - time: 0.31666666
      value: {fileID: 21300000, guid: 7d19539ac1db36b4f8aa17335c8d291b, type: 3}
    - time: 0.33333334
      value: {fileID: 21300000, guid: 2028bdd3297b57f409dfe9c30fae3baf, type: 3}
    - time: 0.35
      value: {fileID: 21300000, guid: 4d475bbbbed3bde409d7e691b59dab6a, type: 3}
    - time: 0.36666667
      value: {fileID: 21300000, guid: 9fe41d0c92e4829439748e004c1d6fc7, type: 3}
    - time: 0.38333333
      value: {fileID: 21300000, guid: c525050137bf5044e9f5480c7a6aebd7, type: 3}
    - time: 0.4
      value: {fileID: 21300000, guid: 306547eb565947546b40e7cab78433fb, type: 3}
    - time: 0.41666666
      value: {fileID: 21300000, guid: 72bf8392926eb904f8fb3c69f84c7c74, type: 3}
    - time: 0.43333334
      value: {fileID: 21300000, guid: 6e28fe77ab735ec4ca0f8c549ce7b78a, type: 3}
    - time: 0.45
      value: {fileID: 21300000, guid: f7c51acd7d4642849817ea5b8a8a00af, type: 3}
    - time: 0.46666667
      value: {fileID: 21300000, guid: df2a138e54fc5a74e9f96e09d246250b, type: 3}
    - time: 0.48333332
      value: {fileID: 21300000, guid: be4284fcde048df4eb404676f5fd7fe3, type: 3}
    - time: 0.5
      value: {fileID: 21300000, guid: 69aee4364999a434394398f924264e94, type: 3}
    - time: 0.51666665
      value: {fileID: 21300000, guid: 33393d9690694fc4e910d9cd87517996, type: 3}
    - time: 0.53333336
      value: {fileID: 21300000, guid: bd3ae83c3c83e5040bc9f682275b6510, type: 3}
    - time: 0.55
      value: {fileID: 21300000, guid: f8ea985318db878488c04b69dce22e81, type: 3}
    - time: 0.56666666
      value: {fileID: 21300000, guid: 8abeea97d0b5c6d4ba76dc20f18934fa, type: 3}
    - time: 0.5833333
      value: {fileID: 21300000, guid: d745b0a0aad3309478182ae284acad3f, type: 3}
    - time: 0.6
      value: {fileID: 21300000, guid: 34837951177018842af8109573c48e85, type: 3}
    - time: 0.6166667
      value: {fileID: 21300000, guid: e2fa8554f8ecdb94a9c68917f53a2c85, type: 3}
    - time: 0.6333333
      value: {fileID: 21300000, guid: 4101a71bd3df73f45aa68d196017ae65, type: 3}
    - time: 0.65
      value: {fileID: 21300000, guid: 7f3a96662053ad048b7d6f53545e3eb3, type: 3}
    - time: 0.6666667
      value: {fileID: 21300000, guid: 65c6c248010daf74a881b5f800ec330b, type: 3}
    - time: 0.68333334
      value: {fileID: 21300000, guid: 34b271efddc6e6f419ac475c5da06942, type: 3}
    - time: 0.7
      value: {fileID: 21300000, guid: 6ebd6fbb658bbcf4487e99463ecafedc, type: 3}
    - time: 0.71666664
      value: {fileID: 21300000, guid: 417dfe3bae288b74481ca00722aaa6ff, type: 3}
    - time: 0.73333335
      value: {fileID: 21300000, guid: 21817765b8ae43d41a636d145b3d8d7b, type: 3}
    - time: 0.75
      value: {fileID: 21300000, guid: fac9c5bf25a889e4083294686c361c38, type: 3}
    - time: 0.76666665
      value: {fileID: 21300000, guid: 987aa55f2c8ef6049b6a60649a7a0940, type: 3}
    - time: 0.78333336
      value: {fileID: 21300000, guid: ef33c196239ee8845b7782872631c415, type: 3}
    - time: 0.8
      value: {fileID: 21300000, guid: 0e45983a4541e374abb025c5a743a047, type: 3}
    - time: 0.81666666
      value: {fileID: 21300000, guid: c6a4234b322304b4789188fb61324711, type: 3}
    - time: 0.8333333
      value: {fileID: 21300000, guid: b9fa7c4c97ed17c438ef47dadc30135f, type: 3}
    - time: 0.85
      value: {fileID: 21300000, guid: cf71a2d89b11ecc488a0a1d10a7ef1b4, type: 3}
    - time: 0.8666667
      value: {fileID: 21300000, guid: 873a98d515393f842a7bff7051d8caad, type: 3}
    - time: 0.8833333
      value: {fileID: 21300000, guid: 6405c42ec6405e04db22f5e9377f8762, type: 3}
    - time: 0.9
      value: {fileID: 21300000, guid: cf82296cdd57fa14a897a9f206ab8230, type: 3}
    - time: 0.9166667
      value: {fileID: 21300000, guid: 1090d981f52753b499690379f53ed97d, type: 3}
    - time: 0.93333334
      value: {fileID: 21300000, guid: be7a0fb2de16536449a8b44b9f660ebf, type: 3}
    - time: 0.95
      value: {fileID: 21300000, guid: 2c36f459acb75764ebce771977907ffb, type: 3}
    - time: 0.96666664
      value: {fileID: 21300000, guid: fd9cc7a02c596e84d8363b8e34151a63, type: 3}
    - time: 0.98333335
      value: {fileID: 21300000, guid: b15366dc7da3a984a894e57e9378bbfe, type: 3}
    - time: 1
      value: {fileID: 21300000, guid: dfc1139185619224cb1dfe916a22516b, type: 3}
    - time: 1.0166667
      value: {fileID: 21300000, guid: 9e2db2aeb47b2da44832cee9940b7dce, type: 3}
    - time: 1.0333333
      value: {fileID: 21300000, guid: 582a2f28230edb8458ed2eee67691e80, type: 3}
    - time: 1.05
      value: {fileID: 21300000, guid: 94cd0c5f935866b43a41b10672a6aa25, type: 3}
    - time: 1.0666667
      value: {fileID: 21300000, guid: c7f6efbd31913f4458039e6f387649d2, type: 3}
    - time: 1.0833334
      value: {fileID: 21300000, guid: c8710aa145b63ce44ba63e010a7de1d4, type: 3}
    - time: 1.1
      value: {fileID: 21300000, guid: 621bad4cd8e21e04785634c208d5a70d, type: 3}
    - time: 1.1166667
      value: {fileID: 21300000, guid: 2ac28622a5433bd4180310e3e3bbe03d, type: 3}
    - time: 1.1333333
      value: {fileID: 21300000, guid: ee3ed85230c96c148a18d6ef390bb637, type: 3}
    - time: 1.15
      value: {fileID: 21300000, guid: 36d0bd9083d675c418b6bf212e2e3d71, type: 3}
    - time: 1.1666666
      value: {fileID: 21300000, guid: dc3d14787cb7d5141ac91bf584033763, type: 3}
    - time: 1.1833333
      value: {fileID: 21300000, guid: 5ac9450c418c80e459096d0c41fe9883, type: 3}
    - time: 1.2
      value: {fileID: 21300000, guid: a342c276b77a2734da5673c690a2f1fd, type: 3}
    - time: 1.2166667
      value: {fileID: 21300000, guid: 749fcae763d62e44e8659f80555f36b8, type: 3}
    - time: 1.2333333
      value: {fileID: 21300000, guid: 1a9774c062bfb1243ba2469f73b99379, type: 3}
    - time: 1.25
      value: {fileID: 21300000, guid: ce4e8df56b1cbe741a667ca669ef4b0e, type: 3}
    - time: 1.2666667
      value: {fileID: 21300000, guid: 54577b2fa9a3b514695c757a261aee25, type: 3}
    - time: 1.2833333
      value: {fileID: 21300000, guid: c275e1df4bc395e49aa32609f669beda, type: 3}
    - time: 1.3
      value: {fileID: 21300000, guid: cd1fc3be7da4ad84aa4ea1f6dc78e885, type: 3}
    - time: 1.3166667
      value: {fileID: 21300000, guid: 4f0e83b0642bf144c926ba4e08940d3e, type: 3}
    - time: 1.3333334
      value: {fileID: 21300000, guid: 5a23f22676c2df1489be006d56ef9077, type: 3}
    - time: 1.35
      value: {fileID: 21300000, guid: 3fa1f4cb345fe4e479f9ead1f8484eb2, type: 3}
    - time: 1.3666667
      value: {fileID: 21300000, guid: a4359bdbfe32baf489480dfa83780dcb, type: 3}
    - time: 1.3833333
      value: {fileID: 21300000, guid: 1bc0ec451223dc043a2254094c8155c4, type: 3}
    - time: 1.4
      value: {fileID: 21300000, guid: c5682d897f802414aa689cd966da655e, type: 3}
    - time: 1.4166666
      value: {fileID: 21300000, guid: 2bdfe0372ca201f44986e9cdb160c552, type: 3}
    - time: 1.4333333
      value: {fileID: 21300000, guid: 584a6be37bf294a448c07f1c26b765c4, type: 3}
    - time: 1.45
      value: {fileID: 21300000, guid: 3829fc95e305bc443ae393ddb883d5b6, type: 3}
    - time: 1.4666667
      value: {fileID: 21300000, guid: f9334b5c248735f4e961dc755ac42f2a, type: 3}
    - time: 1.4833333
      value: {fileID: 21300000, guid: d67732081161d524eaee2c0036968634, type: 3}
    - time: 1.5
      value: {fileID: 21300000, guid: b721d151069d4e24fbadb9d85de70421, type: 3}
    - time: 1.5166667
      value: {fileID: 21300000, guid: d80743a0789ef8347aa1c3aea7d700da, type: 3}
    - time: 1.5333333
      value: {fileID: 21300000, guid: 761b1c3b9e1f14448a20964ce15b5e43, type: 3}
    - time: 1.55
      value: {fileID: 21300000, guid: 128ef1e40586e9742a1ca051830e2c71, type: 3}
    - time: 1.5666667
      value: {fileID: 21300000, guid: 0fda8973a94483940a7434bf923c59a6, type: 3}
    - time: 1.5833334
      value: {fileID: 21300000, guid: 1fcce42b99d42c54d901a555fb8f5aa7, type: 3}
    - time: 1.6
      value: {fileID: 21300000, guid: 4f98d2a8df916bb418592d582bedd645, type: 3}
    - time: 1.6166667
      value: {fileID: 21300000, guid: 151d77926831ace4ab0dcfbad217db87, type: 3}
    - time: 1.6333333
      value: {fileID: 21300000, guid: cf7b2dafc13296b4f8321735df91abf1, type: 3}
    - time: 1.65
      value: {fileID: 21300000, guid: cf09f43648303f042a7b73949408cace, type: 3}
    - time: 1.6666666
      value: {fileID: 21300000, guid: ea9380aa01e763640af9796571f2ae29, type: 3}
    - time: 1.6833333
      value: {fileID: 21300000, guid: cc4536c5e21ecf54786d3e6cae5bc70c, type: 3}
    - time: 1.7
      value: {fileID: 21300000, guid: 17716d9edbc15fd45b10a3e39b2edfd1, type: 3}
    - time: 1.7166667
      value: {fileID: 21300000, guid: c165138635fec2f4e8a2280d5f6412e7, type: 3}
    - time: 1.7333333
      value: {fileID: 21300000, guid: 163f623565875a24f8659eeb9f6e4934, type: 3}
    - time: 1.75
      value: {fileID: 21300000, guid: d5eac65da4f21e0419ac6ec4f0e3e90a, type: 3}
    - time: 1.7666667
      value: {fileID: 21300000, guid: 8f76b86632c286d4b9c48506e47f3440, type: 3}
    - time: 1.7833333
      value: {fileID: 21300000, guid: e0fa81df5ec91e742b1183b6d36f61db, type: 3}
    - time: 1.8
      value: {fileID: 21300000, guid: 240f776f5ea0a9141852cfad42a75d58, type: 3}
    - time: 1.8166667
      value: {fileID: 21300000, guid: 3fdfdbf502f0e3f47b06d373b2bd3e4a, type: 3}
    - time: 1.8333334
      value: {fileID: 21300000, guid: e238a1720eab88746afb4a4f9d813aeb, type: 3}
    - time: 1.85
      value: {fileID: 21300000, guid: c91c0f16133e9ab48aef067f98c7d430, type: 3}
    - time: 1.8666667
      value: {fileID: 21300000, guid: 2ea516ea1df48b04ca7c9ebaa98edad9, type: 3}
    - time: 1.8833333
      value: {fileID: 21300000, guid: c96c98ea042766944bf2a4709ec1e047, type: 3}
    - time: 1.9
      value: {fileID: 21300000, guid: 6c5e7191bb80ae14a814a3ca8ee8ab04, type: 3}
    - time: 1.9166666
      value: {fileID: 21300000, guid: ffd3e52915c3d3d43b37482c53dfb584, type: 3}
    - time: 1.9333333
      value: {fileID: 21300000, guid: 857bea930b21b1d4ebac04afdfe54d58, type: 3}
    - time: 1.95
      value: {fileID: 21300000, guid: 697ed43a8bb635e4d921e9f3e0f5ec70, type: 3}
    - time: 1.9666667
      value: {fileID: 21300000, guid: 74db69eaddad7a640919cd4babe69a32, type: 3}
    - time: 1.9833333
      value: {fileID: 21300000, guid: 20807e9edfda2cb43b93f8f3cd7d55d8, type: 3}
    - time: 2
      value: {fileID: 21300000, guid: d8af97b11123c2641a5d6b99ed287389, type: 3}
    - time: 2.0166667
      value: {fileID: 21300000, guid: 53f9b6cc86139e54bb4987bb18a43660, type: 3}
    - time: 2.0333333
      value: {fileID: 21300000, guid: 06e6876ac2ef58c48b7b1fb3b5294482, type: 3}
    - time: 2.05
      value: {fileID: 21300000, guid: 6ecfd99ec97e1c24a9d6b7ac0132f36f, type: 3}
    - time: 2.0666666
      value: {fileID: 21300000, guid: 5086b0adb5b73c8469002688b6f400d1, type: 3}
    - time: 2.0833333
      value: {fileID: 21300000, guid: 0103dd7c51910824a896d280ee5fc7c2, type: 3}
    - time: 2.1
      value: {fileID: 21300000, guid: eef322e2f48c18042a88db2e5786cfb7, type: 3}
    - time: 2.1166666
      value: {fileID: 21300000, guid: 16964f9e48305f54fa492bae1d15c249, type: 3}
    - time: 2.1333334
      value: {fileID: 21300000, guid: 735cc46cea4bc4246ae6fe5cc82b8f19, type: 3}
    - time: 2.15
      value: {fileID: 21300000, guid: ca466c9ccea5e9e449d659265e31d457, type: 3}
    - time: 2.1666667
      value: {fileID: 21300000, guid: 1eda1eb80621c6a469b81282dd87684b, type: 3}
    - time: 2.1833334
      value: {fileID: 21300000, guid: 1724b8cf1398115448d2021145b5b11b, type: 3}
    - time: 2.2
      value: {fileID: 21300000, guid: 5a2a8567e01d69a42bb4a5268b807884, type: 3}
    - time: 2.2166667
      value: {fileID: 21300000, guid: 24f5892d084fd5441af4be563c5f19e4, type: 3}
    - time: 2.2333333
      value: {fileID: 21300000, guid: dbe10807dfe0e124bbe7ef682abef4d2, type: 3}
    - time: 2.25
      value: {fileID: 21300000, guid: ae05f322382cd534da981bb629fb2a93, type: 3}
    - time: 2.2666667
      value: {fileID: 21300000, guid: 907988463bc5f7c498421e7a632e809c, type: 3}
    - time: 2.2833333
      value: {fileID: 21300000, guid: f2855bef2dba37b42b244a1639c2e0ef, type: 3}
    - time: 2.3
      value: {fileID: 21300000, guid: 4a6568adb74cfb64c93da5da01ce5f93, type: 3}
    - time: 2.3166666
      value: {fileID: 21300000, guid: b988e287d19f28249abf2d871e5879ea, type: 3}
    - time: 2.3333333
      value: {fileID: 21300000, guid: 3880fc796d935334caf321796c753e54, type: 3}
    - time: 2.35
      value: {fileID: 21300000, guid: a70d0be2e39bb49479fa4066e2d94308, type: 3}
    - time: 2.3666666
      value: {fileID: 21300000, guid: 3426b66e794f01c4f849688b023133c6, type: 3}
    - time: 2.3833334
      value: {fileID: 21300000, guid: 44756021602bc5c4d8cbcd664f84a7b2, type: 3}
    - time: 2.4
      value: {fileID: 21300000, guid: 09451cd0cad9fc34d81523cfd758b15b, type: 3}
    - time: 2.4166667
      value: {fileID: 21300000, guid: 7bffebae54fbceb47baa8bd369563242, type: 3}
    - time: 2.4333334
      value: {fileID: 21300000, guid: 7ddd7c572b5113f48bb52be42be9d81b, type: 3}
    - time: 2.45
      value: {fileID: 21300000, guid: 7f6bd04cbf7e0774ab1cc9847755fc6c, type: 3}
    - time: 2.4666667
      value: {fileID: 21300000, guid: abf5be371c9eeb2439a5dbb2f45bb810, type: 3}
    - time: 2.4833333
      value: {fileID: 21300000, guid: b0b6138b6a675fb45a62affb6cec2181, type: 3}
    - time: 2.5
      value: {fileID: 21300000, guid: d2cca56eca6606a468a100bf4683f018, type: 3}
    - time: 2.5166667
      value: {fileID: 21300000, guid: d3253c1a9adb92145a25b526cd3f0f1e, type: 3}
    - time: 2.5333333
      value: {fileID: 21300000, guid: e36318767c2a63648a1b193c830e136c, type: 3}
    - time: 2.55
      value: {fileID: 21300000, guid: f6be7a4ab345ee449bcee072db5b2a76, type: 3}
    - time: 2.5666666
      value: {fileID: 21300000, guid: bec05f65108701647ba14fc598cd2f00, type: 3}
    - time: 2.5833333
      value: {fileID: 21300000, guid: 7a05ce4328639a048a23c4e1f5a535be, type: 3}
    - time: 2.6
      value: {fileID: 21300000, guid: b1151a84553da4e4d8ca419bfb485a56, type: 3}
    - time: 2.6166666
      value: {fileID: 21300000, guid: 9f8dd1e81c5972546a52cf717b24fbd0, type: 3}
    - time: 2.6333334
      value: {fileID: 21300000, guid: f645741d3af95cc43adeedac4aec9bdd, type: 3}
    - time: 2.65
      value: {fileID: 21300000, guid: 98e0835a7f707ed4cb12dc86449c5209, type: 3}
    - time: 2.6666667
      value: {fileID: 21300000, guid: c1f915a91329dd64b9849bbc40e5613c, type: 3}
    - time: 2.6833334
      value: {fileID: 21300000, guid: b495fd944b2594a4a89e08327d471dda, type: 3}
    - time: 2.7
      value: {fileID: 21300000, guid: c1427e3080fef7840a66d632569eb6c7, type: 3}
    - time: 2.7166667
      value: {fileID: 21300000, guid: 69814ff69444d0e48a33109561176835, type: 3}
    - time: 2.7333333
      value: {fileID: 21300000, guid: c59730bf67e6cdd4090e4d36819eddbc, type: 3}
    - time: 2.75
      value: {fileID: 21300000, guid: aa10c94ab18293d4ea6157881ae70af0, type: 3}
    - time: 2.7666667
      value: {fileID: 21300000, guid: 640a9c6a247324b429a8c6c0a6329465, type: 3}
    - time: 2.7833333
      value: {fileID: 21300000, guid: f18c37ae11b07c54aae41b413ad7cbe9, type: 3}
    - time: 2.8
      value: {fileID: 21300000, guid: fafc3ad2b61e7744e8b42abfee7a037a, type: 3}
    - time: 2.8166666
      value: {fileID: 21300000, guid: 359dff00a15be264b827afb8af8c7a45, type: 3}
    attribute: m_Sprite
    path: 
    classID: 114
    script: {fileID: 11500000, guid: fe87c0e1cc204ed48ad3b37840f39efc, type: 3}
  m_SampleRate: 60
  m_WrapMode: 0
  m_Bounds:
    m_Center: {x: 0, y: 0, z: 0}
    m_Extent: {x: 0, y: 0, z: 0}
  m_ClipBindingConstant:
    genericBindings:
    - serializedVersion: 2
      path: 0
      attribute: 2015549526
      script: {fileID: 11500000, guid: fe87c0e1cc204ed48ad3b37840f39efc, type: 3}
      typeID: 114
      customType: 0
      isPPtrCurve: 1
    pptrCurveMapping:
    - {fileID: 21300000, guid: 741e78cc8bceac244af4d1a318972423, type: 3}
    - {fileID: 21300000, guid: d411f83db7690ce4cbf8b9bb3f0859a2, type: 3}
    - {fileID: 21300000, guid: 24e095a7b03d5ba4295d4a1fa034709d, type: 3}
    - {fileID: 21300000, guid: 8fbeb16e3901e0345b567d9595e5f671, type: 3}
    - {fileID: 21300000, guid: da51786213ff74046897c4c5fe43372e, type: 3}
    - {fileID: 21300000, guid: c6484c1869c8ce84197cdcb6c64eadf2, type: 3}
    - {fileID: 21300000, guid: 91c8818edea7c644889ffc537772430e, type: 3}
    - {fileID: 21300000, guid: 30b61b6d26c162f43bb83760bb5f8bbd, type: 3}
    - {fileID: 21300000, guid: 145c44a79348cf1408ead5bc306e460d, type: 3}
    - {fileID: 21300000, guid: 9eb79805eda47dd43b4c440ed8340c97, type: 3}
    - {fileID: 21300000, guid: c6fe50762bf90614bbe34e843aaccd7e, type: 3}
    - {fileID: 21300000, guid: 295caa56930b915469d186b9c8df376e, type: 3}
    - {fileID: 21300000, guid: 59af360266953c7478b6d40927ec4934, type: 3}
    - {fileID: 21300000, guid: 96d55d9c24c6b784d8e9fc210cead12c, type: 3}
    - {fileID: 21300000, guid: 6edb9acb82d636645be9e6074e4309ce, type: 3}
    - {fileID: 21300000, guid: 570d65a2612ef3749b031682b305103b, type: 3}
    - {fileID: 21300000, guid: 8abfc5b2a8629714396a47c49c97ac3d, type: 3}
    - {fileID: 21300000, guid: 578389b0a74396849b070dc6c74eae6e, type: 3}
    - {fileID: 21300000, guid: 6c239605d14fa504482f9e227dc79b2c, type: 3}
    - {fileID: 21300000, guid: 7d19539ac1db36b4f8aa17335c8d291b, type: 3}
    - {fileID: 21300000, guid: 2028bdd3297b57f409dfe9c30fae3baf, type: 3}
    - {fileID: 21300000, guid: 4d475bbbbed3bde409d7e691b59dab6a, type: 3}
    - {fileID: 21300000, guid: 9fe41d0c92e4829439748e004c1d6fc7, type: 3}
    - {fileID: 21300000, guid: c525050137bf5044e9f5480c7a6aebd7, type: 3}
    - {fileID: 21300000, guid: 306547eb565947546b40e7cab78433fb, type: 3}
    - {fileID: 21300000, guid: 72bf8392926eb904f8fb3c69f84c7c74, type: 3}
    - {fileID: 21300000, guid: 6e28fe77ab735ec4ca0f8c549ce7b78a, type: 3}
    - {fileID: 21300000, guid: f7c51acd7d4642849817ea5b8a8a00af, type: 3}
    - {fileID: 21300000, guid: df2a138e54fc5a74e9f96e09d246250b, type: 3}
    - {fileID: 21300000, guid: be4284fcde048df4eb404676f5fd7fe3, type: 3}
    - {fileID: 21300000, guid: 69aee4364999a434394398f924264e94, type: 3}
    - {fileID: 21300000, guid: 33393d9690694fc4e910d9cd87517996, type: 3}
    - {fileID: 21300000, guid: bd3ae83c3c83e5040bc9f682275b6510, type: 3}
    - {fileID: 21300000, guid: f8ea985318db878488c04b69dce22e81, type: 3}
    - {fileID: 21300000, guid: 8abeea97d0b5c6d4ba76dc20f18934fa, type: 3}
    - {fileID: 21300000, guid: d745b0a0aad3309478182ae284acad3f, type: 3}
    - {fileID: 21300000, guid: 34837951177018842af8109573c48e85, type: 3}
    - {fileID: 21300000, guid: e2fa8554f8ecdb94a9c68917f53a2c85, type: 3}
    - {fileID: 21300000, guid: 4101a71bd3df73f45aa68d196017ae65, type: 3}
    - {fileID: 21300000, guid: 7f3a96662053ad048b7d6f53545e3eb3, type: 3}
    - {fileID: 21300000, guid: 65c6c248010daf74a881b5f800ec330b, type: 3}
    - {fileID: 21300000, guid: 34b271efddc6e6f419ac475c5da06942, type: 3}
    - {fileID: 21300000, guid: 6ebd6fbb658bbcf4487e99463ecafedc, type: 3}
    - {fileID: 21300000, guid: 417dfe3bae288b74481ca00722aaa6ff, type: 3}
    - {fileID: 21300000, guid: 21817765b8ae43d41a636d145b3d8d7b, type: 3}
    - {fileID: 21300000, guid: fac9c5bf25a889e4083294686c361c38, type: 3}
    - {fileID: 21300000, guid: 987aa55f2c8ef6049b6a60649a7a0940, type: 3}
    - {fileID: 21300000, guid: ef33c196239ee8845b7782872631c415, type: 3}
    - {fileID: 21300000, guid: 0e45983a4541e374abb025c5a743a047, type: 3}
    - {fileID: 21300000, guid: c6a4234b322304b4789188fb61324711, type: 3}
    - {fileID: 21300000, guid: b9fa7c4c97ed17c438ef47dadc30135f, type: 3}
    - {fileID: 21300000, guid: cf71a2d89b11ecc488a0a1d10a7ef1b4, type: 3}
    - {fileID: 21300000, guid: 873a98d515393f842a7bff7051d8caad, type: 3}
    - {fileID: 21300000, guid: 6405c42ec6405e04db22f5e9377f8762, type: 3}
    - {fileID: 21300000, guid: cf82296cdd57fa14a897a9f206ab8230, type: 3}
    - {fileID: 21300000, guid: 1090d981f52753b499690379f53ed97d, type: 3}
    - {fileID: 21300000, guid: be7a0fb2de16536449a8b44b9f660ebf, type: 3}
    - {fileID: 21300000, guid: 2c36f459acb75764ebce771977907ffb, type: 3}
    - {fileID: 21300000, guid: fd9cc7a02c596e84d8363b8e34151a63, type: 3}
    - {fileID: 21300000, guid: b15366dc7da3a984a894e57e9378bbfe, type: 3}
    - {fileID: 21300000, guid: dfc1139185619224cb1dfe916a22516b, type: 3}
    - {fileID: 21300000, guid: 9e2db2aeb47b2da44832cee9940b7dce, type: 3}
    - {fileID: 21300000, guid: 582a2f28230edb8458ed2eee67691e80, type: 3}
    - {fileID: 21300000, guid: 94cd0c5f935866b43a41b10672a6aa25, type: 3}
    - {fileID: 21300000, guid: c7f6efbd31913f4458039e6f387649d2, type: 3}
    - {fileID: 21300000, guid: c8710aa145b63ce44ba63e010a7de1d4, type: 3}
    - {fileID: 21300000, guid: 621bad4cd8e21e04785634c208d5a70d, type: 3}
    - {fileID: 21300000, guid: 2ac28622a5433bd4180310e3e3bbe03d, type: 3}
    - {fileID: 21300000, guid: ee3ed85230c96c148a18d6ef390bb637, type: 3}
    - {fileID: 21300000, guid: 36d0bd9083d675c418b6bf212e2e3d71, type: 3}
    - {fileID: 21300000, guid: dc3d14787cb7d5141ac91bf584033763, type: 3}
    - {fileID: 21300000, guid: 5ac9450c418c80e459096d0c41fe9883, type: 3}
    - {fileID: 21300000, guid: a342c276b77a2734da5673c690a2f1fd, type: 3}
    - {fileID: 21300000, guid: 749fcae763d62e44e8659f80555f36b8, type: 3}
    - {fileID: 21300000, guid: 1a9774c062bfb1243ba2469f73b99379, type: 3}
    - {fileID: 21300000, guid: ce4e8df56b1cbe741a667ca669ef4b0e, type: 3}
    - {fileID: 21300000, guid: 54577b2fa9a3b514695c757a261aee25, type: 3}
    - {fileID: 21300000, guid: c275e1df4bc395e49aa32609f669beda, type: 3}
    - {fileID: 21300000, guid: cd1fc3be7da4ad84aa4ea1f6dc78e885, type: 3}
    - {fileID: 21300000, guid: 4f0e83b0642bf144c926ba4e08940d3e, type: 3}
    - {fileID: 21300000, guid: 5a23f22676c2df1489be006d56ef9077, type: 3}
    - {fileID: 21300000, guid: 3fa1f4cb345fe4e479f9ead1f8484eb2, type: 3}
    - {fileID: 21300000, guid: a4359bdbfe32baf489480dfa83780dcb, type: 3}
    - {fileID: 21300000, guid: 1bc0ec451223dc043a2254094c8155c4, type: 3}
    - {fileID: 21300000, guid: c5682d897f802414aa689cd966da655e, type: 3}
    - {fileID: 21300000, guid: 2bdfe0372ca201f44986e9cdb160c552, type: 3}
    - {fileID: 21300000, guid: 584a6be37bf294a448c07f1c26b765c4, type: 3}
    - {fileID: 21300000, guid: 3829fc95e305bc443ae393ddb883d5b6, type: 3}
    - {fileID: 21300000, guid: f9334b5c248735f4e961dc755ac42f2a, type: 3}
    - {fileID: 21300000, guid: d67732081161d524eaee2c0036968634, type: 3}
    - {fileID: 21300000, guid: b721d151069d4e24fbadb9d85de70421, type: 3}
    - {fileID: 21300000, guid: d80743a0789ef8347aa1c3aea7d700da, type: 3}
    - {fileID: 21300000, guid: 761b1c3b9e1f14448a20964ce15b5e43, type: 3}
    - {fileID: 21300000, guid: 128ef1e40586e9742a1ca051830e2c71, type: 3}
    - {fileID: 21300000, guid: 0fda8973a94483940a7434bf923c59a6, type: 3}
    - {fileID: 21300000, guid: 1fcce42b99d42c54d901a555fb8f5aa7, type: 3}
    - {fileID: 21300000, guid: 4f98d2a8df916bb418592d582bedd645, type: 3}
    - {fileID: 21300000, guid: 151d77926831ace4ab0dcfbad217db87, type: 3}
    - {fileID: 21300000, guid: cf7b2dafc13296b4f8321735df91abf1, type: 3}
    - {fileID: 21300000, guid: cf09f43648303f042a7b73949408cace, type: 3}
    - {fileID: 21300000, guid: ea9380aa01e763640af9796571f2ae29, type: 3}
    - {fileID: 21300000, guid: cc4536c5e21ecf54786d3e6cae5bc70c, type: 3}
    - {fileID: 21300000, guid: 17716d9edbc15fd45b10a3e39b2edfd1, type: 3}
    - {fileID: 21300000, guid: c165138635fec2f4e8a2280d5f6412e7, type: 3}
    - {fileID: 21300000, guid: 163f623565875a24f8659eeb9f6e4934, type: 3}
    - {fileID: 21300000, guid: d5eac65da4f21e0419ac6ec4f0e3e90a, type: 3}
    - {fileID: 21300000, guid: 8f76b86632c286d4b9c48506e47f3440, type: 3}
    - {fileID: 21300000, guid: e0fa81df5ec91e742b1183b6d36f61db, type: 3}
    - {fileID: 21300000, guid: 240f776f5ea0a9141852cfad42a75d58, type: 3}
    - {fileID: 21300000, guid: 3fdfdbf502f0e3f47b06d373b2bd3e4a, type: 3}
    - {fileID: 21300000, guid: e238a1720eab88746afb4a4f9d813aeb, type: 3}
    - {fileID: 21300000, guid: c91c0f16133e9ab48aef067f98c7d430, type: 3}
    - {fileID: 21300000, guid: 2ea516ea1df48b04ca7c9ebaa98edad9, type: 3}
    - {fileID: 21300000, guid: c96c98ea042766944bf2a4709ec1e047, type: 3}
    - {fileID: 21300000, guid: 6c5e7191bb80ae14a814a3ca8ee8ab04, type: 3}
    - {fileID: 21300000, guid: ffd3e52915c3d3d43b37482c53dfb584, type: 3}
    - {fileID: 21300000, guid: 857bea930b21b1d4ebac04afdfe54d58, type: 3}
    - {fileID: 21300000, guid: 697ed43a8bb635e4d921e9f3e0f5ec70, type: 3}
    - {fileID: 21300000, guid: 74db69eaddad7a640919cd4babe69a32, type: 3}
    - {fileID: 21300000, guid: 20807e9edfda2cb43b93f8f3cd7d55d8, type: 3}
    - {fileID: 21300000, guid: d8af97b11123c2641a5d6b99ed287389, type: 3}
    - {fileID: 21300000, guid: 53f9b6cc86139e54bb4987bb18a43660, type: 3}
    - {fileID: 21300000, guid: 06e6876ac2ef58c48b7b1fb3b5294482, type: 3}
    - {fileID: 21300000, guid: 6ecfd99ec97e1c24a9d6b7ac0132f36f, type: 3}
    - {fileID: 21300000, guid: 5086b0adb5b73c8469002688b6f400d1, type: 3}
    - {fileID: 21300000, guid: 0103dd7c51910824a896d280ee5fc7c2, type: 3}
    - {fileID: 21300000, guid: eef322e2f48c18042a88db2e5786cfb7, type: 3}
    - {fileID: 21300000, guid: 16964f9e48305f54fa492bae1d15c249, type: 3}
    - {fileID: 21300000, guid: 735cc46cea4bc4246ae6fe5cc82b8f19, type: 3}
    - {fileID: 21300000, guid: ca466c9ccea5e9e449d659265e31d457, type: 3}
    - {fileID: 21300000, guid: 1eda1eb80621c6a469b81282dd87684b, type: 3}
    - {fileID: 21300000, guid: 1724b8cf1398115448d2021145b5b11b, type: 3}
    - {fileID: 21300000, guid: 5a2a8567e01d69a42bb4a5268b807884, type: 3}
    - {fileID: 21300000, guid: 24f5892d084fd5441af4be563c5f19e4, type: 3}
    - {fileID: 21300000, guid: dbe10807dfe0e124bbe7ef682abef4d2, type: 3}
    - {fileID: 21300000, guid: ae05f322382cd534da981bb629fb2a93, type: 3}
    - {fileID: 21300000, guid: 907988463bc5f7c498421e7a632e809c, type: 3}
    - {fileID: 21300000, guid: f2855bef2dba37b42b244a1639c2e0ef, type: 3}
    - {fileID: 21300000, guid: 4a6568adb74cfb64c93da5da01ce5f93, type: 3}
    - {fileID: 21300000, guid: b988e287d19f28249abf2d871e5879ea, type: 3}
    - {fileID: 21300000, guid: 3880fc796d935334caf321796c753e54, type: 3}
    - {fileID: 21300000, guid: a70d0be2e39bb49479fa4066e2d94308, type: 3}
    - {fileID: 21300000, guid: 3426b66e794f01c4f849688b023133c6, type: 3}
    - {fileID: 21300000, guid: 44756021602bc5c4d8cbcd664f84a7b2, type: 3}
    - {fileID: 21300000, guid: 09451cd0cad9fc34d81523cfd758b15b, type: 3}
    - {fileID: 21300000, guid: 7bffebae54fbceb47baa8bd369563242, type: 3}
    - {fileID: 21300000, guid: 7ddd7c572b5113f48bb52be42be9d81b, type: 3}
    - {fileID: 21300000, guid: 7f6bd04cbf7e0774ab1cc9847755fc6c, type: 3}
    - {fileID: 21300000, guid: abf5be371c9eeb2439a5dbb2f45bb810, type: 3}
    - {fileID: 21300000, guid: b0b6138b6a675fb45a62affb6cec2181, type: 3}
    - {fileID: 21300000, guid: d2cca56eca6606a468a100bf4683f018, type: 3}
    - {fileID: 21300000, guid: d3253c1a9adb92145a25b526cd3f0f1e, type: 3}
    - {fileID: 21300000, guid: e36318767c2a63648a1b193c830e136c, type: 3}
    - {fileID: 21300000, guid: f6be7a4ab345ee449bcee072db5b2a76, type: 3}
    - {fileID: 21300000, guid: bec05f65108701647ba14fc598cd2f00, type: 3}
    - {fileID: 21300000, guid: 7a05ce4328639a048a23c4e1f5a535be, type: 3}
    - {fileID: 21300000, guid: b1151a84553da4e4d8ca419bfb485a56, type: 3}
    - {fileID: 21300000, guid: 9f8dd1e81c5972546a52cf717b24fbd0, type: 3}
    - {fileID: 21300000, guid: f645741d3af95cc43adeedac4aec9bdd, type: 3}
    - {fileID: 21300000, guid: 98e0835a7f707ed4cb12dc86449c5209, type: 3}
    - {fileID: 21300000, guid: c1f915a91329dd64b9849bbc40e5613c, type: 3}
    - {fileID: 21300000, guid: b495fd944b2594a4a89e08327d471dda, type: 3}
    - {fileID: 21300000, guid: c1427e3080fef7840a66d632569eb6c7, type: 3}
    - {fileID: 21300000, guid: 69814ff69444d0e48a33109561176835, type: 3}
    - {fileID: 21300000, guid: c59730bf67e6cdd4090e4d36819eddbc, type: 3}
    - {fileID: 21300000, guid: aa10c94ab18293d4ea6157881ae70af0, type: 3}
    - {fileID: 21300000, guid: 640a9c6a247324b429a8c6c0a6329465, type: 3}
    - {fileID: 21300000, guid: f18c37ae11b07c54aae41b413ad7cbe9, type: 3}
    - {fileID: 21300000, guid: fafc3ad2b61e7744e8b42abfee7a037a, type: 3}
    - {fileID: 21300000, guid: 359dff00a15be264b827afb8af8c7a45, type: 3}
  m_AnimationClipSettings:
    serializedVersion: 2
    m_AdditiveReferencePoseClip: {fileID: 0}
    m_AdditiveReferencePoseTime: 0
    m_StartTime: 0
    m_StopTime: 2.8333333
    m_OrientationOffsetY: 0
    m_Level: 0
    m_CycleOffset: 0
    m_HasAdditiveReferencePose: 0
    m_LoopTime: 0
    m_LoopBlend: 0
    m_LoopBlendOrientation: 0
    m_LoopBlendPositionY: 0
    m_LoopBlendPositionXZ: 0
    m_KeepOriginalOrientation: 0
    m_KeepOriginalPositionY: 1
    m_KeepOriginalPositionXZ: 0
    m_HeightFromFeet: 0
    m_Mirror: 0
  m_EditorCurves: []
  m_EulerEditorCurves: []
  m_HasGenericRootTransform: 0
  m_HasMotionFloatCurves: 0
  m_Events: []
