%YAML 1.1
%TAG !u! tag:unity3d.com,2011:
--- !u!1 &675578429959853144
GameObject:
  m_ObjectHideFlags: 0
  m_CorrespondingSourceObject: {fileID: 0}
  m_PrefabInstance: {fileID: 0}
  m_PrefabAsset: {fileID: 0}
  serializedVersion: 6
  m_Component:
  - component: {fileID: 7203097115892016390}
  - component: {fileID: 4868997344014743031}
  m_Layer: 0
  m_Name: BulletHoleShotGun
  m_TagString: Untagged
  m_Icon: {fileID: 0}
  m_NavMeshLayer: 0
  m_StaticEditorFlags: 0
  m_IsActive: 1
--- !u!4 &7203097115892016390
Transform:
  m_ObjectHideFlags: 0
  m_CorrespondingSourceObject: {fileID: 0}
  m_PrefabInstance: {fileID: 0}
  m_PrefabAsset: {fileID: 0}
  m_GameObject: {fileID: 675578429959853144}
  m_LocalRotation: {x: 0, y: 0, z: 0, w: 1}
  m_LocalPosition: {x: 0.739, y: 3.103, z: -4.135}
  m_LocalScale: {x: 2, y: 2, z: 2}
  m_Children:
  - {fileID: 7342537588309044416}
  m_Father: {fileID: 0}
  m_RootOrder: 0
  m_LocalEulerAnglesHint: {x: 0, y: 0, z: 0}
--- !u!114 &4868997344014743031
MonoBehaviour:
  m_ObjectHideFlags: 0
  m_CorrespondingSourceObject: {fileID: 0}
  m_PrefabInstance: {fileID: 0}
  m_PrefabAsset: {fileID: 0}
  m_GameObject: {fileID: 675578429959853144}
  m_Enabled: 1
  m_EditorHideFlags: 0
  m_Script: {fileID: 11500000, guid: 5007dc32b5fdd1c4892a203cc1e0d5d9, type: 3}
  m_Name: 
  m_EditorClassIdentifier: 
--- !u!1001 &8056522636158558249
PrefabInstance:
  m_ObjectHideFlags: 0
  serializedVersion: 2
  m_Modification:
    m_TransformParent: {fileID: 7203097115892016390}
    m_Modifications:
    - target: {fileID: 732797760520244453, guid: 3dfa0b314b422824885af79c8890a894,
        type: 3}
      propertyPath: m_Name
      value: Disparo
      objectReference: {fileID: 0}
    - target: {fileID: 732797760520244457, guid: 3dfa0b314b422824885af79c8890a894,
        type: 3}
      propertyPath: m_LocalPosition.x
      value: 0
      objectReference: {fileID: 0}
    - target: {fileID: 732797760520244457, guid: 3dfa0b314b422824885af79c8890a894,
        type: 3}
      propertyPath: m_LocalPosition.y
      value: 0
      objectReference: {fileID: 0}
    - target: {fileID: 732797760520244457, guid: 3dfa0b314b422824885af79c8890a894,
        type: 3}
      propertyPath: m_LocalPosition.z
      value: -0.011776742
      objectReference: {fileID: 0}
    - target: {fileID: 732797760520244457, guid: 3dfa0b314b422824885af79c8890a894,
        type: 3}
      propertyPath: m_LocalRotation.x
      value: 0
      objectReference: {fileID: 0}
    - target: {fileID: 732797760520244457, guid: 3dfa0b314b422824885af79c8890a894,
        type: 3}
      propertyPath: m_LocalRotation.y
      value: 0
      objectReference: {fileID: 0}
    - target: {fileID: 732797760520244457, guid: 3dfa0b314b422824885af79c8890a894,
        type: 3}
      propertyPath: m_LocalRotation.z
      value: 0
      objectReference: {fileID: 0}
    - target: {fileID: 732797760520244457, guid: 3dfa0b314b422824885af79c8890a894,
        type: 3}
      propertyPath: m_LocalRotation.w
      value: 1
      objectReference: {fileID: 0}
    - target: {fileID: 732797760520244457, guid: 3dfa0b314b422824885af79c8890a894,
        type: 3}
      propertyPath: m_RootOrder
      value: 0
      objectReference: {fileID: 0}
    - target: {fileID: 732797760520244457, guid: 3dfa0b314b422824885af79c8890a894,
        type: 3}
      propertyPath: m_LocalEulerAnglesHint.x
      value: 0
      objectReference: {fileID: 0}
    - target: {fileID: 732797760520244457, guid: 3dfa0b314b422824885af79c8890a894,
        type: 3}
      propertyPath: m_LocalEulerAnglesHint.y
      value: 0
      objectReference: {fileID: 0}
    - target: {fileID: 732797760520244457, guid: 3dfa0b314b422824885af79c8890a894,
        type: 3}
      propertyPath: m_LocalEulerAnglesHint.z
      value: 0
      objectReference: {fileID: 0}
    - target: {fileID: 732797760520244457, guid: 3dfa0b314b422824885af79c8890a894,
        type: 3}
      propertyPath: m_AnchoredPosition.x
      value: -0.04900378
      objectReference: {fileID: 0}
    - target: {fileID: 732797760520244457, guid: 3dfa0b314b422824885af79c8890a894,
        type: 3}
      propertyPath: m_AnchoredPosition.y
      value: -0.010716915
      objectReference: {fileID: 0}
    - target: {fileID: 732797760520244457, guid: 3dfa0b314b422824885af79c8890a894,
        type: 3}
      propertyPath: m_SizeDelta.x
      value: 126.6
      objectReference: {fileID: 0}
    - target: {fileID: 732797760520244457, guid: 3dfa0b314b422824885af79c8890a894,
        type: 3}
      propertyPath: m_SizeDelta.y
      value: 108.85
      objectReference: {fileID: 0}
    - target: {fileID: 732797760520244457, guid: 3dfa0b314b422824885af79c8890a894,
        type: 3}
      propertyPath: m_AnchorMin.x
      value: 0
      objectReference: {fileID: 0}
    - target: {fileID: 732797760520244457, guid: 3dfa0b314b422824885af79c8890a894,
        type: 3}
      propertyPath: m_AnchorMin.y
      value: 0
      objectReference: {fileID: 0}
    - target: {fileID: 732797760520244457, guid: 3dfa0b314b422824885af79c8890a894,
        type: 3}
      propertyPath: m_AnchorMax.x
      value: 0
      objectReference: {fileID: 0}
    - target: {fileID: 732797760520244457, guid: 3dfa0b314b422824885af79c8890a894,
        type: 3}
      propertyPath: m_AnchorMax.y
      value: 0
      objectReference: {fileID: 0}
    - target: {fileID: 732797760520244457, guid: 3dfa0b314b422824885af79c8890a894,
        type: 3}
      propertyPath: m_Pivot.x
      value: 0.5
      objectReference: {fileID: 0}
    - target: {fileID: 732797760520244457, guid: 3dfa0b314b422824885af79c8890a894,
        type: 3}
      propertyPath: m_Pivot.y
      value: 0.5
      objectReference: {fileID: 0}
    - target: {fileID: 8798909610034066622, guid: 3dfa0b314b422824885af79c8890a894,
        type: 3}
      propertyPath: m_LocalPosition.x
      value: -0
      objectReference: {fileID: 0}
    - target: {fileID: 8798909610034066622, guid: 3dfa0b314b422824885af79c8890a894,
        type: 3}
      propertyPath: m_LocalPosition.y
      value: -28.5
      objectReference: {fileID: 0}
    - target: {fileID: 8798909610034066622, guid: 3dfa0b314b422824885af79c8890a894,
        type: 3}
      propertyPath: m_LocalPosition.z
      value: 0
      objectReference: {fileID: 0}
    - target: {fileID: 3076641923840498391, guid: 3dfa0b314b422824885af79c8890a894,
        type: 3}
      propertyPath: m_LocalPosition.x
      value: -0
      objectReference: {fileID: 0}
    - target: {fileID: 3076641923840498391, guid: 3dfa0b314b422824885af79c8890a894,
        type: 3}
      propertyPath: m_LocalPosition.y
      value: 32
      objectReference: {fileID: 0}
    - target: {fileID: 3076641923840498391, guid: 3dfa0b314b422824885af79c8890a894,
        type: 3}
      propertyPath: m_LocalPosition.z
      value: -0
      objectReference: {fileID: 0}
    - target: {fileID: 4260194612459711591, guid: 3dfa0b314b422824885af79c8890a894,
        type: 3}
      propertyPath: m_LocalPosition.x
      value: -39.3
      objectReference: {fileID: 0}
    - target: {fileID: 4260194612459711591, guid: 3dfa0b314b422824885af79c8890a894,
        type: 3}
      propertyPath: m_LocalPosition.z
      value: 0
      objectReference: {fileID: 0}
    - target: {fileID: 4155864079904611591, guid: 3dfa0b314b422824885af79c8890a894,
        type: 3}
      propertyPath: m_LocalPosition.x
      value: 34.4
      objectReference: {fileID: 0}
    - target: {fileID: 5906364855376752845, guid: 3dfa0b314b422824885af79c8890a894,
        type: 3}
      propertyPath: m_IsActive
      value: 1
      objectReference: {fileID: 0}
    m_RemovedComponents: []
  m_SourcePrefab: {fileID: 100100000, guid: 3dfa0b314b422824885af79c8890a894, type: 3}
--- !u!224 &7342537588309044416 stripped
RectTransform:
  m_CorrespondingSourceObject: {fileID: 732797760520244457, guid: 3dfa0b314b422824885af79c8890a894,
    type: 3}
  m_PrefabInstance: {fileID: 8056522636158558249}
  m_PrefabAsset: {fileID: 0}
