%YAML 1.1
%TAG !u! tag:unity3d.com,2011:
--- !u!21 &2100000
Material:
  serializedVersion: 6
  m_ObjectHideFlags: 0
  m_CorrespondingSourceObject: {fileID: 0}
  m_PrefabInstance: {fileID: 0}
  m_PrefabAsset: {fileID: 0}
  m_Name: beam material 1
  m_Shader: {fileID: -6465566751694194690, guid: cd74b9f964a092d439a6a5ca5378621f,
    type: 3}
  m_ShaderKeywords: 
  m_LightmapFlags: 4
  m_EnableInstancingVariants: 0
  m_DoubleSidedGI: 0
  m_CustomRenderQueue: -1
  stringTagMap:
    MotionVector: User
  disabledShaderPasses:
  - MOTIONVECTORS
  m_SavedProperties:
    serializedVersion: 3
    m_TexEnvs:
    - Texture2D_372F692A:
        m_Texture: {fileID: 10300, guid: 0000000000000000f000000000000000, type: 0}
        m_Scale: {x: 1, y: 1}
        m_Offset: {x: 0, y: 0}
    - Texture2D_7D55D1C9:
        m_Texture: {fileID: 10300, guid: 0000000000000000f000000000000000, type: 0}
        m_Scale: {x: 1, y: 1}
        m_Offset: {x: 0, y: 0}
    m_Floats:
    - Vector1_28C04C02: 37.8
    - Vector1_55D828A0: 0.23
    - Vector1_74359531: 1
    - Vector1_B5EDB63B: 0.606
    m_Colors:
    - Color_6952D1CF: {r: 75.26194, g: 75.26194, b: 75.26194, a: 1}
    - Vector2_83644405: {r: -1, g: 0, b: 0, a: 0}
    - Vector2_D8AD0278: {r: 0, g: 0, b: 0, a: 0}
