%YAML 1.1
%TAG !u! tag:unity3d.com,2011:
--- !u!114 &11400000
MonoBehaviour:
  m_ObjectHideFlags: 0
  m_CorrespondingSourceObject: {fileID: 0}
  m_PrefabInstance: {fileID: 0}
  m_PrefabAsset: {fileID: 0}
  m_GameObject: {fileID: 0}
  m_Enabled: 1
  m_EditorHideFlags: 0
  m_Script: {fileID: 11500000, guid: 9267c713cc5753f48b988cdfc06a9390, type: 3}
  m_Name: TattoosData
  m_EditorClassIdentifier: 
  tattoos:
  - tattooName: Hannya
    tattooDescription: Mask used in Noh, one of the styles of traditional Japanese
      theater
    tattoosGender: 0
    TattooStats:
    - type: 500
      value: 50
    - type: 400
      value: 25
    - type: 1000
      value: 100
    texture: {fileID: 2800000, guid: 7e38af0f695627741ad9fb86c018f705, type: 3}
    powerCard:
      cardName: Hannya
      cardIllustration: {fileID: 21300000, guid: 7e38af0f695627741ad9fb86c018f705, type: 3}
      animName: simpleSpell
      power: 100
      stamineCost: 120
      roundsCooldown: 2
      tempStatsBoost:
      - type: 500
        value: 0
      - type: 450
        value: 0
      - type: 490
        value: 0
      - type: 400
        value: 0
      - type: 1000
        value: 0
      cardFrame: {fileID: 21300000, guid: 9c9dcc38dbe7a13478ec3cb747f77733, type: 3}
    cost: 350
  - tattooName: Anchor
    tattooDescription: ' Representative symbol among sailors and fishermen of safety
      and strength.'
    tattoosGender: 3
    TattooStats:
    - type: 490
      value: 30
    - type: 400
      value: 30
    - type: 450
      value: 100
    texture: {fileID: 2800000, guid: bf4e7e0afde729e4098cf3f7a2c156ef, type: 3}
    powerCard:
      cardName: Anchor
      cardIllustration: {fileID: 21300000, guid: bf4e7e0afde729e4098cf3f7a2c156ef, type: 3}
      animName: Patada
      power: 20
      stamineCost: 90
      roundsCooldown: 2
      tempStatsBoost:
      - type: 0
        value: 0
      - type: 0
        value: 0
      - type: 0
        value: 0
      - type: 0
        value: 0
      - type: 0
        value: 0
      cardFrame: {fileID: 21300000, guid: e589d1958a25cfe4694e5472ef259d1a, type: 3}
    cost: 350
  - tattooName: LightHouse
    tattooDescription: ' Security, since the lighthouse was what protected and indicated
      the sailors the way, hence its meaning of security.'
    tattoosGender: 0
    TattooStats:
    - type: 490
      value: 15
    - type: 400
      value: 10
    - type: 450
      value: 5
    texture: {fileID: 2800000, guid: 4fea5144df0f837458ea48c3265c23ed, type: 3}
    powerCard:
      cardName: LightHouse
      cardIllustration: {fileID: 21300000, guid: 4fea5144df0f837458ea48c3265c23ed, type: 3}
      animName: Patada
      power: 20
      stamineCost: 140
      roundsCooldown: 1
      tempStatsBoost:
      - type: 0
        value: 0
      - type: 0
        value: 0
      - type: 0
        value: 0
      - type: 0
        value: 0
      - type: 0
        value: 0
      cardFrame: {fileID: 21300000, guid: e589d1958a25cfe4694e5472ef259d1a, type: 3}
    cost: 200
  - tattooName: USA Flag
    tattooDescription: ' Represents honor, dignity and respect for the United States.
      It is also the symbol of freedom and patriotism.'
    tattoosGender: 0
    TattooStats:
    - type: 490
      value: 60
    - type: 1000
      value: 20
    - type: 400
      value: 10
    texture: {fileID: 2800000, guid: fbcc3274e0a29ab41afaa072aab9b084, type: 3}
    powerCard:
      cardName: USA Flag
      cardIllustration: {fileID: 21300000, guid: fbcc3274e0a29ab41afaa072aab9b084, type: 3}
      animName: simpleSpell
      power: 60
      stamineCost: 100
      roundsCooldown: 2
      tempStatsBoost:
      - type: 0
        value: 0
      - type: 0
        value: 0
      - type: 0
        value: 0
      - type: 0
        value: 0
      - type: 0
        value: 0
      cardFrame: {fileID: 21300000, guid: e589d1958a25cfe4694e5472ef259d1a, type: 3}
    cost: 200
  - tattooName: Swallow
    tattooDescription: ' Tradition of American sailors to tattoo a swallow for every
      5,000 nautical miles sailed'
    tattoosGender: 3
    TattooStats:
    - type: 490
      value: 60
    - type: 400
      value: 30
    texture: {fileID: 2800000, guid: f4ffa608a5fcf114e90ed30fa9f96268, type: 3}
    powerCard:
      cardName: Swallow
      cardIllustration: {fileID: 21300000, guid: f4ffa608a5fcf114e90ed30fa9f96268, type: 3}
      animName: Patada
      power: 50
      stamineCost: 140
      roundsCooldown: 1
      tempStatsBoost:
      - type: 0
        value: 0
      - type: 0
        value: 0
      - type: 0
        value: 0
      - type: 0
        value: 0
      - type: 0
        value: 0
      cardFrame: {fileID: 21300000, guid: e589d1958a25cfe4694e5472ef259d1a, type: 3}
    cost: 350
  - tattooName: Koi
    tattooDescription: ' Perseverance in the face of adversity, since those who achieved
      the ascent of the waterfalls were transformed into dragons'
    tattoosGender: 0
    TattooStats:
    - type: 500
      value: 30
    - type: 400
      value: 10
    - type: 490
      value: 10
    texture: {fileID: 2800000, guid: 45fd62d6e41d7ee498b0b93653b31f9f, type: 3}
    powerCard:
      cardName: Koi
      cardIllustration: {fileID: 21300000, guid: 45fd62d6e41d7ee498b0b93653b31f9f, type: 3}
      animName: simpleSpell
      power: 80
      stamineCost: 80
      roundsCooldown: 0
      tempStatsBoost:
      - type: 0
        value: 0
      - type: 0
        value: 0
      - type: 0
        value: 0
      - type: 0
        value: 0
      - type: 0
        value: 0
      cardFrame: {fileID: 21300000, guid: 9c9dcc38dbe7a13478ec3cb747f77733, type: 3}
    cost: 200
  - tattooName: Samurai
    tattooDescription: ' Symbol of courage, honor and justice; warrior representing
      the highest male ideals within Japanese culture'
    tattoosGender: 0
    TattooStats:
    - type: 500
      value: 20
    - type: 450
      value: 60
    - type: 400
      value: 50
    - type: 400
      value: 40
    texture: {fileID: 2800000, guid: 824c0a4836ec9614c8889c4669d40757, type: 3}
    powerCard:
      cardName: Samurai
      cardIllustration: {fileID: 21300000, guid: 824c0a4836ec9614c8889c4669d40757, type: 3}
      animName: simpleSpell
      power: 120
      stamineCost: 90
      roundsCooldown: 1
      tempStatsBoost:
      - type: 0
        value: 0
      - type: 0
        value: 0
      - type: 0
        value: 0
      - type: 0
        value: 0
      - type: 0
        value: 0
      cardFrame: {fileID: 21300000, guid: 9c9dcc38dbe7a13478ec3cb747f77733, type: 3}
    cost: 320
  - tattooName: Temple
    tattooDescription: ' One of the oldest temples in Japan, the Asukadera temple'
    tattoosGender: 0
    TattooStats:
    - type: 500
      value: 20
    - type: 400
      value: 10
    texture: {fileID: 2800000, guid: ea8859a9b6026e14e99992a4c1b731dd, type: 3}
    powerCard:
      cardName: Temple
      cardIllustration: {fileID: 21300000, guid: ea8859a9b6026e14e99992a4c1b731dd, type: 3}
      animName: simpleSpell
      power: 50
      stamineCost: 75
      roundsCooldown: 0
      tempStatsBoost:
      - type: 0
        value: 0
      - type: 0
        value: 0
      - type: 0
        value: 0
      - type: 0
        value: 0
      - type: 0
        value: 0
      cardFrame: {fileID: 21300000, guid: 9c9dcc38dbe7a13478ec3cb747f77733, type: 3}
    cost: 10
  - tattooName: Bust of Nefertiti
    tattooDescription: ' The Nefertiti bust has become a cultural symbol of Berlin
      and ancient Egypt.'
    tattoosGender: 2
    TattooStats:
    - type: 400
      value: 10
    - type: 1000
      value: 10
    texture: {fileID: 2800000, guid: 20c2ce15d509cb240bd0c9e488b103fe, type: 3}
    powerCard:
      cardName: Nefertiti
      cardIllustration: {fileID: 21300000, guid: 20c2ce15d509cb240bd0c9e488b103fe, type: 3}
      animName: Patada
      power: 25
      stamineCost: 120
      roundsCooldown: 1
      tempStatsBoost:
      - type: 0
        value: 0
      - type: 0
        value: 0
      - type: 0
        value: 0
      - type: 0
        value: 0
      - type: 0
        value: 0
      cardFrame: {fileID: 21300000, guid: 8da7496189bc06f4c8f47d3f0ce9f424, type: 3}
    cost: 200
  - tattooName: Tutankamon
    tattooDescription: Tutankhamun was a pharaoh of Ancient Egypt
    tattoosGender: 2
    TattooStats:
    - type: 400
      value: 50
    - type: 1000
      value: 10
    - type: 450
      value: 30
    texture: {fileID: 2800000, guid: 9d7220b0ed3fa4b4aa7055c3203c9efd, type: 3}
    powerCard:
      cardName: Tutankamon
      cardIllustration: {fileID: 21300000, guid: 9d7220b0ed3fa4b4aa7055c3203c9efd, type: 3}
      animName: Patada
      power: 20
      stamineCost: 150
      roundsCooldown: 1
      tempStatsBoost:
      - type: 0
        value: 0
      - type: 0
        value: 0
      - type: 0
        value: 0
      - type: 0
        value: 0
      - type: 0
        value: 0
      cardFrame: {fileID: 21300000, guid: 8da7496189bc06f4c8f47d3f0ce9f424, type: 3}
    cost: 350
  - tattooName: Pallete of Nermen
    tattooDescription: Palletes  were generally flat, minimally decorated stone objects
      used for grinding and mixing minerals for cosmetics.
    tattoosGender: 2
    TattooStats:
    - type: 400
      value: 50
    - type: 1000
      value: 50
    - type: 500
      value: 10
    texture: {fileID: 2800000, guid: a3d8eb3c66eaad54aa6fa23832505077, type: 3}
    powerCard:
      cardName: Nermen
      cardIllustration: {fileID: 21300000, guid: a3d8eb3c66eaad54aa6fa23832505077, type: 3}
      animName: simpleSpell
      power: 40
      stamineCost: 100
      roundsCooldown: 2
      tempStatsBoost:
      - type: 0
        value: 0
      - type: 0
        value: 0
      - type: 0
        value: 0
      - type: 0
        value: 0
      - type: 0
        value: 0
      cardFrame: {fileID: 21300000, guid: 8da7496189bc06f4c8f47d3f0ce9f424, type: 3}
    cost: 400
  - tattooName: Pyramids
    tattooDescription: ' For 4,500 years, the pyramids have been a silent witness
      to the history of mankind'
    tattoosGender: 2
    TattooStats:
    - type: 400
      value: 60
    - type: 1000
      value: 30
    - type: 490
      value: 15
    - type: 450
      value: 15
    texture: {fileID: 2800000, guid: 6cf4d95047a9fc8468d188ca51f3e621, type: 3}
    powerCard:
      cardName: Pyramid
      cardIllustration: {fileID: 21300000, guid: 6cf4d95047a9fc8468d188ca51f3e621, type: 3}
      animName: simpleSpell
      power: 40
      stamineCost: 140
      roundsCooldown: 3
      tempStatsBoost:
      - type: 0
        value: 0
      - type: 0
        value: 0
      - type: 0
        value: 0
      - type: 0
        value: 0
      - type: 0
        value: 0
      cardFrame: {fileID: 21300000, guid: 8da7496189bc06f4c8f47d3f0ce9f424, type: 3}
    cost: 450
  - tattooName: Maori sun
    tattooDescription: ' This philosophy is central to the love and care that many
      New Zealanders have for the environment.'
    tattoosGender: 1
    TattooStats:
    - type: 450
      value: 20
    - type: 400
      value: 100
    texture: {fileID: 2800000, guid: ffafbbcd2db84ff4680c801cb87e26cf, type: 3}
    powerCard:
      cardName: Maori sun
      cardIllustration: {fileID: 21300000, guid: ffafbbcd2db84ff4680c801cb87e26cf, type: 3}
      animName: Patada
      power: 60
      stamineCost: 75
      roundsCooldown: 1
      tempStatsBoost:
      - type: 0
        value: 0
      - type: 0
        value: 0
      - type: 0
        value: 0
      - type: 0
        value: 0
      - type: 0
        value: 0
      cardFrame: {fileID: 21300000, guid: 5cecac203a485a74485d5f15def72d7f, type: 3}
    cost: 350
  - tattooName: Maori Fox
    tattooDescription: Characteristic feature of Maori culture is that it still survives,
      it is the art of Ta Moko
    tattoosGender: 2
    TattooStats:
    - type: 450
      value: 30
    - type: 1000
      value: 15
    - type: 400
      value: 10
    texture: {fileID: 2800000, guid: 530a0442d1ea1bd46b4f4f029d4280ae, type: 3}
    powerCard:
      cardName: Maori Fox
      cardIllustration: {fileID: 21300000, guid: 530a0442d1ea1bd46b4f4f029d4280ae, type: 3}
      animName: Patada
      power: 15
      stamineCost: 200
      roundsCooldown: 1
      tempStatsBoost:
      - type: 0
        value: 0
      - type: 0
        value: 0
      - type: 0
        value: 0
      - type: 0
        value: 0
      - type: 0
        value: 0
      cardFrame: {fileID: 21300000, guid: 5cecac203a485a74485d5f15def72d7f, type: 3}
    cost: 200
  - tattooName: Maori wing
    tattooDescription: ' The haka is a ritual dance that the Maori perform before
      each battle to instill fear in their enemies and arm themselves with courage'
    tattoosGender: 1
    TattooStats:
    - type: 450
      value: 30
    - type: 1000
      value: 30
    - type: 490
      value: 5
    texture: {fileID: 2800000, guid: 1efc331232824604080c84980ef6ff49, type: 3}
    powerCard:
      cardName: Maori wing
      cardIllustration: {fileID: 21300000, guid: 1efc331232824604080c84980ef6ff49, type: 3}
      animName: Patada
      power: 150
      stamineCost: 80
      roundsCooldown: 0
      tempStatsBoost:
      - type: 0
        value: 0
      - type: 0
        value: 0
      - type: 0
        value: 0
      - type: 0
        value: 0
      - type: 0
        value: 0
      cardFrame: {fileID: 21300000, guid: 5cecac203a485a74485d5f15def72d7f, type: 3}
    cost: 250
  - tattooName: Maori Nature
    tattooDescription: Maori culture is an essential part of life in New Zealand
    tattoosGender: 2
    TattooStats:
    - type: 450
      value: 50
    - type: 1000
      value: 20
    - type: 490
      value: 10
    texture: {fileID: 2800000, guid: 9105ade2d99ca994d99a9682404fb2cb, type: 3}
    powerCard:
      cardName: Maori Nature
      cardIllustration: {fileID: 21300000, guid: 9105ade2d99ca994d99a9682404fb2cb, type: 3}
      animName: Patada
      power: 80
      stamineCost: 120
      roundsCooldown: 2
      tempStatsBoost:
      - type: 0
        value: 0
      - type: 0
        value: 0
      - type: 0
        value: 0
      - type: 0
        value: 0
      - type: 0
        value: 0
      cardFrame: {fileID: 21300000, guid: 5cecac203a485a74485d5f15def72d7f, type: 3}
    cost: 500
