%YAML 1.1
%TAG !u! tag:unity3d.com,2011:
--- !u!21 &2100000
Material:
  serializedVersion: 6
  m_ObjectHideFlags: 0
  m_CorrespondingSourceObject: {fileID: 0}
  m_PrefabInstance: {fileID: 0}
  m_PrefabAsset: {fileID: 0}
  m_Name: cartoonWaterGraph RIO
  m_Shader: {fileID: -6465566751694194690, guid: c61ac406704e1a44698802e156f02f44,
    type: 3}
  m_ShaderKeywords: 
  m_LightmapFlags: 4
  m_EnableInstancingVariants: 0
  m_DoubleSidedGI: 0
  m_CustomRenderQueue: -1
  stringTagMap: {}
  disabledShaderPasses: []
  m_SavedProperties:
    serializedVersion: 3
    m_TexEnvs: []
    m_Floats:
    - Vector1_57D43031: 7
    - Vector1_82517353: 5
    - Vector1_B2CF201A: 1
    - Vector1_E226D8B: 1
    m_Colors:
    - Color_6B0BD8C7: {r: 0, g: 0.5803922, b: 0.7924528, a: 0}
    - Color_989611C8: {r: 0.24358407, g: 0.79329616, b: 1.259508, a: 0}
    - Vector2_ED7D844A: {r: 0.1, g: 0, b: 0, a: 0}
