%YAML 1.1
%TAG !u! tag:unity3d.com,2011:
--- !u!21 &2100000
Material:
  serializedVersion: 6
  m_ObjectHideFlags: 0
  m_CorrespondingSourceObject: {fileID: 0}
  m_PrefabInstance: {fileID: 0}
  m_PrefabAsset: {fileID: 0}
  m_Name: cartoonWaterGraphMat
  m_Shader: {fileID: -6465566751694194690, guid: 96e56f176296f8d4c93ac2e0afe717a5,
    type: 3}
  m_ShaderKeywords: 
  m_LightmapFlags: 4
  m_EnableInstancingVariants: 0
  m_DoubleSidedGI: 0
  m_CustomRenderQueue: -1
  stringTagMap: {}
  disabledShaderPasses: []
  m_SavedProperties:
    serializedVersion: 3
    m_TexEnvs: []
    m_Floats:
    - Vector1_57D43031: 4.25
    - Vector1_82517353: 7.64
    - Vector1_B2CF201A: 0.1
    - Vector1_E226D8B: 0.86
    m_Colors:
    - Color_6B0BD8C7: {r: 0, g: 0.5848769, b: 0.49019608, a: 0}
    - Color_989611C8: {r: 0.47120413, g: 2, b: 0.8949204, a: 0}
