%YAML 1.1
%TAG !u! tag:unity3d.com,2011:
--- !u!74 &7400000
AnimationClip:
  m_ObjectHideFlags: 0
  m_CorrespondingSourceObject: {fileID: 0}
  m_PrefabInstance: {fileID: 0}
  m_PrefabAsset: {fileID: 0}
  m_Name: o
  serializedVersion: 6
  m_Legacy: 0
  m_Compressed: 0
  m_UseHighQualityCurve: 1
  m_RotationCurves: []
  m_CompressedRotationCurves: []
  m_EulerCurves: []
  m_PositionCurves: []
  m_ScaleCurves: []
  m_FloatCurves: []
  m_PPtrCurves:
  - curve:
    - time: 0
      value: {fileID: -1901235389938645959, guid: 37d74a745fc2f7b41b22e09933cb2e75,
        type: 3}
    - time: 0.083333336
      value: {fileID: -1698420403927200286, guid: 37d74a745fc2f7b41b22e09933cb2e75,
        type: 3}
    - time: 0.16666667
      value: {fileID: 7491487050458729524, guid: 37d74a745fc2f7b41b22e09933cb2e75,
        type: 3}
    - time: 0.25
      value: {fileID: 7087649492765509747, guid: 37d74a745fc2f7b41b22e09933cb2e75,
        type: 3}
    - time: 0.33333334
      value: {fileID: -8001549086096801887, guid: 37d74a745fc2f7b41b22e09933cb2e75,
        type: 3}
    - time: 0.41666666
      value: {fileID: -6850096645091386272, guid: 37d74a745fc2f7b41b22e09933cb2e75,
        type: 3}
    - time: 0.5
      value: {fileID: 866099538198280239, guid: 37d74a745fc2f7b41b22e09933cb2e75,
        type: 3}
    - time: 0.5833333
      value: {fileID: 9083254361136135194, guid: 37d74a745fc2f7b41b22e09933cb2e75,
        type: 3}
    - time: 0.6666667
      value: {fileID: 7434435710452802865, guid: 37d74a745fc2f7b41b22e09933cb2e75,
        type: 3}
    - time: 0.75
      value: {fileID: 342916656889012211, guid: 37d74a745fc2f7b41b22e09933cb2e75,
        type: 3}
    - time: 0.8333333
      value: {fileID: 6024993089359190228, guid: 37d74a745fc2f7b41b22e09933cb2e75,
        type: 3}
    - time: 0.9166667
      value: {fileID: 5931038852791760445, guid: 37d74a745fc2f7b41b22e09933cb2e75,
        type: 3}
    - time: 1
      value: {fileID: -4122215534356754659, guid: 37d74a745fc2f7b41b22e09933cb2e75,
        type: 3}
    - time: 1.0833334
      value: {fileID: 5605778646852608084, guid: 37d74a745fc2f7b41b22e09933cb2e75,
        type: 3}
    - time: 1.1666666
      value: {fileID: -6977210187618476733, guid: 37d74a745fc2f7b41b22e09933cb2e75,
        type: 3}
    - time: 1.25
      value: {fileID: 5787813243832251129, guid: 37d74a745fc2f7b41b22e09933cb2e75,
        type: 3}
    - time: 1.3333334
      value: {fileID: -4723695058875611635, guid: 37d74a745fc2f7b41b22e09933cb2e75,
        type: 3}
    - time: 1.4166666
      value: {fileID: 3438907043055724087, guid: 37d74a745fc2f7b41b22e09933cb2e75,
        type: 3}
    - time: 1.5
      value: {fileID: -3998320316982677002, guid: 37d74a745fc2f7b41b22e09933cb2e75,
        type: 3}
    - time: 1.5833334
      value: {fileID: 7566644017793787045, guid: 37d74a745fc2f7b41b22e09933cb2e75,
        type: 3}
    - time: 1.6666666
      value: {fileID: -389533832553403171, guid: 37d74a745fc2f7b41b22e09933cb2e75,
        type: 3}
    - time: 1.75
      value: {fileID: 8273813596285028247, guid: 37d74a745fc2f7b41b22e09933cb2e75,
        type: 3}
    - time: 1.8333334
      value: {fileID: -1671263798981166006, guid: 37d74a745fc2f7b41b22e09933cb2e75,
        type: 3}
    - time: 1.9166666
      value: {fileID: -1207824062424429373, guid: 37d74a745fc2f7b41b22e09933cb2e75,
        type: 3}
    - time: 2
      value: {fileID: 2824711913759799734, guid: 37d74a745fc2f7b41b22e09933cb2e75,
        type: 3}
    - time: 2.0833333
      value: {fileID: -5340283310544459130, guid: 37d74a745fc2f7b41b22e09933cb2e75,
        type: 3}
    - time: 2.1666667
      value: {fileID: 7910473179348504006, guid: 37d74a745fc2f7b41b22e09933cb2e75,
        type: 3}
    - time: 2.25
      value: {fileID: 2142315128285833816, guid: 37d74a745fc2f7b41b22e09933cb2e75,
        type: 3}
    - time: 2.3333333
      value: {fileID: -8094778164422215631, guid: 37d74a745fc2f7b41b22e09933cb2e75,
        type: 3}
    - time: 2.4166667
      value: {fileID: 6939166389190076148, guid: 37d74a745fc2f7b41b22e09933cb2e75,
        type: 3}
    - time: 2.5
      value: {fileID: -5211598248836815537, guid: 37d74a745fc2f7b41b22e09933cb2e75,
        type: 3}
    - time: 2.5833333
      value: {fileID: 6376979215015601381, guid: 37d74a745fc2f7b41b22e09933cb2e75,
        type: 3}
    - time: 2.6666667
      value: {fileID: 2410520163209141344, guid: 37d74a745fc2f7b41b22e09933cb2e75,
        type: 3}
    - time: 2.75
      value: {fileID: -117508207714974797, guid: 37d74a745fc2f7b41b22e09933cb2e75,
        type: 3}
    attribute: m_Sprite
    path: 
    classID: 114
    script: {fileID: 11500000, guid: fe87c0e1cc204ed48ad3b37840f39efc, type: 3}
  m_SampleRate: 12
  m_WrapMode: 0
  m_Bounds:
    m_Center: {x: 0, y: 0, z: 0}
    m_Extent: {x: 0, y: 0, z: 0}
  m_ClipBindingConstant:
    genericBindings:
    - serializedVersion: 2
      path: 0
      attribute: 2015549526
      script: {fileID: 11500000, guid: fe87c0e1cc204ed48ad3b37840f39efc, type: 3}
      typeID: 114
      customType: 0
      isPPtrCurve: 1
    pptrCurveMapping:
    - {fileID: -1901235389938645959, guid: 37d74a745fc2f7b41b22e09933cb2e75, type: 3}
    - {fileID: -1698420403927200286, guid: 37d74a745fc2f7b41b22e09933cb2e75, type: 3}
    - {fileID: 7491487050458729524, guid: 37d74a745fc2f7b41b22e09933cb2e75, type: 3}
    - {fileID: 7087649492765509747, guid: 37d74a745fc2f7b41b22e09933cb2e75, type: 3}
    - {fileID: -8001549086096801887, guid: 37d74a745fc2f7b41b22e09933cb2e75, type: 3}
    - {fileID: -6850096645091386272, guid: 37d74a745fc2f7b41b22e09933cb2e75, type: 3}
    - {fileID: 866099538198280239, guid: 37d74a745fc2f7b41b22e09933cb2e75, type: 3}
    - {fileID: 9083254361136135194, guid: 37d74a745fc2f7b41b22e09933cb2e75, type: 3}
    - {fileID: 7434435710452802865, guid: 37d74a745fc2f7b41b22e09933cb2e75, type: 3}
    - {fileID: 342916656889012211, guid: 37d74a745fc2f7b41b22e09933cb2e75, type: 3}
    - {fileID: 6024993089359190228, guid: 37d74a745fc2f7b41b22e09933cb2e75, type: 3}
    - {fileID: 5931038852791760445, guid: 37d74a745fc2f7b41b22e09933cb2e75, type: 3}
    - {fileID: -4122215534356754659, guid: 37d74a745fc2f7b41b22e09933cb2e75, type: 3}
    - {fileID: 5605778646852608084, guid: 37d74a745fc2f7b41b22e09933cb2e75, type: 3}
    - {fileID: -6977210187618476733, guid: 37d74a745fc2f7b41b22e09933cb2e75, type: 3}
    - {fileID: 5787813243832251129, guid: 37d74a745fc2f7b41b22e09933cb2e75, type: 3}
    - {fileID: -4723695058875611635, guid: 37d74a745fc2f7b41b22e09933cb2e75, type: 3}
    - {fileID: 3438907043055724087, guid: 37d74a745fc2f7b41b22e09933cb2e75, type: 3}
    - {fileID: -3998320316982677002, guid: 37d74a745fc2f7b41b22e09933cb2e75, type: 3}
    - {fileID: 7566644017793787045, guid: 37d74a745fc2f7b41b22e09933cb2e75, type: 3}
    - {fileID: -389533832553403171, guid: 37d74a745fc2f7b41b22e09933cb2e75, type: 3}
    - {fileID: 8273813596285028247, guid: 37d74a745fc2f7b41b22e09933cb2e75, type: 3}
    - {fileID: -1671263798981166006, guid: 37d74a745fc2f7b41b22e09933cb2e75, type: 3}
    - {fileID: -1207824062424429373, guid: 37d74a745fc2f7b41b22e09933cb2e75, type: 3}
    - {fileID: 2824711913759799734, guid: 37d74a745fc2f7b41b22e09933cb2e75, type: 3}
    - {fileID: -5340283310544459130, guid: 37d74a745fc2f7b41b22e09933cb2e75, type: 3}
    - {fileID: 7910473179348504006, guid: 37d74a745fc2f7b41b22e09933cb2e75, type: 3}
    - {fileID: 2142315128285833816, guid: 37d74a745fc2f7b41b22e09933cb2e75, type: 3}
    - {fileID: -8094778164422215631, guid: 37d74a745fc2f7b41b22e09933cb2e75, type: 3}
    - {fileID: 6939166389190076148, guid: 37d74a745fc2f7b41b22e09933cb2e75, type: 3}
    - {fileID: -5211598248836815537, guid: 37d74a745fc2f7b41b22e09933cb2e75, type: 3}
    - {fileID: 6376979215015601381, guid: 37d74a745fc2f7b41b22e09933cb2e75, type: 3}
    - {fileID: 2410520163209141344, guid: 37d74a745fc2f7b41b22e09933cb2e75, type: 3}
    - {fileID: -117508207714974797, guid: 37d74a745fc2f7b41b22e09933cb2e75, type: 3}
  m_AnimationClipSettings:
    serializedVersion: 2
    m_AdditiveReferencePoseClip: {fileID: 0}
    m_AdditiveReferencePoseTime: 0
    m_StartTime: 0
    m_StopTime: 2.8333333
    m_OrientationOffsetY: 0
    m_Level: 0
    m_CycleOffset: 0
    m_HasAdditiveReferencePose: 0
    m_LoopTime: 1
    m_LoopBlend: 0
    m_LoopBlendOrientation: 0
    m_LoopBlendPositionY: 0
    m_LoopBlendPositionXZ: 0
    m_KeepOriginalOrientation: 0
    m_KeepOriginalPositionY: 1
    m_KeepOriginalPositionXZ: 0
    m_HeightFromFeet: 0
    m_Mirror: 0
  m_EditorCurves: []
  m_EulerEditorCurves: []
  m_HasGenericRootTransform: 0
  m_HasMotionFloatCurves: 0
  m_Events: []
