%YAML 1.1
%TAG !u! tag:unity3d.com,2011:
--- !u!74 &7400000
AnimationClip:
  m_ObjectHideFlags: 0
  m_CorrespondingSourceObject: {fileID: 0}
  m_PrefabInstance: {fileID: 0}
  m_PrefabAsset: {fileID: 0}
  m_Name: Moving
  serializedVersion: 6
  m_Legacy: 0
  m_Compressed: 0
  m_UseHighQualityCurve: 1
  m_RotationCurves: []
  m_CompressedRotationCurves: []
  m_EulerCurves: []
  m_PositionCurves: []
  m_ScaleCurves: []
  m_FloatCurves: []
  m_PPtrCurves:
  - curve:
    - time: 0
      value: {fileID: 2361729723755505392, guid: a8af10c020d897f49883188f99020117,
        type: 3}
    - time: 0.022222223
      value: {fileID: 1419276793866534095, guid: a8af10c020d897f49883188f99020117,
        type: 3}
    - time: 0.044444446
      value: {fileID: -6161916363346235784, guid: a8af10c020d897f49883188f99020117,
        type: 3}
    - time: 0.06666667
      value: {fileID: -6347137930663838141, guid: a8af10c020d897f49883188f99020117,
        type: 3}
    - time: 0.08888889
      value: {fileID: 657359276979082283, guid: a8af10c020d897f49883188f99020117,
        type: 3}
    - time: 0.11111111
      value: {fileID: -4151868102968542445, guid: a8af10c020d897f49883188f99020117,
        type: 3}
    - time: 0.13333334
      value: {fileID: -8472222557763625763, guid: a8af10c020d897f49883188f99020117,
        type: 3}
    - time: 0.15555556
      value: {fileID: 7372268006243352007, guid: a8af10c020d897f49883188f99020117,
        type: 3}
    - time: 0.17777778
      value: {fileID: -7297769105181523775, guid: a8af10c020d897f49883188f99020117,
        type: 3}
    - time: 0.2
      value: {fileID: 1764734657639968974, guid: a8af10c020d897f49883188f99020117,
        type: 3}
    - time: 0.22222222
      value: {fileID: 3175142927161943996, guid: a8af10c020d897f49883188f99020117,
        type: 3}
    - time: 0.24444444
      value: {fileID: 1134054455253274319, guid: a8af10c020d897f49883188f99020117,
        type: 3}
    - time: 0.26666668
      value: {fileID: -859504774235953676, guid: a8af10c020d897f49883188f99020117,
        type: 3}
    - time: 0.2888889
      value: {fileID: 4431745721763299054, guid: a8af10c020d897f49883188f99020117,
        type: 3}
    - time: 0.31111112
      value: {fileID: -6584307659909858960, guid: a8af10c020d897f49883188f99020117,
        type: 3}
    - time: 0.42222223
      value: {fileID: -8169469743047922814, guid: a8af10c020d897f49883188f99020117,
        type: 3}
    attribute: m_Sprite
    path: 
    classID: 114
    script: {fileID: 11500000, guid: fe87c0e1cc204ed48ad3b37840f39efc, type: 3}
  m_SampleRate: 45
  m_WrapMode: 0
  m_Bounds:
    m_Center: {x: 0, y: 0, z: 0}
    m_Extent: {x: 0, y: 0, z: 0}
  m_ClipBindingConstant:
    genericBindings:
    - serializedVersion: 2
      path: 0
      attribute: 2015549526
      script: {fileID: 11500000, guid: fe87c0e1cc204ed48ad3b37840f39efc, type: 3}
      typeID: 114
      customType: 0
      isPPtrCurve: 1
    pptrCurveMapping:
    - {fileID: 2361729723755505392, guid: a8af10c020d897f49883188f99020117, type: 3}
    - {fileID: 1419276793866534095, guid: a8af10c020d897f49883188f99020117, type: 3}
    - {fileID: -6161916363346235784, guid: a8af10c020d897f49883188f99020117, type: 3}
    - {fileID: -6347137930663838141, guid: a8af10c020d897f49883188f99020117, type: 3}
    - {fileID: 657359276979082283, guid: a8af10c020d897f49883188f99020117, type: 3}
    - {fileID: -4151868102968542445, guid: a8af10c020d897f49883188f99020117, type: 3}
    - {fileID: -8472222557763625763, guid: a8af10c020d897f49883188f99020117, type: 3}
    - {fileID: 7372268006243352007, guid: a8af10c020d897f49883188f99020117, type: 3}
    - {fileID: -7297769105181523775, guid: a8af10c020d897f49883188f99020117, type: 3}
    - {fileID: 1764734657639968974, guid: a8af10c020d897f49883188f99020117, type: 3}
    - {fileID: 3175142927161943996, guid: a8af10c020d897f49883188f99020117, type: 3}
    - {fileID: 1134054455253274319, guid: a8af10c020d897f49883188f99020117, type: 3}
    - {fileID: -859504774235953676, guid: a8af10c020d897f49883188f99020117, type: 3}
    - {fileID: 4431745721763299054, guid: a8af10c020d897f49883188f99020117, type: 3}
    - {fileID: -6584307659909858960, guid: a8af10c020d897f49883188f99020117, type: 3}
    - {fileID: -8169469743047922814, guid: a8af10c020d897f49883188f99020117, type: 3}
  m_AnimationClipSettings:
    serializedVersion: 2
    m_AdditiveReferencePoseClip: {fileID: 0}
    m_AdditiveReferencePoseTime: 0
    m_StartTime: 0
    m_StopTime: 0.44444445
    m_OrientationOffsetY: 0
    m_Level: 0
    m_CycleOffset: 0
    m_HasAdditiveReferencePose: 0
    m_LoopTime: 1
    m_LoopBlend: 1
    m_LoopBlendOrientation: 0
    m_LoopBlendPositionY: 0
    m_LoopBlendPositionXZ: 0
    m_KeepOriginalOrientation: 0
    m_KeepOriginalPositionY: 1
    m_KeepOriginalPositionXZ: 0
    m_HeightFromFeet: 0
    m_Mirror: 0
  m_EditorCurves: []
  m_EulerEditorCurves: []
  m_HasGenericRootTransform: 0
  m_HasMotionFloatCurves: 0
  m_Events: []
