%YAML 1.1
%TAG !u! tag:unity3d.com,2011:
--- !u!1045 &1
EditorBuildSettings:
  m_ObjectHideFlags: 0
  serializedVersion: 2
  m_Scenes:
  - enabled: 1
    path: Assets/UnitySocketIO/Scenes/Login.unity
    guid: a8e453df8b9305c4a94e7ba6e9d3d2cb
  - enabled: 1
    path: Assets/UnitySocketIO/Scenes/TestScene.unity
    guid: 19c5c1abf6190b342a43bb1839f4c4cd
  - enabled: 0
    path: Assets/Samu/Count Minigame.unity
    guid: 11f6f2aa324064f4cace6727b8811cf9
  m_configObjects: {}
