%YAML 1.1
%TAG !u! tag:unity3d.com,2011:
--- !u!74 &7400000
AnimationClip:
  m_ObjectHideFlags: 0
  m_CorrespondingSourceObject: {fileID: 0}
  m_PrefabInstance: {fileID: 0}
  m_PrefabAsset: {fileID: 0}
  m_Name: sick
  serializedVersion: 6
  m_Legacy: 0
  m_Compressed: 0
  m_UseHighQualityCurve: 1
  m_RotationCurves: []
  m_CompressedRotationCurves: []
  m_EulerCurves: []
  m_PositionCurves: []
  m_ScaleCurves: []
  m_FloatCurves: []
  m_PPtrCurves:
  - curve:
    - time: 0
      value: {fileID: -8782224209623404607, guid: 37d74a745fc2f7b41b22e09933cb2e75,
        type: 3}
    - time: 0.083333336
      value: {fileID: 8210500796348779056, guid: 37d74a745fc2f7b41b22e09933cb2e75,
        type: 3}
    - time: 0.16666667
      value: {fileID: -5489009423885535019, guid: 37d74a745fc2f7b41b22e09933cb2e75,
        type: 3}
    - time: 0.25
      value: {fileID: 5611588423653486283, guid: 37d74a745fc2f7b41b22e09933cb2e75,
        type: 3}
    - time: 0.33333334
      value: {fileID: -8901983309698920661, guid: 37d74a745fc2f7b41b22e09933cb2e75,
        type: 3}
    - time: 0.41666666
      value: {fileID: -920167239927884995, guid: 37d74a745fc2f7b41b22e09933cb2e75,
        type: 3}
    - time: 0.5
      value: {fileID: -3240953009772959437, guid: 37d74a745fc2f7b41b22e09933cb2e75,
        type: 3}
    - time: 0.5833333
      value: {fileID: 850592821955982517, guid: 37d74a745fc2f7b41b22e09933cb2e75,
        type: 3}
    - time: 0.6666667
      value: {fileID: -4210644392844624649, guid: 37d74a745fc2f7b41b22e09933cb2e75,
        type: 3}
    - time: 0.75
      value: {fileID: 7511093181434571170, guid: 37d74a745fc2f7b41b22e09933cb2e75,
        type: 3}
    - time: 0.8333333
      value: {fileID: 4633991579365838459, guid: 37d74a745fc2f7b41b22e09933cb2e75,
        type: 3}
    - time: 0.9166667
      value: {fileID: -2589374255314554968, guid: 37d74a745fc2f7b41b22e09933cb2e75,
        type: 3}
    - time: 1
      value: {fileID: 7767428993997702962, guid: 37d74a745fc2f7b41b22e09933cb2e75,
        type: 3}
    - time: 1.0833334
      value: {fileID: 8182598779922969699, guid: 37d74a745fc2f7b41b22e09933cb2e75,
        type: 3}
    - time: 1.1666666
      value: {fileID: 3894261045207061259, guid: 37d74a745fc2f7b41b22e09933cb2e75,
        type: 3}
    - time: 1.25
      value: {fileID: -687846787460781446, guid: 37d74a745fc2f7b41b22e09933cb2e75,
        type: 3}
    - time: 1.3333334
      value: {fileID: 458642941976004203, guid: 37d74a745fc2f7b41b22e09933cb2e75,
        type: 3}
    - time: 1.4166666
      value: {fileID: 1522026925370299760, guid: 37d74a745fc2f7b41b22e09933cb2e75,
        type: 3}
    - time: 1.5
      value: {fileID: 241768299790968528, guid: 37d74a745fc2f7b41b22e09933cb2e75,
        type: 3}
    - time: 1.5833334
      value: {fileID: 2955468745696133117, guid: 37d74a745fc2f7b41b22e09933cb2e75,
        type: 3}
    - time: 1.6666666
      value: {fileID: 8671864764105671180, guid: 37d74a745fc2f7b41b22e09933cb2e75,
        type: 3}
    - time: 1.75
      value: {fileID: -7816086478657790186, guid: 37d74a745fc2f7b41b22e09933cb2e75,
        type: 3}
    - time: 1.8333334
      value: {fileID: -7261149633030287927, guid: 37d74a745fc2f7b41b22e09933cb2e75,
        type: 3}
    - time: 1.9166666
      value: {fileID: -6791600909592193831, guid: 37d74a745fc2f7b41b22e09933cb2e75,
        type: 3}
    - time: 2
      value: {fileID: -3416158231310801711, guid: 37d74a745fc2f7b41b22e09933cb2e75,
        type: 3}
    - time: 2.0833333
      value: {fileID: -5315220973606786059, guid: 37d74a745fc2f7b41b22e09933cb2e75,
        type: 3}
    - time: 2.1666667
      value: {fileID: -8177583271363903199, guid: 37d74a745fc2f7b41b22e09933cb2e75,
        type: 3}
    - time: 2.25
      value: {fileID: -8470270647975171162, guid: 37d74a745fc2f7b41b22e09933cb2e75,
        type: 3}
    - time: 2.3333333
      value: {fileID: -8129544701682375115, guid: 37d74a745fc2f7b41b22e09933cb2e75,
        type: 3}
    - time: 2.4166667
      value: {fileID: 8283778281905108697, guid: 37d74a745fc2f7b41b22e09933cb2e75,
        type: 3}
    - time: 2.5
      value: {fileID: -1538030419464871300, guid: 37d74a745fc2f7b41b22e09933cb2e75,
        type: 3}
    attribute: m_Sprite
    path: 
    classID: 114
    script: {fileID: 11500000, guid: fe87c0e1cc204ed48ad3b37840f39efc, type: 3}
  m_SampleRate: 12
  m_WrapMode: 0
  m_Bounds:
    m_Center: {x: 0, y: 0, z: 0}
    m_Extent: {x: 0, y: 0, z: 0}
  m_ClipBindingConstant:
    genericBindings:
    - serializedVersion: 2
      path: 0
      attribute: 2015549526
      script: {fileID: 11500000, guid: fe87c0e1cc204ed48ad3b37840f39efc, type: 3}
      typeID: 114
      customType: 0
      isPPtrCurve: 1
    pptrCurveMapping:
    - {fileID: -8782224209623404607, guid: 37d74a745fc2f7b41b22e09933cb2e75, type: 3}
    - {fileID: 8210500796348779056, guid: 37d74a745fc2f7b41b22e09933cb2e75, type: 3}
    - {fileID: -5489009423885535019, guid: 37d74a745fc2f7b41b22e09933cb2e75, type: 3}
    - {fileID: 5611588423653486283, guid: 37d74a745fc2f7b41b22e09933cb2e75, type: 3}
    - {fileID: -8901983309698920661, guid: 37d74a745fc2f7b41b22e09933cb2e75, type: 3}
    - {fileID: -920167239927884995, guid: 37d74a745fc2f7b41b22e09933cb2e75, type: 3}
    - {fileID: -3240953009772959437, guid: 37d74a745fc2f7b41b22e09933cb2e75, type: 3}
    - {fileID: 850592821955982517, guid: 37d74a745fc2f7b41b22e09933cb2e75, type: 3}
    - {fileID: -4210644392844624649, guid: 37d74a745fc2f7b41b22e09933cb2e75, type: 3}
    - {fileID: 7511093181434571170, guid: 37d74a745fc2f7b41b22e09933cb2e75, type: 3}
    - {fileID: 4633991579365838459, guid: 37d74a745fc2f7b41b22e09933cb2e75, type: 3}
    - {fileID: -2589374255314554968, guid: 37d74a745fc2f7b41b22e09933cb2e75, type: 3}
    - {fileID: 7767428993997702962, guid: 37d74a745fc2f7b41b22e09933cb2e75, type: 3}
    - {fileID: 8182598779922969699, guid: 37d74a745fc2f7b41b22e09933cb2e75, type: 3}
    - {fileID: 3894261045207061259, guid: 37d74a745fc2f7b41b22e09933cb2e75, type: 3}
    - {fileID: -687846787460781446, guid: 37d74a745fc2f7b41b22e09933cb2e75, type: 3}
    - {fileID: 458642941976004203, guid: 37d74a745fc2f7b41b22e09933cb2e75, type: 3}
    - {fileID: 1522026925370299760, guid: 37d74a745fc2f7b41b22e09933cb2e75, type: 3}
    - {fileID: 241768299790968528, guid: 37d74a745fc2f7b41b22e09933cb2e75, type: 3}
    - {fileID: 2955468745696133117, guid: 37d74a745fc2f7b41b22e09933cb2e75, type: 3}
    - {fileID: 8671864764105671180, guid: 37d74a745fc2f7b41b22e09933cb2e75, type: 3}
    - {fileID: -7816086478657790186, guid: 37d74a745fc2f7b41b22e09933cb2e75, type: 3}
    - {fileID: -7261149633030287927, guid: 37d74a745fc2f7b41b22e09933cb2e75, type: 3}
    - {fileID: -6791600909592193831, guid: 37d74a745fc2f7b41b22e09933cb2e75, type: 3}
    - {fileID: -3416158231310801711, guid: 37d74a745fc2f7b41b22e09933cb2e75, type: 3}
    - {fileID: -5315220973606786059, guid: 37d74a745fc2f7b41b22e09933cb2e75, type: 3}
    - {fileID: -8177583271363903199, guid: 37d74a745fc2f7b41b22e09933cb2e75, type: 3}
    - {fileID: -8470270647975171162, guid: 37d74a745fc2f7b41b22e09933cb2e75, type: 3}
    - {fileID: -8129544701682375115, guid: 37d74a745fc2f7b41b22e09933cb2e75, type: 3}
    - {fileID: 8283778281905108697, guid: 37d74a745fc2f7b41b22e09933cb2e75, type: 3}
    - {fileID: -1538030419464871300, guid: 37d74a745fc2f7b41b22e09933cb2e75, type: 3}
  m_AnimationClipSettings:
    serializedVersion: 2
    m_AdditiveReferencePoseClip: {fileID: 0}
    m_AdditiveReferencePoseTime: 0
    m_StartTime: 0
    m_StopTime: 2.5833333
    m_OrientationOffsetY: 0
    m_Level: 0
    m_CycleOffset: 0
    m_HasAdditiveReferencePose: 0
    m_LoopTime: 1
    m_LoopBlend: 0
    m_LoopBlendOrientation: 0
    m_LoopBlendPositionY: 0
    m_LoopBlendPositionXZ: 0
    m_KeepOriginalOrientation: 0
    m_KeepOriginalPositionY: 1
    m_KeepOriginalPositionXZ: 0
    m_HeightFromFeet: 0
    m_Mirror: 0
  m_EditorCurves: []
  m_EulerEditorCurves: []
  m_HasGenericRootTransform: 0
  m_HasMotionFloatCurves: 0
  m_Events: []
