%YAML 1.1
%TAG !u! tag:unity3d.com,2011:
--- !u!74 &7400000
AnimationClip:
  m_ObjectHideFlags: 0
  m_CorrespondingSourceObject: {fileID: 0}
  m_PrefabInstance: {fileID: 0}
  m_PrefabAsset: {fileID: 0}
  m_Name: angry
  serializedVersion: 6
  m_Legacy: 0
  m_Compressed: 0
  m_UseHighQualityCurve: 1
  m_RotationCurves: []
  m_CompressedRotationCurves: []
  m_EulerCurves: []
  m_PositionCurves: []
  m_ScaleCurves: []
  m_FloatCurves: []
  m_PPtrCurves:
  - curve:
    - time: 0
      value: {fileID: -1538030419464871300, guid: 37d74a745fc2f7b41b22e09933cb2e75,
        type: 3}
    - time: 0.083333336
      value: {fileID: -2717647891583955933, guid: 37d74a745fc2f7b41b22e09933cb2e75,
        type: 3}
    - time: 0.16666667
      value: {fileID: -959642332138228301, guid: 37d74a745fc2f7b41b22e09933cb2e75,
        type: 3}
    - time: 0.25
      value: {fileID: -1317514598786905740, guid: 37d74a745fc2f7b41b22e09933cb2e75,
        type: 3}
    - time: 0.33333334
      value: {fileID: 6128250671590355315, guid: 37d74a745fc2f7b41b22e09933cb2e75,
        type: 3}
    - time: 0.41666666
      value: {fileID: 8911867801277394653, guid: 37d74a745fc2f7b41b22e09933cb2e75,
        type: 3}
    - time: 0.5
      value: {fileID: -3430625979939459395, guid: 37d74a745fc2f7b41b22e09933cb2e75,
        type: 3}
    - time: 0.5833333
      value: {fileID: 5687425260420177087, guid: 37d74a745fc2f7b41b22e09933cb2e75,
        type: 3}
    - time: 0.6666667
      value: {fileID: 7298916890958228683, guid: 37d74a745fc2f7b41b22e09933cb2e75,
        type: 3}
    - time: 0.75
      value: {fileID: -542109087194500962, guid: 37d74a745fc2f7b41b22e09933cb2e75,
        type: 3}
    - time: 0.8333333
      value: {fileID: 822149106125071076, guid: 37d74a745fc2f7b41b22e09933cb2e75,
        type: 3}
    - time: 0.9166667
      value: {fileID: 906904604185756721, guid: 37d74a745fc2f7b41b22e09933cb2e75,
        type: 3}
    - time: 1
      value: {fileID: 2816202218438928677, guid: 37d74a745fc2f7b41b22e09933cb2e75,
        type: 3}
    - time: 1.0833334
      value: {fileID: -8448511498611078410, guid: 37d74a745fc2f7b41b22e09933cb2e75,
        type: 3}
    - time: 1.1666666
      value: {fileID: -1724212227840537477, guid: 37d74a745fc2f7b41b22e09933cb2e75,
        type: 3}
    - time: 1.25
      value: {fileID: -3172499824202287682, guid: 37d74a745fc2f7b41b22e09933cb2e75,
        type: 3}
    - time: 1.3333334
      value: {fileID: 5607584083297998799, guid: 37d74a745fc2f7b41b22e09933cb2e75,
        type: 3}
    - time: 1.4166666
      value: {fileID: -6091713680500325728, guid: 37d74a745fc2f7b41b22e09933cb2e75,
        type: 3}
    - time: 1.5
      value: {fileID: 6531626078407554121, guid: 37d74a745fc2f7b41b22e09933cb2e75,
        type: 3}
    - time: 1.5833334
      value: {fileID: -2546641538454495528, guid: 37d74a745fc2f7b41b22e09933cb2e75,
        type: 3}
    - time: 1.6666666
      value: {fileID: 7321142812402198222, guid: 37d74a745fc2f7b41b22e09933cb2e75,
        type: 3}
    - time: 1.75
      value: {fileID: 7270093783253276527, guid: 37d74a745fc2f7b41b22e09933cb2e75,
        type: 3}
    - time: 1.8333334
      value: {fileID: -5050496617082346364, guid: 37d74a745fc2f7b41b22e09933cb2e75,
        type: 3}
    - time: 1.9166666
      value: {fileID: 2544719713018085520, guid: 37d74a745fc2f7b41b22e09933cb2e75,
        type: 3}
    - time: 2
      value: {fileID: -5090163123949953720, guid: 37d74a745fc2f7b41b22e09933cb2e75,
        type: 3}
    - time: 2.0833333
      value: {fileID: 3963040597401098669, guid: 37d74a745fc2f7b41b22e09933cb2e75,
        type: 3}
    - time: 2.1666667
      value: {fileID: 9070860634712412790, guid: 37d74a745fc2f7b41b22e09933cb2e75,
        type: 3}
    - time: 2.25
      value: {fileID: 7824263733548855431, guid: 37d74a745fc2f7b41b22e09933cb2e75,
        type: 3}
    - time: 2.3333333
      value: {fileID: -3646734668650835541, guid: 37d74a745fc2f7b41b22e09933cb2e75,
        type: 3}
    - time: 2.4166667
      value: {fileID: 2271166659672896384, guid: 37d74a745fc2f7b41b22e09933cb2e75,
        type: 3}
    - time: 2.5
      value: {fileID: -5188980968659602472, guid: 37d74a745fc2f7b41b22e09933cb2e75,
        type: 3}
    - time: 2.5833333
      value: {fileID: 3129492875397149663, guid: 37d74a745fc2f7b41b22e09933cb2e75,
        type: 3}
    - time: 2.6666667
      value: {fileID: 1539100795451823111, guid: 37d74a745fc2f7b41b22e09933cb2e75,
        type: 3}
    attribute: m_Sprite
    path: 
    classID: 114
    script: {fileID: 11500000, guid: fe87c0e1cc204ed48ad3b37840f39efc, type: 3}
  m_SampleRate: 12
  m_WrapMode: 0
  m_Bounds:
    m_Center: {x: 0, y: 0, z: 0}
    m_Extent: {x: 0, y: 0, z: 0}
  m_ClipBindingConstant:
    genericBindings:
    - serializedVersion: 2
      path: 0
      attribute: 2015549526
      script: {fileID: 11500000, guid: fe87c0e1cc204ed48ad3b37840f39efc, type: 3}
      typeID: 114
      customType: 0
      isPPtrCurve: 1
    pptrCurveMapping:
    - {fileID: -1538030419464871300, guid: 37d74a745fc2f7b41b22e09933cb2e75, type: 3}
    - {fileID: -2717647891583955933, guid: 37d74a745fc2f7b41b22e09933cb2e75, type: 3}
    - {fileID: -959642332138228301, guid: 37d74a745fc2f7b41b22e09933cb2e75, type: 3}
    - {fileID: -1317514598786905740, guid: 37d74a745fc2f7b41b22e09933cb2e75, type: 3}
    - {fileID: 6128250671590355315, guid: 37d74a745fc2f7b41b22e09933cb2e75, type: 3}
    - {fileID: 8911867801277394653, guid: 37d74a745fc2f7b41b22e09933cb2e75, type: 3}
    - {fileID: -3430625979939459395, guid: 37d74a745fc2f7b41b22e09933cb2e75, type: 3}
    - {fileID: 5687425260420177087, guid: 37d74a745fc2f7b41b22e09933cb2e75, type: 3}
    - {fileID: 7298916890958228683, guid: 37d74a745fc2f7b41b22e09933cb2e75, type: 3}
    - {fileID: -542109087194500962, guid: 37d74a745fc2f7b41b22e09933cb2e75, type: 3}
    - {fileID: 822149106125071076, guid: 37d74a745fc2f7b41b22e09933cb2e75, type: 3}
    - {fileID: 906904604185756721, guid: 37d74a745fc2f7b41b22e09933cb2e75, type: 3}
    - {fileID: 2816202218438928677, guid: 37d74a745fc2f7b41b22e09933cb2e75, type: 3}
    - {fileID: -8448511498611078410, guid: 37d74a745fc2f7b41b22e09933cb2e75, type: 3}
    - {fileID: -1724212227840537477, guid: 37d74a745fc2f7b41b22e09933cb2e75, type: 3}
    - {fileID: -3172499824202287682, guid: 37d74a745fc2f7b41b22e09933cb2e75, type: 3}
    - {fileID: 5607584083297998799, guid: 37d74a745fc2f7b41b22e09933cb2e75, type: 3}
    - {fileID: -6091713680500325728, guid: 37d74a745fc2f7b41b22e09933cb2e75, type: 3}
    - {fileID: 6531626078407554121, guid: 37d74a745fc2f7b41b22e09933cb2e75, type: 3}
    - {fileID: -2546641538454495528, guid: 37d74a745fc2f7b41b22e09933cb2e75, type: 3}
    - {fileID: 7321142812402198222, guid: 37d74a745fc2f7b41b22e09933cb2e75, type: 3}
    - {fileID: 7270093783253276527, guid: 37d74a745fc2f7b41b22e09933cb2e75, type: 3}
    - {fileID: -5050496617082346364, guid: 37d74a745fc2f7b41b22e09933cb2e75, type: 3}
    - {fileID: 2544719713018085520, guid: 37d74a745fc2f7b41b22e09933cb2e75, type: 3}
    - {fileID: -5090163123949953720, guid: 37d74a745fc2f7b41b22e09933cb2e75, type: 3}
    - {fileID: 3963040597401098669, guid: 37d74a745fc2f7b41b22e09933cb2e75, type: 3}
    - {fileID: 9070860634712412790, guid: 37d74a745fc2f7b41b22e09933cb2e75, type: 3}
    - {fileID: 7824263733548855431, guid: 37d74a745fc2f7b41b22e09933cb2e75, type: 3}
    - {fileID: -3646734668650835541, guid: 37d74a745fc2f7b41b22e09933cb2e75, type: 3}
    - {fileID: 2271166659672896384, guid: 37d74a745fc2f7b41b22e09933cb2e75, type: 3}
    - {fileID: -5188980968659602472, guid: 37d74a745fc2f7b41b22e09933cb2e75, type: 3}
    - {fileID: 3129492875397149663, guid: 37d74a745fc2f7b41b22e09933cb2e75, type: 3}
    - {fileID: 1539100795451823111, guid: 37d74a745fc2f7b41b22e09933cb2e75, type: 3}
  m_AnimationClipSettings:
    serializedVersion: 2
    m_AdditiveReferencePoseClip: {fileID: 0}
    m_AdditiveReferencePoseTime: 0
    m_StartTime: 0
    m_StopTime: 2.75
    m_OrientationOffsetY: 0
    m_Level: 0
    m_CycleOffset: 0
    m_HasAdditiveReferencePose: 0
    m_LoopTime: 0
    m_LoopBlend: 0
    m_LoopBlendOrientation: 0
    m_LoopBlendPositionY: 0
    m_LoopBlendPositionXZ: 0
    m_KeepOriginalOrientation: 0
    m_KeepOriginalPositionY: 1
    m_KeepOriginalPositionXZ: 0
    m_HeightFromFeet: 0
    m_Mirror: 0
  m_EditorCurves: []
  m_EulerEditorCurves: []
  m_HasGenericRootTransform: 0
  m_HasMotionFloatCurves: 0
  m_Events: []
