%YAML 1.1
%TAG !u! tag:unity3d.com,2011:
--- !u!74 &7400000
AnimationClip:
  m_ObjectHideFlags: 0
  m_CorrespondingSourceObject: {fileID: 0}
  m_PrefabInstance: {fileID: 0}
  m_PrefabAsset: {fileID: 0}
  m_Name: DonkeyStart
  serializedVersion: 6
  m_Legacy: 0
  m_Compressed: 0
  m_UseHighQualityCurve: 1
  m_RotationCurves: []
  m_CompressedRotationCurves: []
  m_EulerCurves: []
  m_PositionCurves: []
  m_ScaleCurves: []
  m_FloatCurves: []
  m_PPtrCurves:
  - curve:
    - time: 0
      value: {fileID: -7662878757836364794, guid: 37d74a745fc2f7b41b22e09933cb2e75,
        type: 3}
    - time: 0.083333336
      value: {fileID: 8097180834805897752, guid: 37d74a745fc2f7b41b22e09933cb2e75,
        type: 3}
    - time: 0.16666667
      value: {fileID: -4113119039209693090, guid: 37d74a745fc2f7b41b22e09933cb2e75,
        type: 3}
    - time: 0.25
      value: {fileID: -894273667583907739, guid: 37d74a745fc2f7b41b22e09933cb2e75,
        type: 3}
    - time: 0.33333334
      value: {fileID: 7424449123338072107, guid: 37d74a745fc2f7b41b22e09933cb2e75,
        type: 3}
    - time: 0.41666666
      value: {fileID: 1920558564937300374, guid: 37d74a745fc2f7b41b22e09933cb2e75,
        type: 3}
    - time: 0.5
      value: {fileID: -5378266700440465043, guid: 37d74a745fc2f7b41b22e09933cb2e75,
        type: 3}
    - time: 0.5833333
      value: {fileID: 5028178779678656846, guid: 37d74a745fc2f7b41b22e09933cb2e75,
        type: 3}
    - time: 0.6666667
      value: {fileID: 8321667612231844609, guid: 37d74a745fc2f7b41b22e09933cb2e75,
        type: 3}
    - time: 0.75
      value: {fileID: -5717468546572473095, guid: 37d74a745fc2f7b41b22e09933cb2e75,
        type: 3}
    - time: 0.8333333
      value: {fileID: -8776235170541021537, guid: 37d74a745fc2f7b41b22e09933cb2e75,
        type: 3}
    - time: 0.9166667
      value: {fileID: -948199356251457835, guid: 37d74a745fc2f7b41b22e09933cb2e75,
        type: 3}
    - time: 1
      value: {fileID: 5147301047303563167, guid: 37d74a745fc2f7b41b22e09933cb2e75,
        type: 3}
    - time: 1.0833334
      value: {fileID: -2955014257078336958, guid: 37d74a745fc2f7b41b22e09933cb2e75,
        type: 3}
    - time: 1.1666666
      value: {fileID: -5031545301599086909, guid: 37d74a745fc2f7b41b22e09933cb2e75,
        type: 3}
    - time: 1.25
      value: {fileID: -7964073686270545543, guid: 37d74a745fc2f7b41b22e09933cb2e75,
        type: 3}
    - time: 1.3333334
      value: {fileID: 2899303672191338579, guid: 37d74a745fc2f7b41b22e09933cb2e75,
        type: 3}
    - time: 1.4166666
      value: {fileID: -1628963850081072520, guid: 37d74a745fc2f7b41b22e09933cb2e75,
        type: 3}
    - time: 1.5
      value: {fileID: 2095861811703165869, guid: 37d74a745fc2f7b41b22e09933cb2e75,
        type: 3}
    - time: 1.5833334
      value: {fileID: 3121189353760933077, guid: 37d74a745fc2f7b41b22e09933cb2e75,
        type: 3}
    - time: 1.6666666
      value: {fileID: -1226667384574992190, guid: 37d74a745fc2f7b41b22e09933cb2e75,
        type: 3}
    - time: 1.75
      value: {fileID: -7034402374141773687, guid: 37d74a745fc2f7b41b22e09933cb2e75,
        type: 3}
    - time: 1.8333334
      value: {fileID: 3669097639288021873, guid: 37d74a745fc2f7b41b22e09933cb2e75,
        type: 3}
    - time: 1.9166666
      value: {fileID: 5420426976366561354, guid: 37d74a745fc2f7b41b22e09933cb2e75,
        type: 3}
    - time: 2
      value: {fileID: -8093520319898118060, guid: 37d74a745fc2f7b41b22e09933cb2e75,
        type: 3}
    attribute: m_Sprite
    path: Donkey
    classID: 114
    script: {fileID: 11500000, guid: fe87c0e1cc204ed48ad3b37840f39efc, type: 3}
  - curve:
    - time: 0
      value: {fileID: -6122847280824015827, guid: 37d74a745fc2f7b41b22e09933cb2e75,
        type: 3}
    - time: 0.083333336
      value: {fileID: 4787256976139462703, guid: 37d74a745fc2f7b41b22e09933cb2e75,
        type: 3}
    - time: 0.16666667
      value: {fileID: 32354282016941134, guid: 37d74a745fc2f7b41b22e09933cb2e75, type: 3}
    - time: 0.25
      value: {fileID: -7050690643280616402, guid: 37d74a745fc2f7b41b22e09933cb2e75,
        type: 3}
    - time: 0.33333334
      value: {fileID: -4643807862036996952, guid: 37d74a745fc2f7b41b22e09933cb2e75,
        type: 3}
    - time: 0.41666666
      value: {fileID: 1581085062968222166, guid: 37d74a745fc2f7b41b22e09933cb2e75,
        type: 3}
    - time: 0.5
      value: {fileID: -6080740544332710492, guid: 37d74a745fc2f7b41b22e09933cb2e75,
        type: 3}
    - time: 0.5833333
      value: {fileID: -3552732332831594637, guid: 37d74a745fc2f7b41b22e09933cb2e75,
        type: 3}
    - time: 0.6666667
      value: {fileID: 164083121333980738, guid: 37d74a745fc2f7b41b22e09933cb2e75,
        type: 3}
    - time: 0.75
      value: {fileID: -4383938897899493186, guid: 37d74a745fc2f7b41b22e09933cb2e75,
        type: 3}
    - time: 0.8333333
      value: {fileID: 5234474210533282157, guid: 37d74a745fc2f7b41b22e09933cb2e75,
        type: 3}
    - time: 0.9166667
      value: {fileID: -4278620494534965952, guid: 37d74a745fc2f7b41b22e09933cb2e75,
        type: 3}
    - time: 1
      value: {fileID: 1730170011885435561, guid: 37d74a745fc2f7b41b22e09933cb2e75,
        type: 3}
    - time: 1.0833334
      value: {fileID: 2170320827187531032, guid: 37d74a745fc2f7b41b22e09933cb2e75,
        type: 3}
    - time: 1.1666666
      value: {fileID: 1847784714723525677, guid: 37d74a745fc2f7b41b22e09933cb2e75,
        type: 3}
    - time: 1.25
      value: {fileID: -9123961524313253815, guid: 37d74a745fc2f7b41b22e09933cb2e75,
        type: 3}
    - time: 1.3333334
      value: {fileID: -2957998347219701820, guid: 37d74a745fc2f7b41b22e09933cb2e75,
        type: 3}
    - time: 1.4166666
      value: {fileID: 9011711553968473503, guid: 37d74a745fc2f7b41b22e09933cb2e75,
        type: 3}
    - time: 1.5
      value: {fileID: -1811215934759157874, guid: 37d74a745fc2f7b41b22e09933cb2e75,
        type: 3}
    - time: 1.5833334
      value: {fileID: -1829661605431411440, guid: 37d74a745fc2f7b41b22e09933cb2e75,
        type: 3}
    - time: 1.6666666
      value: {fileID: 8823039391261365900, guid: 37d74a745fc2f7b41b22e09933cb2e75,
        type: 3}
    - time: 1.75
      value: {fileID: -7173249044844587794, guid: 37d74a745fc2f7b41b22e09933cb2e75,
        type: 3}
    - time: 1.8333334
      value: {fileID: -4911150839722004201, guid: 37d74a745fc2f7b41b22e09933cb2e75,
        type: 3}
    - time: 1.9166666
      value: {fileID: 6164643715451112676, guid: 37d74a745fc2f7b41b22e09933cb2e75,
        type: 3}
    - time: 2
      value: {fileID: 4940657192548169671, guid: 37d74a745fc2f7b41b22e09933cb2e75,
        type: 3}
    attribute: m_Sprite
    path: Cry
    classID: 114
    script: {fileID: 11500000, guid: fe87c0e1cc204ed48ad3b37840f39efc, type: 3}
  - curve:
    - time: 0
      value: {fileID: 4321211639357218534, guid: 37d74a745fc2f7b41b22e09933cb2e75,
        type: 3}
    - time: 0.083333336
      value: {fileID: -6302934695516453887, guid: 37d74a745fc2f7b41b22e09933cb2e75,
        type: 3}
    - time: 0.16666667
      value: {fileID: -4303018108134668863, guid: 37d74a745fc2f7b41b22e09933cb2e75,
        type: 3}
    - time: 0.25
      value: {fileID: 9114549830241164892, guid: 37d74a745fc2f7b41b22e09933cb2e75,
        type: 3}
    - time: 0.33333334
      value: {fileID: -2636796654814868032, guid: 37d74a745fc2f7b41b22e09933cb2e75,
        type: 3}
    - time: 0.41666666
      value: {fileID: -7509467732877921626, guid: 37d74a745fc2f7b41b22e09933cb2e75,
        type: 3}
    - time: 0.5
      value: {fileID: 5008268222178442532, guid: 37d74a745fc2f7b41b22e09933cb2e75,
        type: 3}
    - time: 0.5833333
      value: {fileID: -3623315787744496118, guid: 37d74a745fc2f7b41b22e09933cb2e75,
        type: 3}
    - time: 0.6666667
      value: {fileID: -164845412202008424, guid: 37d74a745fc2f7b41b22e09933cb2e75,
        type: 3}
    - time: 0.75
      value: {fileID: -9217830828714146402, guid: 37d74a745fc2f7b41b22e09933cb2e75,
        type: 3}
    - time: 0.8333333
      value: {fileID: -8145681575626721783, guid: 37d74a745fc2f7b41b22e09933cb2e75,
        type: 3}
    - time: 0.9166667
      value: {fileID: 427658232761806290, guid: 37d74a745fc2f7b41b22e09933cb2e75,
        type: 3}
    - time: 1
      value: {fileID: 4163237897140276789, guid: 37d74a745fc2f7b41b22e09933cb2e75,
        type: 3}
    - time: 1.0833334
      value: {fileID: -2535048243854559620, guid: 37d74a745fc2f7b41b22e09933cb2e75,
        type: 3}
    - time: 1.1666666
      value: {fileID: -7830368339587138779, guid: 37d74a745fc2f7b41b22e09933cb2e75,
        type: 3}
    - time: 1.25
      value: {fileID: 8517042519090622834, guid: 37d74a745fc2f7b41b22e09933cb2e75,
        type: 3}
    - time: 1.3333334
      value: {fileID: -3241900138164878143, guid: 37d74a745fc2f7b41b22e09933cb2e75,
        type: 3}
    - time: 1.4166666
      value: {fileID: 6542831460715671728, guid: 37d74a745fc2f7b41b22e09933cb2e75,
        type: 3}
    - time: 1.5
      value: {fileID: 5842247149873664998, guid: 37d74a745fc2f7b41b22e09933cb2e75,
        type: 3}
    - time: 1.5833334
      value: {fileID: -3203747365741110056, guid: 37d74a745fc2f7b41b22e09933cb2e75,
        type: 3}
    - time: 1.6666666
      value: {fileID: -8827671462374148747, guid: 37d74a745fc2f7b41b22e09933cb2e75,
        type: 3}
    - time: 1.75
      value: {fileID: 4816863081132039565, guid: 37d74a745fc2f7b41b22e09933cb2e75,
        type: 3}
    - time: 1.8333334
      value: {fileID: 7469572500671711613, guid: 37d74a745fc2f7b41b22e09933cb2e75,
        type: 3}
    - time: 1.9166666
      value: {fileID: 8198430521566637004, guid: 37d74a745fc2f7b41b22e09933cb2e75,
        type: 3}
    - time: 2
      value: {fileID: 3606036780798255084, guid: 37d74a745fc2f7b41b22e09933cb2e75,
        type: 3}
    attribute: m_Sprite
    path: Glasses
    classID: 114
    script: {fileID: 11500000, guid: fe87c0e1cc204ed48ad3b37840f39efc, type: 3}
  m_SampleRate: 12
  m_WrapMode: 0
  m_Bounds:
    m_Center: {x: 0, y: 0, z: 0}
    m_Extent: {x: 0, y: 0, z: 0}
  m_ClipBindingConstant:
    genericBindings:
    - serializedVersion: 2
      path: 2420243406
      attribute: 2015549526
      script: {fileID: 11500000, guid: fe87c0e1cc204ed48ad3b37840f39efc, type: 3}
      typeID: 114
      customType: 0
      isPPtrCurve: 1
    - serializedVersion: 2
      path: 3108845671
      attribute: 2015549526
      script: {fileID: 11500000, guid: fe87c0e1cc204ed48ad3b37840f39efc, type: 3}
      typeID: 114
      customType: 0
      isPPtrCurve: 1
    - serializedVersion: 2
      path: 958358346
      attribute: 2015549526
      script: {fileID: 11500000, guid: fe87c0e1cc204ed48ad3b37840f39efc, type: 3}
      typeID: 114
      customType: 0
      isPPtrCurve: 1
    pptrCurveMapping:
    - {fileID: -7662878757836364794, guid: 37d74a745fc2f7b41b22e09933cb2e75, type: 3}
    - {fileID: 8097180834805897752, guid: 37d74a745fc2f7b41b22e09933cb2e75, type: 3}
    - {fileID: -4113119039209693090, guid: 37d74a745fc2f7b41b22e09933cb2e75, type: 3}
    - {fileID: -894273667583907739, guid: 37d74a745fc2f7b41b22e09933cb2e75, type: 3}
    - {fileID: 7424449123338072107, guid: 37d74a745fc2f7b41b22e09933cb2e75, type: 3}
    - {fileID: 1920558564937300374, guid: 37d74a745fc2f7b41b22e09933cb2e75, type: 3}
    - {fileID: -5378266700440465043, guid: 37d74a745fc2f7b41b22e09933cb2e75, type: 3}
    - {fileID: 5028178779678656846, guid: 37d74a745fc2f7b41b22e09933cb2e75, type: 3}
    - {fileID: 8321667612231844609, guid: 37d74a745fc2f7b41b22e09933cb2e75, type: 3}
    - {fileID: -5717468546572473095, guid: 37d74a745fc2f7b41b22e09933cb2e75, type: 3}
    - {fileID: -8776235170541021537, guid: 37d74a745fc2f7b41b22e09933cb2e75, type: 3}
    - {fileID: -948199356251457835, guid: 37d74a745fc2f7b41b22e09933cb2e75, type: 3}
    - {fileID: 5147301047303563167, guid: 37d74a745fc2f7b41b22e09933cb2e75, type: 3}
    - {fileID: -2955014257078336958, guid: 37d74a745fc2f7b41b22e09933cb2e75, type: 3}
    - {fileID: -5031545301599086909, guid: 37d74a745fc2f7b41b22e09933cb2e75, type: 3}
    - {fileID: -7964073686270545543, guid: 37d74a745fc2f7b41b22e09933cb2e75, type: 3}
    - {fileID: 2899303672191338579, guid: 37d74a745fc2f7b41b22e09933cb2e75, type: 3}
    - {fileID: -1628963850081072520, guid: 37d74a745fc2f7b41b22e09933cb2e75, type: 3}
    - {fileID: 2095861811703165869, guid: 37d74a745fc2f7b41b22e09933cb2e75, type: 3}
    - {fileID: 3121189353760933077, guid: 37d74a745fc2f7b41b22e09933cb2e75, type: 3}
    - {fileID: -1226667384574992190, guid: 37d74a745fc2f7b41b22e09933cb2e75, type: 3}
    - {fileID: -7034402374141773687, guid: 37d74a745fc2f7b41b22e09933cb2e75, type: 3}
    - {fileID: 3669097639288021873, guid: 37d74a745fc2f7b41b22e09933cb2e75, type: 3}
    - {fileID: 5420426976366561354, guid: 37d74a745fc2f7b41b22e09933cb2e75, type: 3}
    - {fileID: -8093520319898118060, guid: 37d74a745fc2f7b41b22e09933cb2e75, type: 3}
    - {fileID: -6122847280824015827, guid: 37d74a745fc2f7b41b22e09933cb2e75, type: 3}
    - {fileID: 4787256976139462703, guid: 37d74a745fc2f7b41b22e09933cb2e75, type: 3}
    - {fileID: 32354282016941134, guid: 37d74a745fc2f7b41b22e09933cb2e75, type: 3}
    - {fileID: -7050690643280616402, guid: 37d74a745fc2f7b41b22e09933cb2e75, type: 3}
    - {fileID: -4643807862036996952, guid: 37d74a745fc2f7b41b22e09933cb2e75, type: 3}
    - {fileID: 1581085062968222166, guid: 37d74a745fc2f7b41b22e09933cb2e75, type: 3}
    - {fileID: -6080740544332710492, guid: 37d74a745fc2f7b41b22e09933cb2e75, type: 3}
    - {fileID: -3552732332831594637, guid: 37d74a745fc2f7b41b22e09933cb2e75, type: 3}
    - {fileID: 164083121333980738, guid: 37d74a745fc2f7b41b22e09933cb2e75, type: 3}
    - {fileID: -4383938897899493186, guid: 37d74a745fc2f7b41b22e09933cb2e75, type: 3}
    - {fileID: 5234474210533282157, guid: 37d74a745fc2f7b41b22e09933cb2e75, type: 3}
    - {fileID: -4278620494534965952, guid: 37d74a745fc2f7b41b22e09933cb2e75, type: 3}
    - {fileID: 1730170011885435561, guid: 37d74a745fc2f7b41b22e09933cb2e75, type: 3}
    - {fileID: 2170320827187531032, guid: 37d74a745fc2f7b41b22e09933cb2e75, type: 3}
    - {fileID: 1847784714723525677, guid: 37d74a745fc2f7b41b22e09933cb2e75, type: 3}
    - {fileID: -9123961524313253815, guid: 37d74a745fc2f7b41b22e09933cb2e75, type: 3}
    - {fileID: -2957998347219701820, guid: 37d74a745fc2f7b41b22e09933cb2e75, type: 3}
    - {fileID: 9011711553968473503, guid: 37d74a745fc2f7b41b22e09933cb2e75, type: 3}
    - {fileID: -1811215934759157874, guid: 37d74a745fc2f7b41b22e09933cb2e75, type: 3}
    - {fileID: -1829661605431411440, guid: 37d74a745fc2f7b41b22e09933cb2e75, type: 3}
    - {fileID: 8823039391261365900, guid: 37d74a745fc2f7b41b22e09933cb2e75, type: 3}
    - {fileID: -7173249044844587794, guid: 37d74a745fc2f7b41b22e09933cb2e75, type: 3}
    - {fileID: -4911150839722004201, guid: 37d74a745fc2f7b41b22e09933cb2e75, type: 3}
    - {fileID: 6164643715451112676, guid: 37d74a745fc2f7b41b22e09933cb2e75, type: 3}
    - {fileID: 4940657192548169671, guid: 37d74a745fc2f7b41b22e09933cb2e75, type: 3}
    - {fileID: 4321211639357218534, guid: 37d74a745fc2f7b41b22e09933cb2e75, type: 3}
    - {fileID: -6302934695516453887, guid: 37d74a745fc2f7b41b22e09933cb2e75, type: 3}
    - {fileID: -4303018108134668863, guid: 37d74a745fc2f7b41b22e09933cb2e75, type: 3}
    - {fileID: 9114549830241164892, guid: 37d74a745fc2f7b41b22e09933cb2e75, type: 3}
    - {fileID: -2636796654814868032, guid: 37d74a745fc2f7b41b22e09933cb2e75, type: 3}
    - {fileID: -7509467732877921626, guid: 37d74a745fc2f7b41b22e09933cb2e75, type: 3}
    - {fileID: 5008268222178442532, guid: 37d74a745fc2f7b41b22e09933cb2e75, type: 3}
    - {fileID: -3623315787744496118, guid: 37d74a745fc2f7b41b22e09933cb2e75, type: 3}
    - {fileID: -164845412202008424, guid: 37d74a745fc2f7b41b22e09933cb2e75, type: 3}
    - {fileID: -9217830828714146402, guid: 37d74a745fc2f7b41b22e09933cb2e75, type: 3}
    - {fileID: -8145681575626721783, guid: 37d74a745fc2f7b41b22e09933cb2e75, type: 3}
    - {fileID: 427658232761806290, guid: 37d74a745fc2f7b41b22e09933cb2e75, type: 3}
    - {fileID: 4163237897140276789, guid: 37d74a745fc2f7b41b22e09933cb2e75, type: 3}
    - {fileID: -2535048243854559620, guid: 37d74a745fc2f7b41b22e09933cb2e75, type: 3}
    - {fileID: -7830368339587138779, guid: 37d74a745fc2f7b41b22e09933cb2e75, type: 3}
    - {fileID: 8517042519090622834, guid: 37d74a745fc2f7b41b22e09933cb2e75, type: 3}
    - {fileID: -3241900138164878143, guid: 37d74a745fc2f7b41b22e09933cb2e75, type: 3}
    - {fileID: 6542831460715671728, guid: 37d74a745fc2f7b41b22e09933cb2e75, type: 3}
    - {fileID: 5842247149873664998, guid: 37d74a745fc2f7b41b22e09933cb2e75, type: 3}
    - {fileID: -3203747365741110056, guid: 37d74a745fc2f7b41b22e09933cb2e75, type: 3}
    - {fileID: -8827671462374148747, guid: 37d74a745fc2f7b41b22e09933cb2e75, type: 3}
    - {fileID: 4816863081132039565, guid: 37d74a745fc2f7b41b22e09933cb2e75, type: 3}
    - {fileID: 7469572500671711613, guid: 37d74a745fc2f7b41b22e09933cb2e75, type: 3}
    - {fileID: 8198430521566637004, guid: 37d74a745fc2f7b41b22e09933cb2e75, type: 3}
    - {fileID: 3606036780798255084, guid: 37d74a745fc2f7b41b22e09933cb2e75, type: 3}
  m_AnimationClipSettings:
    serializedVersion: 2
    m_AdditiveReferencePoseClip: {fileID: 0}
    m_AdditiveReferencePoseTime: 0
    m_StartTime: 0
    m_StopTime: 2.0833333
    m_OrientationOffsetY: 0
    m_Level: 0
    m_CycleOffset: 0
    m_HasAdditiveReferencePose: 0
    m_LoopTime: 1
    m_LoopBlend: 0
    m_LoopBlendOrientation: 0
    m_LoopBlendPositionY: 0
    m_LoopBlendPositionXZ: 0
    m_KeepOriginalOrientation: 0
    m_KeepOriginalPositionY: 1
    m_KeepOriginalPositionXZ: 0
    m_HeightFromFeet: 0
    m_Mirror: 0
  m_EditorCurves: []
  m_EulerEditorCurves: []
  m_HasGenericRootTransform: 0
  m_HasMotionFloatCurves: 0
  m_Events: []
