%YAML 1.1
%TAG !u! tag:unity3d.com,2011:
--- !u!74 &7400000
AnimationClip:
  m_ObjectHideFlags: 0
  m_CorrespondingSourceObject: {fileID: 0}
  m_PrefabInstance: {fileID: 0}
  m_PrefabAsset: {fileID: 0}
  m_Name: i
  serializedVersion: 6
  m_Legacy: 0
  m_Compressed: 0
  m_UseHighQualityCurve: 1
  m_RotationCurves: []
  m_CompressedRotationCurves: []
  m_EulerCurves: []
  m_PositionCurves: []
  m_ScaleCurves: []
  m_FloatCurves: []
  m_PPtrCurves:
  - curve:
    - time: 0
      value: {fileID: 1700536723419532640, guid: 37d74a745fc2f7b41b22e09933cb2e75,
        type: 3}
    - time: 0.083333336
      value: {fileID: -6382114057700631131, guid: 37d74a745fc2f7b41b22e09933cb2e75,
        type: 3}
    - time: 0.16666667
      value: {fileID: -883852387165247722, guid: 37d74a745fc2f7b41b22e09933cb2e75,
        type: 3}
    - time: 0.25
      value: {fileID: 6987439012626181128, guid: 37d74a745fc2f7b41b22e09933cb2e75,
        type: 3}
    - time: 0.33333334
      value: {fileID: -2883022562059028006, guid: 37d74a745fc2f7b41b22e09933cb2e75,
        type: 3}
    - time: 0.41666666
      value: {fileID: -8222583208737198836, guid: 37d74a745fc2f7b41b22e09933cb2e75,
        type: 3}
    - time: 0.5
      value: {fileID: 5554165129274703132, guid: 37d74a745fc2f7b41b22e09933cb2e75,
        type: 3}
    - time: 0.5833333
      value: {fileID: -8345398720682392103, guid: 37d74a745fc2f7b41b22e09933cb2e75,
        type: 3}
    - time: 0.6666667
      value: {fileID: 2146910955794695856, guid: 37d74a745fc2f7b41b22e09933cb2e75,
        type: 3}
    - time: 0.75
      value: {fileID: 7138176378173823614, guid: 37d74a745fc2f7b41b22e09933cb2e75,
        type: 3}
    - time: 0.8333333
      value: {fileID: 190689250727433205, guid: 37d74a745fc2f7b41b22e09933cb2e75,
        type: 3}
    - time: 0.9166667
      value: {fileID: 3054898403430125769, guid: 37d74a745fc2f7b41b22e09933cb2e75,
        type: 3}
    - time: 1
      value: {fileID: 8028166382037819395, guid: 37d74a745fc2f7b41b22e09933cb2e75,
        type: 3}
    - time: 1.0833334
      value: {fileID: 7747441102435907615, guid: 37d74a745fc2f7b41b22e09933cb2e75,
        type: 3}
    - time: 1.1666666
      value: {fileID: -6102648869546375055, guid: 37d74a745fc2f7b41b22e09933cb2e75,
        type: 3}
    - time: 1.25
      value: {fileID: 2926489253791072701, guid: 37d74a745fc2f7b41b22e09933cb2e75,
        type: 3}
    - time: 1.3333334
      value: {fileID: -1634748181154316550, guid: 37d74a745fc2f7b41b22e09933cb2e75,
        type: 3}
    - time: 1.4166666
      value: {fileID: -9110062791113122832, guid: 37d74a745fc2f7b41b22e09933cb2e75,
        type: 3}
    - time: 1.5
      value: {fileID: 5192439239026239114, guid: 37d74a745fc2f7b41b22e09933cb2e75,
        type: 3}
    - time: 1.5833334
      value: {fileID: -5212471181374689376, guid: 37d74a745fc2f7b41b22e09933cb2e75,
        type: 3}
    - time: 1.6666666
      value: {fileID: 3104552609138127948, guid: 37d74a745fc2f7b41b22e09933cb2e75,
        type: 3}
    - time: 1.75
      value: {fileID: 3548665702723696190, guid: 37d74a745fc2f7b41b22e09933cb2e75,
        type: 3}
    - time: 1.8333334
      value: {fileID: -7420443247920778049, guid: 37d74a745fc2f7b41b22e09933cb2e75,
        type: 3}
    - time: 1.9166666
      value: {fileID: -5390320442383270078, guid: 37d74a745fc2f7b41b22e09933cb2e75,
        type: 3}
    - time: 2
      value: {fileID: -7124156440639954146, guid: 37d74a745fc2f7b41b22e09933cb2e75,
        type: 3}
    - time: 2.0833333
      value: {fileID: 6076622440927450419, guid: 37d74a745fc2f7b41b22e09933cb2e75,
        type: 3}
    - time: 2.1666667
      value: {fileID: 8939806710517800781, guid: 37d74a745fc2f7b41b22e09933cb2e75,
        type: 3}
    - time: 2.25
      value: {fileID: 6974353162545838739, guid: 37d74a745fc2f7b41b22e09933cb2e75,
        type: 3}
    - time: 2.3333333
      value: {fileID: -5177349140973902197, guid: 37d74a745fc2f7b41b22e09933cb2e75,
        type: 3}
    - time: 2.4166667
      value: {fileID: 8076982612507351195, guid: 37d74a745fc2f7b41b22e09933cb2e75,
        type: 3}
    - time: 2.5
      value: {fileID: -352771191279141593, guid: 37d74a745fc2f7b41b22e09933cb2e75,
        type: 3}
    - time: 2.5833333
      value: {fileID: -6027438799184753223, guid: 37d74a745fc2f7b41b22e09933cb2e75,
        type: 3}
    - time: 2.6666667
      value: {fileID: 207901600105059279, guid: 37d74a745fc2f7b41b22e09933cb2e75,
        type: 3}
    - time: 2.75
      value: {fileID: 165209850712433462, guid: 37d74a745fc2f7b41b22e09933cb2e75,
        type: 3}
    attribute: m_Sprite
    path: 
    classID: 114
    script: {fileID: 11500000, guid: fe87c0e1cc204ed48ad3b37840f39efc, type: 3}
  m_SampleRate: 12
  m_WrapMode: 0
  m_Bounds:
    m_Center: {x: 0, y: 0, z: 0}
    m_Extent: {x: 0, y: 0, z: 0}
  m_ClipBindingConstant:
    genericBindings:
    - serializedVersion: 2
      path: 0
      attribute: 2015549526
      script: {fileID: 11500000, guid: fe87c0e1cc204ed48ad3b37840f39efc, type: 3}
      typeID: 114
      customType: 0
      isPPtrCurve: 1
    pptrCurveMapping:
    - {fileID: 1700536723419532640, guid: 37d74a745fc2f7b41b22e09933cb2e75, type: 3}
    - {fileID: -6382114057700631131, guid: 37d74a745fc2f7b41b22e09933cb2e75, type: 3}
    - {fileID: -883852387165247722, guid: 37d74a745fc2f7b41b22e09933cb2e75, type: 3}
    - {fileID: 6987439012626181128, guid: 37d74a745fc2f7b41b22e09933cb2e75, type: 3}
    - {fileID: -2883022562059028006, guid: 37d74a745fc2f7b41b22e09933cb2e75, type: 3}
    - {fileID: -8222583208737198836, guid: 37d74a745fc2f7b41b22e09933cb2e75, type: 3}
    - {fileID: 5554165129274703132, guid: 37d74a745fc2f7b41b22e09933cb2e75, type: 3}
    - {fileID: -8345398720682392103, guid: 37d74a745fc2f7b41b22e09933cb2e75, type: 3}
    - {fileID: 2146910955794695856, guid: 37d74a745fc2f7b41b22e09933cb2e75, type: 3}
    - {fileID: 7138176378173823614, guid: 37d74a745fc2f7b41b22e09933cb2e75, type: 3}
    - {fileID: 190689250727433205, guid: 37d74a745fc2f7b41b22e09933cb2e75, type: 3}
    - {fileID: 3054898403430125769, guid: 37d74a745fc2f7b41b22e09933cb2e75, type: 3}
    - {fileID: 8028166382037819395, guid: 37d74a745fc2f7b41b22e09933cb2e75, type: 3}
    - {fileID: 7747441102435907615, guid: 37d74a745fc2f7b41b22e09933cb2e75, type: 3}
    - {fileID: -6102648869546375055, guid: 37d74a745fc2f7b41b22e09933cb2e75, type: 3}
    - {fileID: 2926489253791072701, guid: 37d74a745fc2f7b41b22e09933cb2e75, type: 3}
    - {fileID: -1634748181154316550, guid: 37d74a745fc2f7b41b22e09933cb2e75, type: 3}
    - {fileID: -9110062791113122832, guid: 37d74a745fc2f7b41b22e09933cb2e75, type: 3}
    - {fileID: 5192439239026239114, guid: 37d74a745fc2f7b41b22e09933cb2e75, type: 3}
    - {fileID: -5212471181374689376, guid: 37d74a745fc2f7b41b22e09933cb2e75, type: 3}
    - {fileID: 3104552609138127948, guid: 37d74a745fc2f7b41b22e09933cb2e75, type: 3}
    - {fileID: 3548665702723696190, guid: 37d74a745fc2f7b41b22e09933cb2e75, type: 3}
    - {fileID: -7420443247920778049, guid: 37d74a745fc2f7b41b22e09933cb2e75, type: 3}
    - {fileID: -5390320442383270078, guid: 37d74a745fc2f7b41b22e09933cb2e75, type: 3}
    - {fileID: -7124156440639954146, guid: 37d74a745fc2f7b41b22e09933cb2e75, type: 3}
    - {fileID: 6076622440927450419, guid: 37d74a745fc2f7b41b22e09933cb2e75, type: 3}
    - {fileID: 8939806710517800781, guid: 37d74a745fc2f7b41b22e09933cb2e75, type: 3}
    - {fileID: 6974353162545838739, guid: 37d74a745fc2f7b41b22e09933cb2e75, type: 3}
    - {fileID: -5177349140973902197, guid: 37d74a745fc2f7b41b22e09933cb2e75, type: 3}
    - {fileID: 8076982612507351195, guid: 37d74a745fc2f7b41b22e09933cb2e75, type: 3}
    - {fileID: -352771191279141593, guid: 37d74a745fc2f7b41b22e09933cb2e75, type: 3}
    - {fileID: -6027438799184753223, guid: 37d74a745fc2f7b41b22e09933cb2e75, type: 3}
    - {fileID: 207901600105059279, guid: 37d74a745fc2f7b41b22e09933cb2e75, type: 3}
    - {fileID: 165209850712433462, guid: 37d74a745fc2f7b41b22e09933cb2e75, type: 3}
  m_AnimationClipSettings:
    serializedVersion: 2
    m_AdditiveReferencePoseClip: {fileID: 0}
    m_AdditiveReferencePoseTime: 0
    m_StartTime: 0
    m_StopTime: 2.8333333
    m_OrientationOffsetY: 0
    m_Level: 0
    m_CycleOffset: 0
    m_HasAdditiveReferencePose: 0
    m_LoopTime: 0
    m_LoopBlend: 0
    m_LoopBlendOrientation: 0
    m_LoopBlendPositionY: 0
    m_LoopBlendPositionXZ: 0
    m_KeepOriginalOrientation: 0
    m_KeepOriginalPositionY: 1
    m_KeepOriginalPositionXZ: 0
    m_HeightFromFeet: 0
    m_Mirror: 0
  m_EditorCurves: []
  m_EulerEditorCurves: []
  m_HasGenericRootTransform: 0
  m_HasMotionFloatCurves: 0
  m_Events: []
