%YAML 1.1
%TAG !u! tag:unity3d.com,2011:
--- !u!74 &7400000
AnimationClip:
  m_ObjectHideFlags: 0
  m_CorrespondingSourceObject: {fileID: 0}
  m_PrefabInstance: {fileID: 0}
  m_PrefabAsset: {fileID: 0}
  m_Name: SignDiceMove
  serializedVersion: 6
  m_Legacy: 0
  m_Compressed: 0
  m_UseHighQualityCurve: 1
  m_RotationCurves: []
  m_CompressedRotationCurves: []
  m_EulerCurves:
  - curve:
      serializedVersion: 2
      m_Curve:
      - serializedVersion: 3
        time: 0
        value: {x: 3.0130002, y: -18.085001, z: 10.989}
        inSlope: {x: -32.737503, y: 164.88751, z: 4.9250007}
        outSlope: {x: -32.737503, y: 164.88751, z: 4.9250007}
        tangentMode: 0
        weightedMode: 0
        inWeight: {x: 0.33333334, y: 0.33333334, z: 0.33333334}
        outWeight: {x: 0.33333334, y: 0.33333334, z: 0.33333334}
      - serializedVersion: 3
        time: 0.08
        value: {x: 0.39400002, y: -4.894, z: 11.383}
        inSlope: {x: -34.281254, y: 172.02502, z: 0}
        outSlope: {x: -34.281254, y: 172.02502, z: 0}
        tangentMode: 0
        weightedMode: 0
        inWeight: {x: 0.33333334, y: 0.33333334, z: 0.33333334}
        outWeight: {x: 0.33333334, y: 0.33333334, z: 0.33333334}
      - serializedVersion: 3
        time: 0.16
        value: {x: -2.4720001, y: 9.439, z: 11.122001}
        inSlope: {x: -41.662502, y: 218.88126, z: -6.5249925}
        outSlope: {x: -41.662502, y: 218.88126, z: -6.5249925}
        tangentMode: 0
        weightedMode: 0
        inWeight: {x: 0.33333334, y: 0.33333334, z: 0.33333334}
        outWeight: {x: 0.33333334, y: 0.33333334, z: 0.33333334}
      - serializedVersion: 3
        time: 0.24
        value: {x: -6.2720003, y: 30.127, z: 9.527}
        inSlope: {x: -36.281254, y: 211.59378, z: -20.437504}
        outSlope: {x: -36.281254, y: 211.59378, z: -20.437504}
        tangentMode: 0
        weightedMode: 0
        inWeight: {x: 0.33333334, y: 0.33333334, z: 0.33333334}
        outWeight: {x: 0.33333334, y: 0.33333334, z: 0.33333334}
      - serializedVersion: 3
        time: 0.32
        value: {x: -8.277, y: 43.294003, z: 7.852}
        inSlope: {x: -20.875, y: 150.90625, z: -21.168749}
        outSlope: {x: -20.875, y: 150.90625, z: -21.168749}
        tangentMode: 0
        weightedMode: 0
        inWeight: {x: 0.33333334, y: 0.33333334, z: 0.33333334}
        outWeight: {x: 0.33333334, y: 0.33333334, z: 0.33333334}
      - serializedVersion: 3
        time: 0.4
        value: {x: -9.612, y: 54.272003, z: 6.1400003}
        inSlope: {x: -14.393753, y: 136.075, z: -22.562502}
        outSlope: {x: -14.393753, y: 136.075, z: -22.562502}
        tangentMode: 0
        weightedMode: 0
        inWeight: {x: 0.33333334, y: 0.33333334, z: 0.33333334}
        outWeight: {x: 0.33333334, y: 0.33333334, z: 0.33333334}
      - serializedVersion: 3
        time: 0.48
        value: {x: -10.580001, y: 65.066, z: 4.242}
        inSlope: {x: -11.1, y: 199.18752, z: -37.237503}
        outSlope: {x: -11.1, y: 199.18752, z: -37.237503}
        tangentMode: 0
        weightedMode: 0
        inWeight: {x: 0.33333334, y: 0.33333334, z: 0.33333334}
        outWeight: {x: 0.33333334, y: 0.33333334, z: 0.33333334}
      - serializedVersion: 3
        time: 0.56
        value: {x: -11.3880005, y: 86.142006, z: 0.18200001}
        inSlope: {x: 0, y: 218.93124, z: -42.462498}
        outSlope: {x: 0, y: 218.93124, z: -42.462498}
        tangentMode: 0
        weightedMode: 0
        inWeight: {x: 0.33333334, y: 0.33333334, z: 0.33333334}
        outWeight: {x: 0.33333334, y: 0.33333334, z: 0.33333334}
      - serializedVersion: 3
        time: 0.64
        value: {x: -11.104, y: 100.095, z: -2.552}
        inSlope: {x: 7.1000085, y: 222.01248, z: -41.381245}
        outSlope: {x: 7.1000085, y: 222.01248, z: -41.381245}
        tangentMode: 0
        weightedMode: 0
        inWeight: {x: 0.33333334, y: 0.33333334, z: 0.33333334}
        outWeight: {x: 0.33333334, y: 0.33333334, z: 0.33333334}
      - serializedVersion: 3
        time: 0.72
        value: {x: -9.415001, y: 121.66401, z: -6.439}
        inSlope: {x: 15.637497, y: 168.25006, z: -26.375004}
        outSlope: {x: 15.637497, y: 168.25006, z: -26.375004}
        tangentMode: 0
        weightedMode: 0
        inWeight: {x: 0.33333334, y: 0.33333334, z: 0.33333334}
        outWeight: {x: 0.33333334, y: 0.33333334, z: 0.33333334}
      - serializedVersion: 3
        time: 0.8
        value: {x: -8.602, y: 128.39401, z: -7.4940004}
        inSlope: {x: 18.837507, y: 134.74376, z: -18.762503}
        outSlope: {x: 18.837507, y: 134.74376, z: -18.762503}
        tangentMode: 0
        weightedMode: 0
        inWeight: {x: 0.33333334, y: 0.33333334, z: 0.33333334}
        outWeight: {x: 0.33333334, y: 0.33333334, z: 0.33333334}
      - serializedVersion: 3
        time: 0.88
        value: {x: -6.4010005, y: 143.223, z: -9.441}
        inSlope: {x: 31.075006, y: 189.46251, z: -20.681255}
        outSlope: {x: 31.075006, y: 189.46251, z: -20.681255}
        tangentMode: 0
        weightedMode: 0
        inWeight: {x: 0.33333334, y: 0.33333334, z: 0.33333334}
        outWeight: {x: 0.33333334, y: 0.33333334, z: 0.33333334}
      - serializedVersion: 3
        time: 0.96
        value: {x: -3.63, y: 158.70801, z: -10.803}
        inSlope: {x: 37.06251, y: 196.88753, z: -12.118753}
        outSlope: {x: 37.06251, y: 196.88753, z: -12.118753}
        tangentMode: 0
        weightedMode: 0
        inWeight: {x: 0.33333334, y: 0.33333334, z: 0.33333334}
        outWeight: {x: 0.33333334, y: 0.33333334, z: 0.33333334}
      - serializedVersion: 3
        time: 1.04
        value: {x: -0.47100002, y: 174.725, z: -11.38}
        inSlope: {x: 38.906246, y: 195.9811, z: 0}
        outSlope: {x: 38.906246, y: 195.9811, z: 0}
        tangentMode: 0
        weightedMode: 0
        inWeight: {x: 0.33333334, y: 0.33333334, z: 0.33333334}
        outWeight: {x: 0.33333334, y: 0.33333334, z: 0.33333334}
      - serializedVersion: 3
        time: 1.12
        value: {x: 2.595, y: 190.06499, z: -11.094001}
        inSlope: {x: 42.03123, y: 220.61852, z: 7.1499786}
        outSlope: {x: 42.03123, y: 220.61852, z: 7.1499786}
        tangentMode: 0
        weightedMode: 0
        inWeight: {x: 0.33333334, y: 0.33333334, z: 0.33333334}
        outWeight: {x: 0.33333334, y: 0.33333334, z: 0.33333334}
      - serializedVersion: 3
        time: 1.2
        value: {x: 6.254, y: 210.02399, z: -9.538}
        inSlope: {x: 32.587513, y: 186.94386, z: 17.356256}
        outSlope: {x: 32.587513, y: 186.94386, z: 17.356256}
        tangentMode: 0
        weightedMode: 0
        inWeight: {x: 0.33333334, y: 0.33333334, z: 0.33333334}
        outWeight: {x: 0.33333334, y: 0.33333334, z: 0.33333334}
      - serializedVersion: 3
        time: 1.28
        value: {x: 7.8090005, y: 219.976, z: -8.317}
        inSlope: {x: 17.475004, y: 120.58756, z: 16.206253}
        outSlope: {x: 17.475004, y: 120.58756, z: 16.206253}
        tangentMode: 0
        weightedMode: 0
        inWeight: {x: 0.33333334, y: 0.33333334, z: 0.33333334}
        outWeight: {x: 0.33333334, y: 0.33333334, z: 0.33333334}
      - serializedVersion: 3
        time: 1.36
        value: {x: 9.05, y: 229.318, z: -6.945}
        inSlope: {x: 18.54999, y: 174.94363, z: 28.818735}
        outSlope: {x: 18.54999, y: 174.94363, z: 28.818735}
        tangentMode: 0
        weightedMode: 0
        inWeight: {x: 0.33333334, y: 0.33333334, z: 0.33333334}
        outWeight: {x: 0.33333334, y: 0.33333334, z: 0.33333334}
      - serializedVersion: 3
        time: 1.44
        value: {x: 10.777, y: 247.967, z: -3.706}
        inSlope: {x: 14.600006, y: 227.48132, z: 41.73126}
        outSlope: {x: 14.600006, y: 227.48132, z: 41.73126}
        tangentMode: 0
        weightedMode: 0
        inWeight: {x: 0.33333334, y: 0.33333334, z: 0.33333334}
        outWeight: {x: 0.33333334, y: 0.33333334, z: 0.33333334}
      - serializedVersion: 3
        time: 1.52
        value: {x: 11.386001, y: 265.715, z: -0.268}
        inSlope: {x: 0, y: 212.27507, z: 41.30626}
        outSlope: {x: 0, y: 212.27507, z: 41.30626}
        tangentMode: 0
        weightedMode: 0
        inWeight: {x: 0.33333334, y: 0.33333334, z: 0.33333334}
        outWeight: {x: 0.33333334, y: 0.33333334, z: 0.33333334}
      - serializedVersion: 3
        time: 1.6
        value: {x: 11.018001, y: 281.931, z: 2.903}
        inSlope: {x: -9.200003, y: 228.24998, z: 42.48751}
        outSlope: {x: -9.200003, y: 228.24998, z: 42.48751}
        tangentMode: 0
        weightedMode: 0
        inWeight: {x: 0.33333334, y: 0.33333334, z: 0.33333334}
        outWeight: {x: 0.33333334, y: 0.33333334, z: 0.33333334}
      - serializedVersion: 3
        time: 1.68
        value: {x: 9.352, y: 302.235, z: 6.53}
        inSlope: {x: -17.450003, y: 183.00003, z: 31.25626}
        outSlope: {x: -17.450003, y: 183.00003, z: 31.25626}
        tangentMode: 0
        weightedMode: 0
        inWeight: {x: 0.33333334, y: 0.33333334, z: 0.33333334}
        outWeight: {x: 0.33333334, y: 0.33333334, z: 0.33333334}
      - serializedVersion: 3
        time: 1.76
        value: {x: 8.226001, y: 311.211, z: 7.9040003}
        inSlope: {x: -17.27499, y: 124.100044, z: 17.381245}
        outSlope: {x: -17.27499, y: 124.100044, z: 17.381245}
        tangentMode: 0
        weightedMode: 0
        inWeight: {x: 0.33333334, y: 0.33333334, z: 0.33333334}
        outWeight: {x: 0.33333334, y: 0.33333334, z: 0.33333334}
      - serializedVersion: 3
        time: 1.84
        value: {x: 6.5880003, y: 322.091, z: 9.311001}
        inSlope: {x: -20.474995, y: 135.99998, z: 17.587498}
        outSlope: {x: -20.474995, y: 135.99998, z: 17.587498}
        tangentMode: 0
        weightedMode: 0
        inWeight: {x: 0.33333334, y: 0.33333334, z: 0.33333334}
        outWeight: {x: 0.33333334, y: 0.33333334, z: 0.33333334}
      m_PreInfinity: 2
      m_PostInfinity: 2
      m_RotationOrder: 4
    path: 
  m_PositionCurves: []
  m_ScaleCurves: []
  m_FloatCurves: []
  m_PPtrCurves: []
  m_SampleRate: 25
  m_WrapMode: 0
  m_Bounds:
    m_Center: {x: 0, y: 0, z: 0}
    m_Extent: {x: 0, y: 0, z: 0}
  m_ClipBindingConstant:
    genericBindings:
    - serializedVersion: 2
      path: 0
      attribute: 4
      script: {fileID: 0}
      typeID: 4
      customType: 4
      isPPtrCurve: 0
    pptrCurveMapping: []
  m_AnimationClipSettings:
    serializedVersion: 2
    m_AdditiveReferencePoseClip: {fileID: 0}
    m_AdditiveReferencePoseTime: 0
    m_StartTime: 0
    m_StopTime: 1.88
    m_OrientationOffsetY: 0
    m_Level: 0
    m_CycleOffset: 0
    m_HasAdditiveReferencePose: 0
    m_LoopTime: 1
    m_LoopBlend: 0
    m_LoopBlendOrientation: 0
    m_LoopBlendPositionY: 0
    m_LoopBlendPositionXZ: 0
    m_KeepOriginalOrientation: 0
    m_KeepOriginalPositionY: 1
    m_KeepOriginalPositionXZ: 0
    m_HeightFromFeet: 0
    m_Mirror: 0
  m_EditorCurves:
  - curve:
      serializedVersion: 2
      m_Curve:
      - serializedVersion: 3
        time: 0
        value: 3.0130002
        inSlope: -32.737503
        outSlope: -32.737503
        tangentMode: 34
        weightedMode: 0
        inWeight: 0.33333334
        outWeight: 0.33333334
      - serializedVersion: 3
        time: 0.08
        value: 0.39400002
        inSlope: -34.281254
        outSlope: -34.281254
        tangentMode: 136
        weightedMode: 0
        inWeight: 0.33333334
        outWeight: 0.33333334
      - serializedVersion: 3
        time: 0.16
        value: -2.4720001
        inSlope: -41.662502
        outSlope: -41.662502
        tangentMode: 136
        weightedMode: 0
        inWeight: 0.33333334
        outWeight: 0.33333334
      - serializedVersion: 3
        time: 0.24
        value: -6.2720003
        inSlope: -36.281254
        outSlope: -36.281254
        tangentMode: 136
        weightedMode: 0
        inWeight: 0.33333334
        outWeight: 0.33333334
      - serializedVersion: 3
        time: 0.32
        value: -8.277
        inSlope: -20.875
        outSlope: -20.875
        tangentMode: 136
        weightedMode: 0
        inWeight: 0.33333334
        outWeight: 0.33333334
      - serializedVersion: 3
        time: 0.4
        value: -9.612
        inSlope: -14.393753
        outSlope: -14.393753
        tangentMode: 136
        weightedMode: 0
        inWeight: 0.33333334
        outWeight: 0.33333334
      - serializedVersion: 3
        time: 0.48
        value: -10.580001
        inSlope: -11.1
        outSlope: -11.1
        tangentMode: 136
        weightedMode: 0
        inWeight: 0.33333334
        outWeight: 0.33333334
      - serializedVersion: 3
        time: 0.56
        value: -11.3880005
        inSlope: 0
        outSlope: 0
        tangentMode: 136
        weightedMode: 0
        inWeight: 0.33333334
        outWeight: 0.33333334
      - serializedVersion: 3
        time: 0.64
        value: -11.104
        inSlope: 7.1000085
        outSlope: 7.1000085
        tangentMode: 136
        weightedMode: 0
        inWeight: 0.33333334
        outWeight: 0.33333334
      - serializedVersion: 3
        time: 0.72
        value: -9.415001
        inSlope: 15.637497
        outSlope: 15.637497
        tangentMode: 136
        weightedMode: 0
        inWeight: 0.33333334
        outWeight: 0.33333334
      - serializedVersion: 3
        time: 0.8
        value: -8.602
        inSlope: 18.837507
        outSlope: 18.837507
        tangentMode: 136
        weightedMode: 0
        inWeight: 0.33333334
        outWeight: 0.33333334
      - serializedVersion: 3
        time: 0.88
        value: -6.4010005
        inSlope: 31.075006
        outSlope: 31.075006
        tangentMode: 136
        weightedMode: 0
        inWeight: 0.33333334
        outWeight: 0.33333334
      - serializedVersion: 3
        time: 0.96
        value: -3.63
        inSlope: 37.06251
        outSlope: 37.06251
        tangentMode: 136
        weightedMode: 0
        inWeight: 0.33333334
        outWeight: 0.33333334
      - serializedVersion: 3
        time: 1.04
        value: -0.47100002
        inSlope: 38.906246
        outSlope: 38.906246
        tangentMode: 136
        weightedMode: 0
        inWeight: 0.33333334
        outWeight: 0.33333334
      - serializedVersion: 3
        time: 1.12
        value: 2.595
        inSlope: 42.03123
        outSlope: 42.03123
        tangentMode: 136
        weightedMode: 0
        inWeight: 0.33333334
        outWeight: 0.33333334
      - serializedVersion: 3
        time: 1.2
        value: 6.254
        inSlope: 32.587513
        outSlope: 32.587513
        tangentMode: 136
        weightedMode: 0
        inWeight: 0.33333334
        outWeight: 0.33333334
      - serializedVersion: 3
        time: 1.28
        value: 7.8090005
        inSlope: 17.475004
        outSlope: 17.475004
        tangentMode: 136
        weightedMode: 0
        inWeight: 0.33333334
        outWeight: 0.33333334
      - serializedVersion: 3
        time: 1.36
        value: 9.05
        inSlope: 18.54999
        outSlope: 18.54999
        tangentMode: 136
        weightedMode: 0
        inWeight: 0.33333334
        outWeight: 0.33333334
      - serializedVersion: 3
        time: 1.44
        value: 10.777
        inSlope: 14.600006
        outSlope: 14.600006
        tangentMode: 136
        weightedMode: 0
        inWeight: 0.33333334
        outWeight: 0.33333334
      - serializedVersion: 3
        time: 1.52
        value: 11.386001
        inSlope: 0
        outSlope: 0
        tangentMode: 136
        weightedMode: 0
        inWeight: 0.33333334
        outWeight: 0.33333334
      - serializedVersion: 3
        time: 1.6
        value: 11.018001
        inSlope: -9.200003
        outSlope: -9.200003
        tangentMode: 136
        weightedMode: 0
        inWeight: 0.33333334
        outWeight: 0.33333334
      - serializedVersion: 3
        time: 1.68
        value: 9.352
        inSlope: -17.450003
        outSlope: -17.450003
        tangentMode: 136
        weightedMode: 0
        inWeight: 0.33333334
        outWeight: 0.33333334
      - serializedVersion: 3
        time: 1.76
        value: 8.226001
        inSlope: -17.27499
        outSlope: -17.27499
        tangentMode: 136
        weightedMode: 0
        inWeight: 0.33333334
        outWeight: 0.33333334
      - serializedVersion: 3
        time: 1.84
        value: 6.5880003
        inSlope: -20.474995
        outSlope: -20.474995
        tangentMode: 34
        weightedMode: 0
        inWeight: 0.33333334
        outWeight: 0.33333334
      m_PreInfinity: 2
      m_PostInfinity: 2
      m_RotationOrder: 4
    attribute: localEulerAnglesRaw.x
    path: 
    classID: 4
    script: {fileID: 0}
  - curve:
      serializedVersion: 2
      m_Curve:
      - serializedVersion: 3
        time: 0
        value: -18.085001
        inSlope: 164.88751
        outSlope: 164.88751
        tangentMode: 34
        weightedMode: 0
        inWeight: 0.33333334
        outWeight: 0.33333334
      - serializedVersion: 3
        time: 0.08
        value: -4.894
        inSlope: 172.02502
        outSlope: 172.02502
        tangentMode: 136
        weightedMode: 0
        inWeight: 0.33333334
        outWeight: 0.33333334
      - serializedVersion: 3
        time: 0.16
        value: 9.439
        inSlope: 218.88126
        outSlope: 218.88126
        tangentMode: 136
        weightedMode: 0
        inWeight: 0.33333334
        outWeight: 0.33333334
      - serializedVersion: 3
        time: 0.24
        value: 30.127
        inSlope: 211.59378
        outSlope: 211.59378
        tangentMode: 136
        weightedMode: 0
        inWeight: 0.33333334
        outWeight: 0.33333334
      - serializedVersion: 3
        time: 0.32
        value: 43.294003
        inSlope: 150.90625
        outSlope: 150.90625
        tangentMode: 136
        weightedMode: 0
        inWeight: 0.33333334
        outWeight: 0.33333334
      - serializedVersion: 3
        time: 0.4
        value: 54.272003
        inSlope: 136.075
        outSlope: 136.075
        tangentMode: 136
        weightedMode: 0
        inWeight: 0.33333334
        outWeight: 0.33333334
      - serializedVersion: 3
        time: 0.48
        value: 65.066
        inSlope: 199.18752
        outSlope: 199.18752
        tangentMode: 136
        weightedMode: 0
        inWeight: 0.33333334
        outWeight: 0.33333334
      - serializedVersion: 3
        time: 0.56
        value: 86.142006
        inSlope: 218.93124
        outSlope: 218.93124
        tangentMode: 136
        weightedMode: 0
        inWeight: 0.33333334
        outWeight: 0.33333334
      - serializedVersion: 3
        time: 0.64
        value: 100.095
        inSlope: 222.01248
        outSlope: 222.01248
        tangentMode: 136
        weightedMode: 0
        inWeight: 0.33333334
        outWeight: 0.33333334
      - serializedVersion: 3
        time: 0.72
        value: 121.66401
        inSlope: 168.25006
        outSlope: 168.25006
        tangentMode: 136
        weightedMode: 0
        inWeight: 0.33333334
        outWeight: 0.33333334
      - serializedVersion: 3
        time: 0.8
        value: 128.39401
        inSlope: 134.74376
        outSlope: 134.74376
        tangentMode: 136
        weightedMode: 0
        inWeight: 0.33333334
        outWeight: 0.33333334
      - serializedVersion: 3
        time: 0.88
        value: 143.223
        inSlope: 189.46251
        outSlope: 189.46251
        tangentMode: 136
        weightedMode: 0
        inWeight: 0.33333334
        outWeight: 0.33333334
      - serializedVersion: 3
        time: 0.96
        value: 158.70801
        inSlope: 196.88753
        outSlope: 196.88753
        tangentMode: 136
        weightedMode: 0
        inWeight: 0.33333334
        outWeight: 0.33333334
      - serializedVersion: 3
        time: 1.04
        value: 174.725
        inSlope: 195.9811
        outSlope: 195.9811
        tangentMode: 136
        weightedMode: 0
        inWeight: 0.33333334
        outWeight: 0.33333334
      - serializedVersion: 3
        time: 1.12
        value: 190.06499
        inSlope: 220.61852
        outSlope: 220.61852
        tangentMode: 136
        weightedMode: 0
        inWeight: 0.33333334
        outWeight: 0.33333334
      - serializedVersion: 3
        time: 1.2
        value: 210.02399
        inSlope: 186.94386
        outSlope: 186.94386
        tangentMode: 136
        weightedMode: 0
        inWeight: 0.33333334
        outWeight: 0.33333334
      - serializedVersion: 3
        time: 1.28
        value: 219.976
        inSlope: 120.58756
        outSlope: 120.58756
        tangentMode: 136
        weightedMode: 0
        inWeight: 0.33333334
        outWeight: 0.33333334
      - serializedVersion: 3
        time: 1.36
        value: 229.318
        inSlope: 174.94363
        outSlope: 174.94363
        tangentMode: 136
        weightedMode: 0
        inWeight: 0.33333334
        outWeight: 0.33333334
      - serializedVersion: 3
        time: 1.44
        value: 247.967
        inSlope: 227.48132
        outSlope: 227.48132
        tangentMode: 136
        weightedMode: 0
        inWeight: 0.33333334
        outWeight: 0.33333334
      - serializedVersion: 3
        time: 1.52
        value: 265.715
        inSlope: 212.27507
        outSlope: 212.27507
        tangentMode: 136
        weightedMode: 0
        inWeight: 0.33333334
        outWeight: 0.33333334
      - serializedVersion: 3
        time: 1.6
        value: 281.931
        inSlope: 228.24998
        outSlope: 228.24998
        tangentMode: 136
        weightedMode: 0
        inWeight: 0.33333334
        outWeight: 0.33333334
      - serializedVersion: 3
        time: 1.68
        value: 302.235
        inSlope: 183.00003
        outSlope: 183.00003
        tangentMode: 136
        weightedMode: 0
        inWeight: 0.33333334
        outWeight: 0.33333334
      - serializedVersion: 3
        time: 1.76
        value: 311.211
        inSlope: 124.100044
        outSlope: 124.100044
        tangentMode: 136
        weightedMode: 0
        inWeight: 0.33333334
        outWeight: 0.33333334
      - serializedVersion: 3
        time: 1.84
        value: 322.091
        inSlope: 135.99998
        outSlope: 135.99998
        tangentMode: 34
        weightedMode: 0
        inWeight: 0.33333334
        outWeight: 0.33333334
      m_PreInfinity: 2
      m_PostInfinity: 2
      m_RotationOrder: 4
    attribute: localEulerAnglesRaw.y
    path: 
    classID: 4
    script: {fileID: 0}
  - curve:
      serializedVersion: 2
      m_Curve:
      - serializedVersion: 3
        time: 0
        value: 10.989
        inSlope: 4.9250007
        outSlope: 4.9250007
        tangentMode: 34
        weightedMode: 0
        inWeight: 0.33333334
        outWeight: 0.33333334
      - serializedVersion: 3
        time: 0.08
        value: 11.383
        inSlope: 0
        outSlope: 0
        tangentMode: 136
        weightedMode: 0
        inWeight: 0.33333334
        outWeight: 0.33333334
      - serializedVersion: 3
        time: 0.16
        value: 11.122001
        inSlope: -6.5249925
        outSlope: -6.5249925
        tangentMode: 136
        weightedMode: 0
        inWeight: 0.33333334
        outWeight: 0.33333334
      - serializedVersion: 3
        time: 0.24
        value: 9.527
        inSlope: -20.437504
        outSlope: -20.437504
        tangentMode: 136
        weightedMode: 0
        inWeight: 0.33333334
        outWeight: 0.33333334
      - serializedVersion: 3
        time: 0.32
        value: 7.852
        inSlope: -21.168749
        outSlope: -21.168749
        tangentMode: 136
        weightedMode: 0
        inWeight: 0.33333334
        outWeight: 0.33333334
      - serializedVersion: 3
        time: 0.4
        value: 6.1400003
        inSlope: -22.562502
        outSlope: -22.562502
        tangentMode: 136
        weightedMode: 0
        inWeight: 0.33333334
        outWeight: 0.33333334
      - serializedVersion: 3
        time: 0.48
        value: 4.242
        inSlope: -37.237503
        outSlope: -37.237503
        tangentMode: 136
        weightedMode: 0
        inWeight: 0.33333334
        outWeight: 0.33333334
      - serializedVersion: 3
        time: 0.56
        value: 0.18200001
        inSlope: -42.462498
        outSlope: -42.462498
        tangentMode: 136
        weightedMode: 0
        inWeight: 0.33333334
        outWeight: 0.33333334
      - serializedVersion: 3
        time: 0.64
        value: -2.552
        inSlope: -41.381245
        outSlope: -41.381245
        tangentMode: 136
        weightedMode: 0
        inWeight: 0.33333334
        outWeight: 0.33333334
      - serializedVersion: 3
        time: 0.72
        value: -6.439
        inSlope: -26.375004
        outSlope: -26.375004
        tangentMode: 136
        weightedMode: 0
        inWeight: 0.33333334
        outWeight: 0.33333334
      - serializedVersion: 3
        time: 0.8
        value: -7.4940004
        inSlope: -18.762503
        outSlope: -18.762503
        tangentMode: 136
        weightedMode: 0
        inWeight: 0.33333334
        outWeight: 0.33333334
      - serializedVersion: 3
        time: 0.88
        value: -9.441
        inSlope: -20.681255
        outSlope: -20.681255
        tangentMode: 136
        weightedMode: 0
        inWeight: 0.33333334
        outWeight: 0.33333334
      - serializedVersion: 3
        time: 0.96
        value: -10.803
        inSlope: -12.118753
        outSlope: -12.118753
        tangentMode: 136
        weightedMode: 0
        inWeight: 0.33333334
        outWeight: 0.33333334
      - serializedVersion: 3
        time: 1.04
        value: -11.38
        inSlope: 0
        outSlope: 0
        tangentMode: 136
        weightedMode: 0
        inWeight: 0.33333334
        outWeight: 0.33333334
      - serializedVersion: 3
        time: 1.12
        value: -11.094001
        inSlope: 7.1499786
        outSlope: 7.1499786
        tangentMode: 136
        weightedMode: 0
        inWeight: 0.33333334
        outWeight: 0.33333334
      - serializedVersion: 3
        time: 1.2
        value: -9.538
        inSlope: 17.356256
        outSlope: 17.356256
        tangentMode: 136
        weightedMode: 0
        inWeight: 0.33333334
        outWeight: 0.33333334
      - serializedVersion: 3
        time: 1.28
        value: -8.317
        inSlope: 16.206253
        outSlope: 16.206253
        tangentMode: 136
        weightedMode: 0
        inWeight: 0.33333334
        outWeight: 0.33333334
      - serializedVersion: 3
        time: 1.36
        value: -6.945
        inSlope: 28.818735
        outSlope: 28.818735
        tangentMode: 136
        weightedMode: 0
        inWeight: 0.33333334
        outWeight: 0.33333334
      - serializedVersion: 3
        time: 1.44
        value: -3.706
        inSlope: 41.73126
        outSlope: 41.73126
        tangentMode: 136
        weightedMode: 0
        inWeight: 0.33333334
        outWeight: 0.33333334
      - serializedVersion: 3
        time: 1.52
        value: -0.268
        inSlope: 41.30626
        outSlope: 41.30626
        tangentMode: 136
        weightedMode: 0
        inWeight: 0.33333334
        outWeight: 0.33333334
      - serializedVersion: 3
        time: 1.6
        value: 2.903
        inSlope: 42.48751
        outSlope: 42.48751
        tangentMode: 136
        weightedMode: 0
        inWeight: 0.33333334
        outWeight: 0.33333334
      - serializedVersion: 3
        time: 1.68
        value: 6.53
        inSlope: 31.25626
        outSlope: 31.25626
        tangentMode: 136
        weightedMode: 0
        inWeight: 0.33333334
        outWeight: 0.33333334
      - serializedVersion: 3
        time: 1.76
        value: 7.9040003
        inSlope: 17.381245
        outSlope: 17.381245
        tangentMode: 136
        weightedMode: 0
        inWeight: 0.33333334
        outWeight: 0.33333334
      - serializedVersion: 3
        time: 1.84
        value: 9.311001
        inSlope: 17.587498
        outSlope: 17.587498
        tangentMode: 34
        weightedMode: 0
        inWeight: 0.33333334
        outWeight: 0.33333334
      m_PreInfinity: 2
      m_PostInfinity: 2
      m_RotationOrder: 4
    attribute: localEulerAnglesRaw.z
    path: 
    classID: 4
    script: {fileID: 0}
  m_EulerEditorCurves:
  - curve:
      serializedVersion: 2
      m_Curve: []
      m_PreInfinity: 2
      m_PostInfinity: 2
      m_RotationOrder: 4
    attribute: m_LocalEulerAngles.x
    path: 
    classID: 4
    script: {fileID: 0}
  - curve:
      serializedVersion: 2
      m_Curve: []
      m_PreInfinity: 2
      m_PostInfinity: 2
      m_RotationOrder: 4
    attribute: m_LocalEulerAngles.y
    path: 
    classID: 4
    script: {fileID: 0}
  - curve:
      serializedVersion: 2
      m_Curve: []
      m_PreInfinity: 2
      m_PostInfinity: 2
      m_RotationOrder: 4
    attribute: m_LocalEulerAngles.z
    path: 
    classID: 4
    script: {fileID: 0}
  m_HasGenericRootTransform: 1
  m_HasMotionFloatCurves: 0
  m_Events:
  - time: 0
    functionName: SignplusOn
    data: 
    objectReferenceParameter: {fileID: 0}
    floatParameter: 0
    intParameter: 0
    messageOptions: 0
  - time: 0.44
    functionName: SignplusOff
    data: 
    objectReferenceParameter: {fileID: 0}
    floatParameter: 0
    intParameter: 0
    messageOptions: 0
  - time: 0.48
    functionName: SignminusOn
    data: 
    objectReferenceParameter: {fileID: 0}
    floatParameter: 0
    intParameter: 0
    messageOptions: 0
  - time: 0.92
    functionName: SignminusOff
    data: 
    objectReferenceParameter: {fileID: 0}
    floatParameter: 0
    intParameter: 0
    messageOptions: 0
  - time: 0.96
    functionName: signTimesOn
    data: 
    objectReferenceParameter: {fileID: 0}
    floatParameter: 0
    intParameter: 0
    messageOptions: 0
  - time: 1.4
    functionName: signTimesOff
    data: 
    objectReferenceParameter: {fileID: 0}
    floatParameter: 0
    intParameter: 0
    messageOptions: 0
  - time: 1.44
    functionName: signDivideOn
    data: 
    objectReferenceParameter: {fileID: 0}
    floatParameter: 0
    intParameter: 0
    messageOptions: 0
  - time: 1.88
    functionName: signDivideOff
    data: 
    objectReferenceParameter: {fileID: 0}
    floatParameter: 0
    intParameter: 0
    messageOptions: 0
