%YAML 1.1
%TAG !u! tag:unity3d.com,2011:
--- !u!74 &7400000
AnimationClip:
  m_ObjectHideFlags: 0
  m_CorrespondingSourceObject: {fileID: 0}
  m_PrefabInstance: {fileID: 0}
  m_PrefabAsset: {fileID: 0}
  m_Name: hand
  serializedVersion: 6
  m_Legacy: 0
  m_Compressed: 0
  m_UseHighQualityCurve: 1
  m_RotationCurves: []
  m_CompressedRotationCurves: []
  m_EulerCurves: []
  m_PositionCurves: []
  m_ScaleCurves: []
  m_FloatCurves: []
  m_PPtrCurves:
  - curve:
    - time: 0
      value: {fileID: -5515086524563610683, guid: 37d74a745fc2f7b41b22e09933cb2e75,
        type: 3}
    - time: 0.083333336
      value: {fileID: 3525333750463355636, guid: 37d74a745fc2f7b41b22e09933cb2e75,
        type: 3}
    - time: 0.16666667
      value: {fileID: 3683935351118519516, guid: 37d74a745fc2f7b41b22e09933cb2e75,
        type: 3}
    - time: 0.25
      value: {fileID: -551800799720222291, guid: 37d74a745fc2f7b41b22e09933cb2e75,
        type: 3}
    - time: 0.33333334
      value: {fileID: -2388951403755765690, guid: 37d74a745fc2f7b41b22e09933cb2e75,
        type: 3}
    - time: 0.41666666
      value: {fileID: 7898377405369466560, guid: 37d74a745fc2f7b41b22e09933cb2e75,
        type: 3}
    - time: 0.5
      value: {fileID: 2144280634414921164, guid: 37d74a745fc2f7b41b22e09933cb2e75,
        type: 3}
    - time: 0.5833333
      value: {fileID: -2220161407627866738, guid: 37d74a745fc2f7b41b22e09933cb2e75,
        type: 3}
    - time: 0.6666667
      value: {fileID: -6520069603264318119, guid: 37d74a745fc2f7b41b22e09933cb2e75,
        type: 3}
    - time: 0.75
      value: {fileID: 5247663779887879897, guid: 37d74a745fc2f7b41b22e09933cb2e75,
        type: 3}
    - time: 0.8333333
      value: {fileID: 8552291361964153910, guid: 37d74a745fc2f7b41b22e09933cb2e75,
        type: 3}
    - time: 0.9166667
      value: {fileID: -1707706605899390599, guid: 37d74a745fc2f7b41b22e09933cb2e75,
        type: 3}
    - time: 1
      value: {fileID: 5831403466524956815, guid: 37d74a745fc2f7b41b22e09933cb2e75,
        type: 3}
    - time: 1.0833334
      value: {fileID: -1459346768290952026, guid: 37d74a745fc2f7b41b22e09933cb2e75,
        type: 3}
    - time: 1.1666666
      value: {fileID: -353447447398195880, guid: 37d74a745fc2f7b41b22e09933cb2e75,
        type: 3}
    - time: 1.25
      value: {fileID: 1849498780867451000, guid: 37d74a745fc2f7b41b22e09933cb2e75,
        type: 3}
    - time: 1.3333334
      value: {fileID: 6575379359064843427, guid: 37d74a745fc2f7b41b22e09933cb2e75,
        type: 3}
    - time: 1.4166666
      value: {fileID: -2361209474195318225, guid: 37d74a745fc2f7b41b22e09933cb2e75,
        type: 3}
    - time: 1.5
      value: {fileID: 4757951205155200043, guid: 37d74a745fc2f7b41b22e09933cb2e75,
        type: 3}
    - time: 1.5833334
      value: {fileID: 6918681691396078925, guid: 37d74a745fc2f7b41b22e09933cb2e75,
        type: 3}
    - time: 1.6666666
      value: {fileID: -4123585290705058382, guid: 37d74a745fc2f7b41b22e09933cb2e75,
        type: 3}
    - time: 1.75
      value: {fileID: -8980443809092891054, guid: 37d74a745fc2f7b41b22e09933cb2e75,
        type: 3}
    - time: 1.8333334
      value: {fileID: 937728419505718109, guid: 37d74a745fc2f7b41b22e09933cb2e75,
        type: 3}
    - time: 1.9166666
      value: {fileID: -2335305369164494120, guid: 37d74a745fc2f7b41b22e09933cb2e75,
        type: 3}
    - time: 2
      value: {fileID: -6652932197818491434, guid: 37d74a745fc2f7b41b22e09933cb2e75,
        type: 3}
    - time: 2.0833333
      value: {fileID: -9021454676945603822, guid: 37d74a745fc2f7b41b22e09933cb2e75,
        type: 3}
    - time: 2.1666667
      value: {fileID: -4149860821845521185, guid: 37d74a745fc2f7b41b22e09933cb2e75,
        type: 3}
    - time: 2.25
      value: {fileID: 6328979353115679047, guid: 37d74a745fc2f7b41b22e09933cb2e75,
        type: 3}
    - time: 2.3333333
      value: {fileID: -6518240991267262460, guid: 37d74a745fc2f7b41b22e09933cb2e75,
        type: 3}
    attribute: m_Sprite
    path: 
    classID: 114
    script: {fileID: 11500000, guid: fe87c0e1cc204ed48ad3b37840f39efc, type: 3}
  m_SampleRate: 12
  m_WrapMode: 0
  m_Bounds:
    m_Center: {x: 0, y: 0, z: 0}
    m_Extent: {x: 0, y: 0, z: 0}
  m_ClipBindingConstant:
    genericBindings:
    - serializedVersion: 2
      path: 0
      attribute: 2015549526
      script: {fileID: 11500000, guid: fe87c0e1cc204ed48ad3b37840f39efc, type: 3}
      typeID: 114
      customType: 0
      isPPtrCurve: 1
    pptrCurveMapping:
    - {fileID: -5515086524563610683, guid: 37d74a745fc2f7b41b22e09933cb2e75, type: 3}
    - {fileID: 3525333750463355636, guid: 37d74a745fc2f7b41b22e09933cb2e75, type: 3}
    - {fileID: 3683935351118519516, guid: 37d74a745fc2f7b41b22e09933cb2e75, type: 3}
    - {fileID: -551800799720222291, guid: 37d74a745fc2f7b41b22e09933cb2e75, type: 3}
    - {fileID: -2388951403755765690, guid: 37d74a745fc2f7b41b22e09933cb2e75, type: 3}
    - {fileID: 7898377405369466560, guid: 37d74a745fc2f7b41b22e09933cb2e75, type: 3}
    - {fileID: 2144280634414921164, guid: 37d74a745fc2f7b41b22e09933cb2e75, type: 3}
    - {fileID: -2220161407627866738, guid: 37d74a745fc2f7b41b22e09933cb2e75, type: 3}
    - {fileID: -6520069603264318119, guid: 37d74a745fc2f7b41b22e09933cb2e75, type: 3}
    - {fileID: 5247663779887879897, guid: 37d74a745fc2f7b41b22e09933cb2e75, type: 3}
    - {fileID: 8552291361964153910, guid: 37d74a745fc2f7b41b22e09933cb2e75, type: 3}
    - {fileID: -1707706605899390599, guid: 37d74a745fc2f7b41b22e09933cb2e75, type: 3}
    - {fileID: 5831403466524956815, guid: 37d74a745fc2f7b41b22e09933cb2e75, type: 3}
    - {fileID: -1459346768290952026, guid: 37d74a745fc2f7b41b22e09933cb2e75, type: 3}
    - {fileID: -353447447398195880, guid: 37d74a745fc2f7b41b22e09933cb2e75, type: 3}
    - {fileID: 1849498780867451000, guid: 37d74a745fc2f7b41b22e09933cb2e75, type: 3}
    - {fileID: 6575379359064843427, guid: 37d74a745fc2f7b41b22e09933cb2e75, type: 3}
    - {fileID: -2361209474195318225, guid: 37d74a745fc2f7b41b22e09933cb2e75, type: 3}
    - {fileID: 4757951205155200043, guid: 37d74a745fc2f7b41b22e09933cb2e75, type: 3}
    - {fileID: 6918681691396078925, guid: 37d74a745fc2f7b41b22e09933cb2e75, type: 3}
    - {fileID: -4123585290705058382, guid: 37d74a745fc2f7b41b22e09933cb2e75, type: 3}
    - {fileID: -8980443809092891054, guid: 37d74a745fc2f7b41b22e09933cb2e75, type: 3}
    - {fileID: 937728419505718109, guid: 37d74a745fc2f7b41b22e09933cb2e75, type: 3}
    - {fileID: -2335305369164494120, guid: 37d74a745fc2f7b41b22e09933cb2e75, type: 3}
    - {fileID: -6652932197818491434, guid: 37d74a745fc2f7b41b22e09933cb2e75, type: 3}
    - {fileID: -9021454676945603822, guid: 37d74a745fc2f7b41b22e09933cb2e75, type: 3}
    - {fileID: -4149860821845521185, guid: 37d74a745fc2f7b41b22e09933cb2e75, type: 3}
    - {fileID: 6328979353115679047, guid: 37d74a745fc2f7b41b22e09933cb2e75, type: 3}
    - {fileID: -6518240991267262460, guid: 37d74a745fc2f7b41b22e09933cb2e75, type: 3}
  m_AnimationClipSettings:
    serializedVersion: 2
    m_AdditiveReferencePoseClip: {fileID: 0}
    m_AdditiveReferencePoseTime: 0
    m_StartTime: 0
    m_StopTime: 2.4166665
    m_OrientationOffsetY: 0
    m_Level: 0
    m_CycleOffset: 0
    m_HasAdditiveReferencePose: 0
    m_LoopTime: 0
    m_LoopBlend: 0
    m_LoopBlendOrientation: 0
    m_LoopBlendPositionY: 0
    m_LoopBlendPositionXZ: 0
    m_KeepOriginalOrientation: 0
    m_KeepOriginalPositionY: 1
    m_KeepOriginalPositionXZ: 0
    m_HeightFromFeet: 0
    m_Mirror: 0
  m_EditorCurves: []
  m_EulerEditorCurves: []
  m_HasGenericRootTransform: 0
  m_HasMotionFloatCurves: 0
  m_Events: []
