%YAML 1.1
%TAG !u! tag:unity3d.com,2011:
--- !u!74 &7400000
AnimationClip:
  m_ObjectHideFlags: 0
  m_CorrespondingSourceObject: {fileID: 0}
  m_PrefabInstance: {fileID: 0}
  m_PrefabAsset: {fileID: 0}
  m_Name: donkey
  serializedVersion: 6
  m_Legacy: 0
  m_Compressed: 0
  m_UseHighQualityCurve: 1
  m_RotationCurves: []
  m_CompressedRotationCurves: []
  m_EulerCurves: []
  m_PositionCurves: []
  m_ScaleCurves: []
  m_FloatCurves: []
  m_PPtrCurves:
  - curve:
    - time: 0
      value: {fileID: -8769622043295221799, guid: 37d74a745fc2f7b41b22e09933cb2e75,
        type: 3}
    - time: 0.083333336
      value: {fileID: -7205357752771210638, guid: 37d74a745fc2f7b41b22e09933cb2e75,
        type: 3}
    - time: 0.16666667
      value: {fileID: -6167137975879281772, guid: 37d74a745fc2f7b41b22e09933cb2e75,
        type: 3}
    - time: 0.25
      value: {fileID: 90981090923995115, guid: 37d74a745fc2f7b41b22e09933cb2e75, type: 3}
    - time: 0.33333334
      value: {fileID: -7662878757836364794, guid: 37d74a745fc2f7b41b22e09933cb2e75,
        type: 3}
    - time: 0.41666666
      value: {fileID: 8097180834805897752, guid: 37d74a745fc2f7b41b22e09933cb2e75,
        type: 3}
    - time: 0.5
      value: {fileID: -4113119039209693090, guid: 37d74a745fc2f7b41b22e09933cb2e75,
        type: 3}
    - time: 0.5833333
      value: {fileID: -894273667583907739, guid: 37d74a745fc2f7b41b22e09933cb2e75,
        type: 3}
    - time: 0.6666667
      value: {fileID: 7424449123338072107, guid: 37d74a745fc2f7b41b22e09933cb2e75,
        type: 3}
    - time: 0.75
      value: {fileID: 1920558564937300374, guid: 37d74a745fc2f7b41b22e09933cb2e75,
        type: 3}
    - time: 0.8333333
      value: {fileID: -5378266700440465043, guid: 37d74a745fc2f7b41b22e09933cb2e75,
        type: 3}
    - time: 0.9166667
      value: {fileID: 5028178779678656846, guid: 37d74a745fc2f7b41b22e09933cb2e75,
        type: 3}
    - time: 1
      value: {fileID: 8321667612231844609, guid: 37d74a745fc2f7b41b22e09933cb2e75,
        type: 3}
    - time: 1.0833334
      value: {fileID: -5717468546572473095, guid: 37d74a745fc2f7b41b22e09933cb2e75,
        type: 3}
    - time: 1.1666666
      value: {fileID: -8776235170541021537, guid: 37d74a745fc2f7b41b22e09933cb2e75,
        type: 3}
    - time: 1.25
      value: {fileID: -948199356251457835, guid: 37d74a745fc2f7b41b22e09933cb2e75,
        type: 3}
    - time: 1.3333334
      value: {fileID: 5147301047303563167, guid: 37d74a745fc2f7b41b22e09933cb2e75,
        type: 3}
    - time: 1.4166666
      value: {fileID: -2955014257078336958, guid: 37d74a745fc2f7b41b22e09933cb2e75,
        type: 3}
    - time: 1.5
      value: {fileID: -5031545301599086909, guid: 37d74a745fc2f7b41b22e09933cb2e75,
        type: 3}
    - time: 1.5833334
      value: {fileID: -7964073686270545543, guid: 37d74a745fc2f7b41b22e09933cb2e75,
        type: 3}
    - time: 1.6666666
      value: {fileID: 2899303672191338579, guid: 37d74a745fc2f7b41b22e09933cb2e75,
        type: 3}
    - time: 1.75
      value: {fileID: -1628963850081072520, guid: 37d74a745fc2f7b41b22e09933cb2e75,
        type: 3}
    - time: 1.8333334
      value: {fileID: 2095861811703165869, guid: 37d74a745fc2f7b41b22e09933cb2e75,
        type: 3}
    - time: 1.9166666
      value: {fileID: 3121189353760933077, guid: 37d74a745fc2f7b41b22e09933cb2e75,
        type: 3}
    - time: 2
      value: {fileID: -1226667384574992190, guid: 37d74a745fc2f7b41b22e09933cb2e75,
        type: 3}
    - time: 2.0833333
      value: {fileID: -7034402374141773687, guid: 37d74a745fc2f7b41b22e09933cb2e75,
        type: 3}
    - time: 2.1666667
      value: {fileID: 3669097639288021873, guid: 37d74a745fc2f7b41b22e09933cb2e75,
        type: 3}
    - time: 2.25
      value: {fileID: 5420426976366561354, guid: 37d74a745fc2f7b41b22e09933cb2e75,
        type: 3}
    - time: 2.3333333
      value: {fileID: -8093520319898118060, guid: 37d74a745fc2f7b41b22e09933cb2e75,
        type: 3}
    - time: 2.4166667
      value: {fileID: 8579789534021112252, guid: 37d74a745fc2f7b41b22e09933cb2e75,
        type: 3}
    - time: 2.5
      value: {fileID: -5303969910438935691, guid: 37d74a745fc2f7b41b22e09933cb2e75,
        type: 3}
    - time: 2.5833333
      value: {fileID: -3675388249202396968, guid: 37d74a745fc2f7b41b22e09933cb2e75,
        type: 3}
    - time: 2.6666667
      value: {fileID: 1322925901323501066, guid: 37d74a745fc2f7b41b22e09933cb2e75,
        type: 3}
    attribute: m_Sprite
    path: 
    classID: 114
    script: {fileID: 11500000, guid: fe87c0e1cc204ed48ad3b37840f39efc, type: 3}
  m_SampleRate: 12
  m_WrapMode: 0
  m_Bounds:
    m_Center: {x: 0, y: 0, z: 0}
    m_Extent: {x: 0, y: 0, z: 0}
  m_ClipBindingConstant:
    genericBindings:
    - serializedVersion: 2
      path: 0
      attribute: 2015549526
      script: {fileID: 11500000, guid: fe87c0e1cc204ed48ad3b37840f39efc, type: 3}
      typeID: 114
      customType: 0
      isPPtrCurve: 1
    pptrCurveMapping:
    - {fileID: -8769622043295221799, guid: 37d74a745fc2f7b41b22e09933cb2e75, type: 3}
    - {fileID: -7205357752771210638, guid: 37d74a745fc2f7b41b22e09933cb2e75, type: 3}
    - {fileID: -6167137975879281772, guid: 37d74a745fc2f7b41b22e09933cb2e75, type: 3}
    - {fileID: 90981090923995115, guid: 37d74a745fc2f7b41b22e09933cb2e75, type: 3}
    - {fileID: -7662878757836364794, guid: 37d74a745fc2f7b41b22e09933cb2e75, type: 3}
    - {fileID: 8097180834805897752, guid: 37d74a745fc2f7b41b22e09933cb2e75, type: 3}
    - {fileID: -4113119039209693090, guid: 37d74a745fc2f7b41b22e09933cb2e75, type: 3}
    - {fileID: -894273667583907739, guid: 37d74a745fc2f7b41b22e09933cb2e75, type: 3}
    - {fileID: 7424449123338072107, guid: 37d74a745fc2f7b41b22e09933cb2e75, type: 3}
    - {fileID: 1920558564937300374, guid: 37d74a745fc2f7b41b22e09933cb2e75, type: 3}
    - {fileID: -5378266700440465043, guid: 37d74a745fc2f7b41b22e09933cb2e75, type: 3}
    - {fileID: 5028178779678656846, guid: 37d74a745fc2f7b41b22e09933cb2e75, type: 3}
    - {fileID: 8321667612231844609, guid: 37d74a745fc2f7b41b22e09933cb2e75, type: 3}
    - {fileID: -5717468546572473095, guid: 37d74a745fc2f7b41b22e09933cb2e75, type: 3}
    - {fileID: -8776235170541021537, guid: 37d74a745fc2f7b41b22e09933cb2e75, type: 3}
    - {fileID: -948199356251457835, guid: 37d74a745fc2f7b41b22e09933cb2e75, type: 3}
    - {fileID: 5147301047303563167, guid: 37d74a745fc2f7b41b22e09933cb2e75, type: 3}
    - {fileID: -2955014257078336958, guid: 37d74a745fc2f7b41b22e09933cb2e75, type: 3}
    - {fileID: -5031545301599086909, guid: 37d74a745fc2f7b41b22e09933cb2e75, type: 3}
    - {fileID: -7964073686270545543, guid: 37d74a745fc2f7b41b22e09933cb2e75, type: 3}
    - {fileID: 2899303672191338579, guid: 37d74a745fc2f7b41b22e09933cb2e75, type: 3}
    - {fileID: -1628963850081072520, guid: 37d74a745fc2f7b41b22e09933cb2e75, type: 3}
    - {fileID: 2095861811703165869, guid: 37d74a745fc2f7b41b22e09933cb2e75, type: 3}
    - {fileID: 3121189353760933077, guid: 37d74a745fc2f7b41b22e09933cb2e75, type: 3}
    - {fileID: -1226667384574992190, guid: 37d74a745fc2f7b41b22e09933cb2e75, type: 3}
    - {fileID: -7034402374141773687, guid: 37d74a745fc2f7b41b22e09933cb2e75, type: 3}
    - {fileID: 3669097639288021873, guid: 37d74a745fc2f7b41b22e09933cb2e75, type: 3}
    - {fileID: 5420426976366561354, guid: 37d74a745fc2f7b41b22e09933cb2e75, type: 3}
    - {fileID: -8093520319898118060, guid: 37d74a745fc2f7b41b22e09933cb2e75, type: 3}
    - {fileID: 8579789534021112252, guid: 37d74a745fc2f7b41b22e09933cb2e75, type: 3}
    - {fileID: -5303969910438935691, guid: 37d74a745fc2f7b41b22e09933cb2e75, type: 3}
    - {fileID: -3675388249202396968, guid: 37d74a745fc2f7b41b22e09933cb2e75, type: 3}
    - {fileID: 1322925901323501066, guid: 37d74a745fc2f7b41b22e09933cb2e75, type: 3}
  m_AnimationClipSettings:
    serializedVersion: 2
    m_AdditiveReferencePoseClip: {fileID: 0}
    m_AdditiveReferencePoseTime: 0
    m_StartTime: 0
    m_StopTime: 2.75
    m_OrientationOffsetY: 0
    m_Level: 0
    m_CycleOffset: 0
    m_HasAdditiveReferencePose: 0
    m_LoopTime: 1
    m_LoopBlend: 0
    m_LoopBlendOrientation: 0
    m_LoopBlendPositionY: 0
    m_LoopBlendPositionXZ: 0
    m_KeepOriginalOrientation: 0
    m_KeepOriginalPositionY: 1
    m_KeepOriginalPositionXZ: 0
    m_HeightFromFeet: 0
    m_Mirror: 0
  m_EditorCurves: []
  m_EulerEditorCurves: []
  m_HasGenericRootTransform: 0
  m_HasMotionFloatCurves: 0
  m_Events: []
