%YAML 1.1
%TAG !u! tag:unity3d.com,2011:
--- !u!74 &7400000
AnimationClip:
  m_ObjectHideFlags: 0
  m_CorrespondingSourceObject: {fileID: 0}
  m_PrefabInstance: {fileID: 0}
  m_PrefabAsset: {fileID: 0}
  m_Name: Fims2
  serializedVersion: 6
  m_Legacy: 0
  m_Compressed: 0
  m_UseHighQualityCurve: 1
  m_RotationCurves: []
  m_CompressedRotationCurves: []
  m_EulerCurves: []
  m_PositionCurves: []
  m_ScaleCurves: []
  m_FloatCurves: []
  m_PPtrCurves:
  - curve:
    - time: 0
      value: {fileID: -3590908731946744996, guid: 3b91f648dcdc63c4cb0ee4c3e026815b,
        type: 3}
    - time: 0.11666667
      value: {fileID: 7160316587167497213, guid: 3b91f648dcdc63c4cb0ee4c3e026815b,
        type: 3}
    - time: 0.21666667
      value: {fileID: -7785232562736339410, guid: 3b91f648dcdc63c4cb0ee4c3e026815b,
        type: 3}
    - time: 0.33333334
      value: {fileID: 4438540480868141147, guid: 3b91f648dcdc63c4cb0ee4c3e026815b,
        type: 3}
    - time: 0.4
      value: {fileID: -8996774205618301634, guid: 3b91f648dcdc63c4cb0ee4c3e026815b,
        type: 3}
    - time: 0.51666665
      value: {fileID: -5949553190765461263, guid: 3b91f648dcdc63c4cb0ee4c3e026815b,
        type: 3}
    - time: 0.6166667
      value: {fileID: 7491689842988235775, guid: 3b91f648dcdc63c4cb0ee4c3e026815b,
        type: 3}
    - time: 0.75
      value: {fileID: -3400131798580693986, guid: 3b91f648dcdc63c4cb0ee4c3e026815b,
        type: 3}
    - time: 0.8333333
      value: {fileID: 4397730179904628804, guid: 3b91f648dcdc63c4cb0ee4c3e026815b,
        type: 3}
    - time: 0.95
      value: {fileID: -577063595820242172, guid: 3b91f648dcdc63c4cb0ee4c3e026815b,
        type: 3}
    - time: 1.05
      value: {fileID: 7073834617437134743, guid: 3b91f648dcdc63c4cb0ee4c3e026815b,
        type: 3}
    - time: 1.1333333
      value: {fileID: 7073834617437134743, guid: 3b91f648dcdc63c4cb0ee4c3e026815b,
        type: 3}
    - time: 1.1666666
      value: {fileID: -2162367644586315340, guid: 3b91f648dcdc63c4cb0ee4c3e026815b,
        type: 3}
    attribute: m_Sprite
    path: 
    classID: 114
    script: {fileID: 11500000, guid: fe87c0e1cc204ed48ad3b37840f39efc, type: 3}
  m_SampleRate: 60
  m_WrapMode: 0
  m_Bounds:
    m_Center: {x: 0, y: 0, z: 0}
    m_Extent: {x: 0, y: 0, z: 0}
  m_ClipBindingConstant:
    genericBindings:
    - serializedVersion: 2
      path: 0
      attribute: 2015549526
      script: {fileID: 11500000, guid: fe87c0e1cc204ed48ad3b37840f39efc, type: 3}
      typeID: 114
      customType: 0
      isPPtrCurve: 1
    pptrCurveMapping:
    - {fileID: -3590908731946744996, guid: 3b91f648dcdc63c4cb0ee4c3e026815b, type: 3}
    - {fileID: 7160316587167497213, guid: 3b91f648dcdc63c4cb0ee4c3e026815b, type: 3}
    - {fileID: -7785232562736339410, guid: 3b91f648dcdc63c4cb0ee4c3e026815b, type: 3}
    - {fileID: 4438540480868141147, guid: 3b91f648dcdc63c4cb0ee4c3e026815b, type: 3}
    - {fileID: -8996774205618301634, guid: 3b91f648dcdc63c4cb0ee4c3e026815b, type: 3}
    - {fileID: -5949553190765461263, guid: 3b91f648dcdc63c4cb0ee4c3e026815b, type: 3}
    - {fileID: 7491689842988235775, guid: 3b91f648dcdc63c4cb0ee4c3e026815b, type: 3}
    - {fileID: -3400131798580693986, guid: 3b91f648dcdc63c4cb0ee4c3e026815b, type: 3}
    - {fileID: 4397730179904628804, guid: 3b91f648dcdc63c4cb0ee4c3e026815b, type: 3}
    - {fileID: -577063595820242172, guid: 3b91f648dcdc63c4cb0ee4c3e026815b, type: 3}
    - {fileID: 7073834617437134743, guid: 3b91f648dcdc63c4cb0ee4c3e026815b, type: 3}
    - {fileID: 7073834617437134743, guid: 3b91f648dcdc63c4cb0ee4c3e026815b, type: 3}
    - {fileID: -2162367644586315340, guid: 3b91f648dcdc63c4cb0ee4c3e026815b, type: 3}
  m_AnimationClipSettings:
    serializedVersion: 2
    m_AdditiveReferencePoseClip: {fileID: 0}
    m_AdditiveReferencePoseTime: 0
    m_StartTime: 0
    m_StopTime: 1.1833333
    m_OrientationOffsetY: 0
    m_Level: 0
    m_CycleOffset: 0
    m_HasAdditiveReferencePose: 0
    m_LoopTime: 0
    m_LoopBlend: 0
    m_LoopBlendOrientation: 0
    m_LoopBlendPositionY: 0
    m_LoopBlendPositionXZ: 0
    m_KeepOriginalOrientation: 0
    m_KeepOriginalPositionY: 1
    m_KeepOriginalPositionXZ: 0
    m_HeightFromFeet: 0
    m_Mirror: 0
  m_EditorCurves: []
  m_EulerEditorCurves: []
  m_HasGenericRootTransform: 0
  m_HasMotionFloatCurves: 0
  m_Events:
  - time: 1.1666666
    functionName: ClosePopUP
    data: 
    objectReferenceParameter: {fileID: 0}
    floatParameter: 0
    intParameter: 0
    messageOptions: 0
