%YAML 1.1
%TAG !u! tag:unity3d.com,2011:
--- !u!114 &11400000
MonoBehaviour:
  m_ObjectHideFlags: 0
  m_CorrespondingSourceObject: {fileID: 0}
  m_PrefabInstance: {fileID: 0}
  m_PrefabAsset: {fileID: 0}
  m_GameObject: {fileID: 0}
  m_Enabled: 1
  m_EditorHideFlags: 0
  m_Script: {fileID: 11500000, guid: c6569a8594504e8aa07143dea7d55046, type: 3}
  m_Name: satan 2_2
  m_EditorClassIdentifier: 
  thumbnail: {fileID: 21300000, guid: 96fe8b1254d584046bdae66abf1eed2c, type: 3}
  title: satan 2_2
  description: "There were two stab wounds on Jesus\u2019 body: one on his chest
    and the other on his stomach. "
  NestedID: 
  nestedClue: []
  tagFound: 
