%YAML 1.1
%TAG !u! tag:unity3d.com,2011:
--- !u!114 &11400000
MonoBehaviour:
  m_ObjectHideFlags: 0
  m_CorrespondingSourceObject: {fileID: 0}
  m_PrefabInstance: {fileID: 0}
  m_PrefabAsset: {fileID: 0}
  m_GameObject: {fileID: 0}
  m_Enabled: 1
  m_EditorHideFlags: 0
  m_Script: {fileID: 11500000, guid: c6569a8594504e8aa07143dea7d55046, type: 3}
  m_Name: Cabin3
  m_EditorClassIdentifier: 
  thumbnail: {fileID: 21300000, guid: 45d0bccb102931b4291b248499f667d3, type: 3}
  title: Cabin3
  description: '3. A large box of heroin packaged in small bags was found. The heroin
    was all sealed in the bags, except one was open and used. '
  NestedID: 
  nestedClue: []
  tagFound: 
