%YAML 1.1
%TAG !u! tag:unity3d.com,2011:
--- !u!114 &11400000
MonoBehaviour:
  m_ObjectHideFlags: 0
  m_CorrespondingSourceObject: {fileID: 0}
  m_PrefabInstance: {fileID: 0}
  m_PrefabAsset: {fileID: 0}
  m_GameObject: {fileID: 0}
  m_Enabled: 1
  m_EditorHideFlags: 0
  m_Script: {fileID: 11500000, guid: c6569a8594504e8aa07143dea7d55046, type: 3}
  m_Name: Linda_1
  m_EditorClassIdentifier: 
  thumbnail: {fileID: 21300000, guid: 8f3faae0d44f36d4d9339d6459e7fd17, type: 3}
  title: Linda_1
  description: Linda is wearing gloves. She claims that this is a way to prevent
    aliens from reading her mind.
  NestedID: 
  nestedClue:
  - {fileID: 11400000, guid: 61714eb6d688a354ca9f5aa6a7b704d5, type: 2}
  tagFound: 
