%YAML 1.1
%TAG !u! tag:unity3d.com,2011:
--- !u!114 &11400000
MonoBehaviour:
  m_ObjectHideFlags: 0
  m_CorrespondingSourceObject: {fileID: 0}
  m_PrefabInstance: {fileID: 0}
  m_PrefabAsset: {fileID: 0}
  m_GameObject: {fileID: 0}
  m_Enabled: 1
  m_EditorHideFlags: 0
  m_Script: {fileID: 11500000, guid: c8ba372dd8584834fb659304ec4601ee, type: 3}
  m_Name: Question 1
  m_EditorClassIdentifier: 
  questionName: Who killed Rick Martin?
  questionText: 
  answers:
  - text: Bobby Herrerra
    correctSprite: {fileID: 0}
    incorrectSprite: {fileID: 0}
  - text: Fiona McAllister
    correctSprite: {fileID: 0}
    incorrectSprite: {fileID: 0}
  - text: Harold Chun
    correctSprite: {fileID: 0}
    incorrectSprite: {fileID: 0}
  - text: Louis Cagliostro
    correctSprite: {fileID: 0}
    incorrectSprite: {fileID: 0}
  - text: Margaret Chun
    correctSprite: {fileID: 0}
    incorrectSprite: {fileID: 0}
  - text: Pauline Thompson
    correctSprite: {fileID: 0}
    incorrectSprite: {fileID: 0}
  - text: Tim Kane
    correctSprite: {fileID: 0}
    incorrectSprite: {fileID: 0}
  correctAnswerIndex: 6
  wasCorrect: 0
  reward: 6
  scoringConditions: []
