%YAML 1.1
%TAG !u! tag:unity3d.com,2011:
--- !u!114 &11400000
MonoBehaviour:
  m_ObjectHideFlags: 0
  m_CorrespondingSourceObject: {fileID: 0}
  m_PrefabInstance: {fileID: 0}
  m_PrefabAsset: {fileID: 0}
  m_GameObject: {fileID: 0}
  m_Enabled: 1
  m_EditorHideFlags: 0
  m_Script: {fileID: 11500000, guid: c8ba372dd8584834fb659304ec4601ee, type: 3}
  m_Name: Question1
  m_EditorClassIdentifier: 
  questionName: '1. Who killed Jake?



    <size=40>(The killer please do not vote
    for yourself.)</size>'
  questionText: 
  answers:
  - text: Shawn
    correctSprite: {fileID: 0}
    incorrectSprite: {fileID: 0}
  - text: Eileen
    correctSprite: {fileID: 0}
    incorrectSprite: {fileID: 0}
  - text: Taya
    correctSprite: {fileID: 0}
    incorrectSprite: {fileID: 0}
  - text: Lily
    correctSprite: {fileID: 21300000, guid: 02793131931c4944a80b0ac0217065a3, type: 3}
    incorrectSprite: {fileID: -337351728639113470, guid: 91d159e3466a76b4a9fd0d35aa36110f,
      type: 3}
  - text: Raziel
    correctSprite: {fileID: 0}
    incorrectSprite: {fileID: 0}
  correctAnswerIndex: 3
  wasCorrect: 0
  reward: 6
  scoringConditions: []
