%YAML 1.1
%TAG !u! tag:unity3d.com,2011:
--- !u!1 &6321711964913770900
GameObject:
  m_ObjectHideFlags: 0
  m_CorrespondingSourceObject: {fileID: 0}
  m_PrefabInstance: {fileID: 0}
  m_PrefabAsset: {fileID: 0}
  serializedVersion: 6
  m_Component:
  - component: {fileID: 6321711964913770898}
  - component: {fileID: 6321711964913770901}
  m_Layer: 0
  m_Name: GameManager
  m_TagString: Untagged
  m_Icon: {fileID: 0}
  m_NavMeshLayer: 0
  m_StaticEditorFlags: 0
  m_IsActive: 1
--- !u!4 &6321711964913770898
Transform:
  m_ObjectHideFlags: 0
  m_CorrespondingSourceObject: {fileID: 0}
  m_PrefabInstance: {fileID: 0}
  m_PrefabAsset: {fileID: 0}
  m_GameObject: {fileID: 6321711964913770900}
  m_LocalRotation: {x: 0, y: 0, z: 0, w: 1}
  m_LocalPosition: {x: 0, y: 0, z: 0}
  m_LocalScale: {x: 1, y: 1, z: 1}
  m_Children: []
  m_Father: {fileID: 0}
  m_RootOrder: 0
  m_LocalEulerAnglesHint: {x: 0, y: 0, z: 0}
--- !u!114 &6321711964913770901
MonoBehaviour:
  m_ObjectHideFlags: 0
  m_CorrespondingSourceObject: {fileID: 0}
  m_PrefabInstance: {fileID: 0}
  m_PrefabAsset: {fileID: 0}
  m_GameObject: {fileID: 6321711964913770900}
  m_Enabled: 1
  m_EditorHideFlags: 0
  m_Script: {fileID: 11500000, guid: 6ff3723cefe64396a0f9517194786a42, type: 3}
  m_Name: 
  m_EditorClassIdentifier: 
  isPersistant: 0
  configsPerRound:
  - roundName: 0
    onRoundStarted:
      m_PersistentCalls:
        m_Calls:
        - m_Target: {fileID: 0}
          m_TargetAssemblyTypeName: TMPro.TMP_Text, Unity.TextMeshPro
          m_MethodName: set_text
          m_Mode: 5
          m_Arguments:
            m_ObjectArgument: {fileID: 0}
            m_ObjectArgumentAssemblyTypeName: UnityEngine.Object, UnityEngine
            m_IntArgument: 0
            m_FloatArgument: 0
            m_StringArgument: Self Intro
            m_BoolArgument: 0
          m_CallState: 2
        - m_Target: {fileID: 0}
          m_TargetAssemblyTypeName: UnityEngine.AudioSource, UnityEngine
          m_MethodName: Play
          m_Mode: 1
          m_Arguments:
            m_ObjectArgument: {fileID: 0}
            m_ObjectArgumentAssemblyTypeName: UnityEngine.Object, UnityEngine
            m_IntArgument: 0
            m_FloatArgument: 0
            m_StringArgument: 
            m_BoolArgument: 0
          m_CallState: 2
    roundDescription: "Read your script carefully. \r\nUnderstand your story and
      \r\npurpose."
  - roundName: 1
    onRoundStarted:
      m_PersistentCalls:
        m_Calls:
        - m_Target: {fileID: 0}
          m_TargetAssemblyTypeName: TMPro.TMP_Text, Unity.TextMeshPro
          m_MethodName: set_text
          m_Mode: 5
          m_Arguments:
            m_ObjectArgument: {fileID: 0}
            m_ObjectArgumentAssemblyTypeName: UnityEngine.Object, UnityEngine
            m_IntArgument: 0
            m_FloatArgument: 0
            m_StringArgument: Search for clues
            m_BoolArgument: 0
          m_CallState: 2
    roundDescription: "Make a brief self-introduction\r\nto understand the relationship\r\nbetween
      you and other \r\ncharacters."
  - roundName: 2
    onRoundStarted:
      m_PersistentCalls:
        m_Calls:
        - m_Target: {fileID: 0}
          m_TargetAssemblyTypeName: TMPro.TMP_Text, Unity.TextMeshPro
          m_MethodName: set_text
          m_Mode: 5
          m_Arguments:
            m_ObjectArgument: {fileID: 0}
            m_ObjectArgumentAssemblyTypeName: UnityEngine.Object, UnityEngine
            m_IntArgument: 0
            m_FloatArgument: 0
            m_StringArgument: Next Round
            m_BoolArgument: 0
          m_CallState: 2
    roundDescription: "Click around to find clues. Fully\r\nexamine and analyze all
      the \r\nclues. "
  - roundName: 3
    onRoundStarted:
      m_PersistentCalls:
        m_Calls:
        - m_Target: {fileID: 0}
          m_TargetAssemblyTypeName: TMPro.TMP_Text, Unity.TextMeshPro
          m_MethodName: set_text
          m_Mode: 5
          m_Arguments:
            m_ObjectArgument: {fileID: 0}
            m_ObjectArgumentAssemblyTypeName: UnityEngine.Object, UnityEngine
            m_IntArgument: 0
            m_FloatArgument: 0
            m_StringArgument: Discussion
            m_BoolArgument: 0
          m_CallState: 2
    roundDescription: "Click around to find clues. Fully\r\nexamine and analyze all
      the \r\nclues. "
  - roundName: 4
    onRoundStarted:
      m_PersistentCalls:
        m_Calls:
        - m_Target: {fileID: 0}
          m_TargetAssemblyTypeName: TMPro.TMP_Text, Unity.TextMeshPro
          m_MethodName: set_text
          m_Mode: 5
          m_Arguments:
            m_ObjectArgument: {fileID: 0}
            m_ObjectArgumentAssemblyTypeName: UnityEngine.Object, UnityEngine
            m_IntArgument: 0
            m_FloatArgument: 0
            m_StringArgument: Voting
            m_BoolArgument: 0
          m_CallState: 2
    roundDescription: Fully communicate with each other to compare your stories and
      to solve the mystery.
  - roundName: 5
    onRoundStarted:
      m_PersistentCalls:
        m_Calls:
        - m_Target: {fileID: 0}
          m_TargetAssemblyTypeName: TMPro.TMP_Text, Unity.TextMeshPro
          m_MethodName: set_text
          m_Mode: 5
          m_Arguments:
            m_ObjectArgument: {fileID: 0}
            m_ObjectArgumentAssemblyTypeName: UnityEngine.Object, UnityEngine
            m_IntArgument: 0
            m_FloatArgument: 0
            m_StringArgument: Results
            m_BoolArgument: 0
          m_CallState: 2
    roundDescription: Voting phase
  - roundName: 6
    onRoundStarted:
      m_PersistentCalls:
        m_Calls:
        - m_Target: {fileID: 0}
          m_TargetAssemblyTypeName: TMPro.TMP_Text, Unity.TextMeshPro
          m_MethodName: set_text
          m_Mode: 5
          m_Arguments:
            m_ObjectArgument: {fileID: 0}
            m_ObjectArgumentAssemblyTypeName: UnityEngine.Object, UnityEngine
            m_IntArgument: 0
            m_FloatArgument: 0
            m_StringArgument: Truth
            m_BoolArgument: 0
          m_CallState: 2
    roundDescription: Results phase
