%YAML 1.1
%TAG !u! tag:unity3d.com,2011:
--- !u!114 &11400000
MonoBehaviour:
  m_ObjectHideFlags: 0
  m_CorrespondingSourceObject: {fileID: 0}
  m_PrefabInstance: {fileID: 0}
  m_PrefabAsset: {fileID: 0}
  m_GameObject: {fileID: 0}
  m_Enabled: 1
  m_EditorHideFlags: 0
  m_Script: {fileID: 11500000, guid: c8ba372dd8584834fb659304ec4601ee, type: 3}
  m_Name: Question 2
  m_EditorClassIdentifier: 
  questionName: '1. Who killed Lawrence Baker?

'
  questionText: 
  answers:
  - text: Richard Smithal
    correctSprite: {fileID: 0}
    incorrectSprite: {fileID: 0}
  - text: Trinity Smith
    correctSprite: {fileID: 0}
    incorrectSprite: {fileID: 0}
  - text: Tom White
    correctSprite: {fileID: 21300000, guid: 02793131931c4944a80b0ac0217065a3, type: 3}
    incorrectSprite: {fileID: -337351728639113470, guid: 91d159e3466a76b4a9fd0d35aa36110f,
      type: 3}
  - text: Jack Jones
    correctSprite: {fileID: 0}
    incorrectSprite: {fileID: 0}
  - text: Tina Burke
    correctSprite: {fileID: 0}
    incorrectSprite: {fileID: 0}
  - text: Jerry Berg
    correctSprite: {fileID: 0}
    incorrectSprite: {fileID: 0}
  - text: No one; he committed suicide
    correctSprite: {fileID: 0}
    incorrectSprite: {fileID: 0}
  correctAnswerIndex: 2
  wasCorrect: 0
  reward: 3
  scoringConditions:
  - conditionType: 0
    minVotesForCorrect: 1
    minVotesForIncorrect: 0
    mostVotedCharacter: 
    results:
    - characterName: Users Right
      score: 6
    - characterName: Clown
      score: 0
  - conditionType: 2
    minVotesForCorrect: 3
    minVotesForIncorrect: 3
    mostVotedCharacter: Crystal
    results:
    - characterName: Andy
      score: 0
