%YAML 1.1
%TAG !u! tag:unity3d.com,2011:
--- !u!114 &11400000
MonoBehaviour:
  m_ObjectHideFlags: 0
  m_CorrespondingSourceObject: {fileID: 0}
  m_PrefabInstance: {fileID: 0}
  m_PrefabAsset: {fileID: 0}
  m_GameObject: {fileID: 0}
  m_Enabled: 1
  m_EditorHideFlags: 0
  m_Script: {fileID: 11500000, guid: c6569a8594504e8aa07143dea7d55046, type: 3}
  m_Name: Testimony2
  m_EditorClassIdentifier: 
  thumbnail: {fileID: 21300000, guid: 6dbdd7840404d914db254cdab43da321, type: 3}
  title: Testimony2
  description: '2. According to some sailors, Linda and Gary went to a local bar
    quite often, but not at the same time. The owner of the bar was Mr. Yates. '
  NestedID: 
  nestedClue: []
  tagFound: 
