%YAML 1.1
%TAG !u! tag:unity3d.com,2011:
--- !u!114 &11400000
MonoBehaviour:
  m_ObjectHideFlags: 0
  m_CorrespondingSourceObject: {fileID: 0}
  m_PrefabInstance: {fileID: 0}
  m_PrefabAsset: {fileID: 0}
  m_GameObject: {fileID: 0}
  m_Enabled: 1
  m_EditorHideFlags: 0
  m_Script: {fileID: 11500000, guid: c6569a8594504e8aa07143dea7d55046, type: 3}
  m_Name: Room302-1_4
  m_EditorClassIdentifier: 
  thumbnail: {fileID: 21300000, guid: 98bcd3bca1d7770468630c67c1940b53, type: 3}
  title: Room302-1_4
  description: "Victim\u2019s notes (3) May 10th: I don\u2019t know what to do with
    the crisis at the company. I think I\u2019m letting my father down. And you haven\u2019t
    talked to me for a week, my love. "
  NestedID: 
  nestedClue: []
  tagFound: 
