%YAML 1.1
%TAG !u! tag:unity3d.com,2011:
--- !u!114 &11400000
MonoBehaviour:
  m_ObjectHideFlags: 0
  m_CorrespondingSourceObject: {fileID: 0}
  m_PrefabInstance: {fileID: 0}
  m_PrefabAsset: {fileID: 0}
  m_GameObject: {fileID: 0}
  m_Enabled: 1
  m_EditorHideFlags: 0
  m_Script: {fileID: 11500000, guid: 0399bae51e5d4b9faa8ccabbf4abb709, type: 3}
  m_Name: WhoKilledJesus 1
  m_EditorClassIdentifier: 
  scriptIndex: 0
  scriptId: 67
  thumbnail: {fileID: 21300000, guid: 9eb80ff008960c54298608b9dad9aaad, type: 3}
  title: Who killed Jesus
  duration: 3
  timelineTitle: 0
  durationRange: 2-3 hrs
  wordCount: 2800
  theme: Fantasy
  difficulty: 2
  brief: "<b>Brief introduction</b>\n\nIn the beginning God created the Heavens and
    the Earth. Then God said, \u201CLet there be light,\u201D and there was light.
    And God saw that the light was good. God divided the light from the darkness.\r\n\r\nThose
    who are not accepted by Heaven or Earth have only one place to go - Hell. Satan
    created an organization called the Dark Council, which is a collection of the
    most hideous monsters in the world. They fight against the Church to compete
    for world domination. \r\n\r\nIt is said that a man named Jesus would lead the
    Church to victory against evil and bring peace to Earth\u2026\r\n\r\nNote: For
    the purpose of this game, Lucifer and Satan are different characters. \r\n"
  background:
  - Text: "\n\nIn the beginning God created the Heavens and the Earth. \n\n"
    ScrollRectPosition: 0
  - Text: "Then God said, \u201CLet there be light,\u201D and there was light. And
      God saw that the light was good."
    ScrollRectPosition: 0
  - Text: 'God divided the light from the darkness.


'
    ScrollRectPosition: 0
  - Text: 'Those who are not accepted by Heaven or Earth have only one place to go
      - Hell. '
    ScrollRectPosition: 0
  - Text: 'Satan created an organization called the Dark Council, which is a collection
      of the most hideous monsters in the world. '
    ScrollRectPosition: 0
  - Text: "They fight against the Church to compete for world domination. \n\n"
    ScrollRectPosition: 0
  - Text: "It is said that a man named Jesus would lead the Church to victory against
      evil and bring peace to Earth\u2026\n\n"
    ScrollRectPosition: 0
  - Text: "Note: For the purpose of this game, Lucifer and Satan are different characters.
      \n\n"
    ScrollRectPosition: 0
  truth:
  - Text: '


      <b>1. Lucifer the Fallen Angel killed Jesus. </b>



'
    ScrollRectPosition: 0
  - Text: "Vampire went to Jesus\u2019s residence at 14:05 and left at 14:10. He
      poisoned Jesus but it would not take effect until an hour later at 15:05. \n\n"
    ScrollRectPosition: 0
  - Text: "Werewolf entered at 14:40 and left at 14:46. He stabbed Jesus with his
      dagger. \n\n"
    ScrollRectPosition: 0
  - Text: "Demon entered at 14:50 ad left at 14:57. He burned the hut with hellfire
      and locked down the hut with nails from outside. \n\n"
    ScrollRectPosition: 0
  - Text: 'Fallen Angel entered at 15:00 and left at 15:05. '
    ScrollRectPosition: 0
  - Text: "He pulled out the dagger in Jesus\u2019 stomach and stabbed into his heart.
      Jesus died of the stab wounds in his heart. "
    ScrollRectPosition: 0
  - Text: "Lucifer then threw the dagger to the ground and manipulated the dead body
      to be pacing in the room. He locked down the hut again. \n\n"
    ScrollRectPosition: 0
  - Text: 'Evil Spirit entered at 15:10 and left at 15:20. She saw Jesus walking
      and suddenly falling to the ground.


'
    ScrollRectPosition: 0
  - Text: "Witch entered at 15:20 and left at 15:50. She witnessed Evil Spirit leaving
      and buried the body. \n\n"
    ScrollRectPosition: 0
  - Text: "Based on Evil Spirit\u2019s testimony, it is very easy for players to
      believe that Jesus was alive at 15:10 and Vampire\u2019s poison had taken effect. "
    ScrollRectPosition: 0
  - Text: "But it doesn\u2019t make any sense that Jesus was pacing back and forth
      amid the hellfire. "
    ScrollRectPosition: 0
  - Text: 'He must be dead before that and someone manipulated the dead body. '
    ScrollRectPosition: 0
  - Text: "Only Fallen Angel was most likely to be capable of this Heaven spell.
      \n\n"
    ScrollRectPosition: 0
  - Text: "<b>2. The traitor was Lilith the Evil Spirit.</b> After Jesus died, only
      Evil Spirit was still working for Heaven. \n\n"
    ScrollRectPosition: 0
  - Text: "<b>3. Except for Demon, all the other characters had once worked for Heaven.</b>
      \n\n"
    ScrollRectPosition: 0
  - Text: "<b>4. Demon raped Witch when he was drunk.</b> He mistook Witch for Evil
      Spirit.  \n\n"
    ScrollRectPosition: 0
  - Text: "<b>5. Vampire killed Evil Spirit\u2019s sister.</b> He kept a journal
      to record his food (young girls whose blood he sucked) and there was a strand
      of dark brown hair that belonged to Lilith\u2019s sister. \n\n"
    ScrollRectPosition: 0
  characters:
  - name: Evil Spirit
    gender: 0
    age: 0
    occupation: Director of the Dark Council
    picture: {fileID: 21300000, guid: 8dbfccc19358f224bb61751e82e110a6, type: 3}
    personalStoryText: 
    personalTodayText: 
    personalStory:
    - Text: "\t\n\n\tYour name is Lilith, and you are a monster that wanders between
        life and death. "
      ScrollRectPosition: 0
    - Text: 'Your translucent body radiates a fluorescent green light, capable of
        passing through any objects, and your eyes are full of vengeance.


'
      ScrollRectPosition: 0
    - Text: "\tYou are an evil spirit, an eternal being with great power. "
      ScrollRectPosition: 0
    - Text: 'But before becoming an evil spirit, you were just an ordinary young
        girl, and the story of your transformation began about 2000 years ago.


'
      ScrollRectPosition: 0
    - Text: "\t<color=red>You were born into a pious Christian family in the Springfield
        Village</color>, to parents who loved you with all their hearts."
      ScrollRectPosition: 0
    - Text: 'You had a sister Lilian, who always saved the best for you. '
      ScrollRectPosition: 0
    - Text: "In short, your life was peaceful and full of joy. \n\n"
      ScrollRectPosition: 0
    - Text: '<b>Year 19 AD - </b>One day you returned home from the market like usual,
        only to find <color=red>your sister lying in a chair with a horrified look
        on her face, and she was no longer breathing. </color>


'
      ScrollRectPosition: 0
    - Text: "\tYou couldn't believe your eyes and immediately burst into tears. "
      ScrollRectPosition: 0
    - Text: 'Your parents sent for the sheriff to investigate the strange death of
        your sister, but he failed to find any clues. '
      ScrollRectPosition: 0
    - Text: "You were utterly heart-broken and swore to find to the killer of your
        sister and avenge her. \n\n"
      ScrollRectPosition: 0
    - Text: '<b>Year 20 AD - </b>You were in your room knitting when you suddenly
        heard screams from the living room. '
      ScrollRectPosition: 0
    - Text: 'You peeked out of the door and witnessed something you would never forget.


'
      ScrollRectPosition: 0
    - Text: "\tYour parents were covered in blood and wounds, crawling on the floor
        with despair in their eyes. "
      ScrollRectPosition: 0
    - Text: 'Their hands reached out in the air, as if trying to hold on to something
        that could save them, but it was futile. '
      ScrollRectPosition: 0
    - Text: 'Behind them there was a monster hiding in the shadows, repeatedly wielding
        a sharp weapon at your parents.


'
      ScrollRectPosition: 0
    - Text: "\tYour parents\u2019 bodies were badly mutilated, and the monster seemed
        to enjoy it lot. "
      ScrollRectPosition: 0
    - Text: 'You felt like a million ants were gnawing all over your body. '
      ScrollRectPosition: 0
    - Text: 'You desperately wanted to go out and save your parents, but your sanity
        told you to hide in your room. '
      ScrollRectPosition: 0
    - Text: 'You had never felt so helpless in your entire life. '
      ScrollRectPosition: 0
    - Text: 'Your parents were being slaughtered but there was nothing you could
        do.


'
      ScrollRectPosition: 0
    - Text: "\tYou covered your mouth, and crawled under your bed, trembling like
        an autumn leaf. "
      ScrollRectPosition: 0
    - Text: 'You prayed to God that the monster would leave without killing your
        parents.


'
      ScrollRectPosition: 0
    - Text: "\tAfter a while, the screams died down. "
      ScrollRectPosition: 0
    - Text: 'The monster stayed there for quite a while, as if waiting for something. '
      ScrollRectPosition: 0
    - Text: <color=red>You had a glimpse of the monster and only saw his extremely
        big feet. </color>
      ScrollRectPosition: 0
    - Text: "After what felt like a century, the monster finally left. \n\n"
      ScrollRectPosition: 0
    - Text: "\tAfter making sure the monster had left, you crawled out from under
        your bed and entered the living room. "
      ScrollRectPosition: 0
    - Text: "You threw yourself over your parents\u2019 dead bodies and cried your
        eyes out. "
      ScrollRectPosition: 0
    - Text: "Why didn\u2019t God save them? Didn\u2019t God hear your prayer? \n\n"
      ScrollRectPosition: 0
    - Text: "\tYou thought about the monster with big feet and realized there was
        no God to help you after all. "
      ScrollRectPosition: 0
    - Text: "You were on your own. A strong desire of vengeance filled your heart.
        \n\n"
      ScrollRectPosition: 0
    - Text: "\tJust then, you heard a voice. It was ghostly, husky, and full of magic:\n\n"
      ScrollRectPosition: 0
    - Text: "\t\"Stand up. Kill them, kill them all\u2026\u201D\n\n"
      ScrollRectPosition: 0
    - Text: "\tThen a sudden surge of power came into your body. You felt fantastic
        and had the courage to face any monster. \n\n"
      ScrollRectPosition: 0
    - Text: "\tYou wondered in awe of what was going on. "
      ScrollRectPosition: 0
    - Text: "<color=red>You looked around and another frightening monster came into
        view \u2014 he had two horns and animal-like legs. </color>"
      ScrollRectPosition: 0
    - Text: 'It was not the same monster that killed your parents though. Soon he
        disappeared into the shadows. '
      ScrollRectPosition: 0
    - Text: "You didn\u2019t know what happened. Perhaps that monster was just a
        hallucination. \n\n"
      ScrollRectPosition: 0
    - Text: "\tYou left your hometown, travelled the world, and killed anything with
        big feet you encountered with your newly acquired power. "
      ScrollRectPosition: 0
    - Text: 'You also killed many people from the Church, because you thought it
        was the biggest lie that God would help people who believed in him. '
      ScrollRectPosition: 0
    - Text: "<color=red>Every time you killed a member of the Church, you\u2019d
        collect his or her emblem as a souvenir. </color>\n\n"
      ScrollRectPosition: 0
    - Text: "\tYou muddled through your life with only one goal\u2014to avenge your
        family. "
      ScrollRectPosition: 0
    - Text: '<color=red>Until one day, you met a man with a big heart. His name was
        Jesus, and he was sent by God to save the people who were suffering.</color>


'
      ScrollRectPosition: 0
    - Text: "\tAt first you thought he was just another hypocrite from the Church. "
      ScrollRectPosition: 0
    - Text: 'You tortured him mercilessly, but he never fought back. '
      ScrollRectPosition: 0
    - Text: "His peaceful gaze calmed you down like magic. Eventually, you did not
        kill him. \n\n"
      ScrollRectPosition: 0
    - Text: "\tYou became friends with Jesus. Jesus told you about his plans for
        saving the world. "
      ScrollRectPosition: 0
    - Text: 'You observed him sparing no effort to help others whenever he could,
        sometimes even risking his life. '
      ScrollRectPosition: 0
    - Text: 'When you were around him, your heart was always filled with sunshine. '
      ScrollRectPosition: 0
    - Text: "You started to forget the pain and hatred, and dream about a good life
        again. \n\n"
      ScrollRectPosition: 0
    - Text: 'Gradually, you found the old Lilith again. '
      ScrollRectPosition: 0
    - Text: 'You remembered the teachings from your parents about right and wrong. '
      ScrollRectPosition: 0
    - Text: "You decided that the meaning of your existence was to help Jesus save
        the world and spread love. \n\n"
      ScrollRectPosition: 0
    - Text: "\tYou later learned that Jesus was the son of God. "
      ScrollRectPosition: 0
    - Text: 'His mission was to lead the Church, defeat evil, and save the world. '
      ScrollRectPosition: 0
    - Text: '<color=red>However, an organization called the Dark Council was hunting
        him down.</color>


'
      ScrollRectPosition: 0
    - Text: "\t<color=red>The Dark Council was an organization created by Satan,
        the Lord of Hell, and it was full of his minions.</color>"
      ScrollRectPosition: 0
    - Text: 'It was composed of the darkest and most evil creatures in the world. '
      ScrollRectPosition: 0
    - Text: 'They were more hideous and horrible than you could imagine. '
      ScrollRectPosition: 0
    - Text: 'Their only goal was to conquer the world and drag it into endless chaos. '
      ScrollRectPosition: 0
    - Text: 'The monster that killed your parents, the unknown killer who killed
        your sister, and the monster who gave you your powers, were probably members
        of the Dark Council.


'
      ScrollRectPosition: 0
    - Text: "\tYou made up your mind to fight for justice and kill all the monsters
        from the Dark Council. "
      ScrollRectPosition: 0
    - Text: "You travelled with Jesus, helped him preach love to people, and protected
        him along the way. \n\n"
      ScrollRectPosition: 0
    - Text: '<b>Year 25 AD - </b>You spent several years saving people alongside
        Jesus. '
      ScrollRectPosition: 0
    - Text: 'You had transformed into an optimistic and happy girl. '
      ScrollRectPosition: 0
    - Text: 'However, there was always a price to pay for the magic power you obtained
        from the monster. '
      ScrollRectPosition: 0
    - Text: 'The demonic energy in your body gradually diminished with the passage
        of time. '
      ScrollRectPosition: 0
    - Text: 'Soon you would become a helpless girl again, but no longer want to live
        a life to be trampled on again.


'
      ScrollRectPosition: 0
    - Text: "\tThat day, you killed some monsters from the Dark Council and found
        an evil spell. "
      ScrollRectPosition: 0
    - Text: '<color=red>That is, if someone dies with a strong resentment and her
        body covered in blood is sacrificed to the darkness, then her soul would
        not rest in peace; instead, she will turn into an evil spirit with great
        magical power and immortality.</color>


'
      ScrollRectPosition: 0
    - Text: "\tYou were willing to sacrifice yourself in order to obtain great power
        to achieve your goals. "
      ScrollRectPosition: 0
    - Text: 'Thus, you tortured yourself to death and fell into a swamp that belonged
        to the Dark Council. '
      ScrollRectPosition: 0
    - Text: 'Your strong resentment started to absorb the dark power inside the swamp
        and crystalized your soul. '
      ScrollRectPosition: 0
    - Text: "After a while, you turned in a powerful evil spirit, just as you planned.
        \n\n"
      ScrollRectPosition: 0
    - Text: "\tJesus noticed your crazy plan and came to stop you. But he was too
        late. "
      ScrollRectPosition: 0
    - Text: "When he arrived, you had finished the sacrifice and transformed completely.
        \n\n"
      ScrollRectPosition: 0
    - Text: "\t<color=red>You looked at Jesus and proposed to him an even crazier
        idea\u2014now that you were an evil spirit, you could infiltrate the Dark
        Council and become an undercover agent there. </color>"
      ScrollRectPosition: 0
    - Text: '<color=red>This could be very helpful to Jesus and the Church in winning
        the ultimate war. </color>


'
      ScrollRectPosition: 0
    - Text: "\tJesus tried to stop you from making such a risky move, but you insisted.
        He finally agreed. "
      ScrollRectPosition: 0
    - Text: 'In order to justify your hatred towards the Church and prove your loyalty
        to the Dark Council, <color=red>you spread the rumor that your parents were
        killed by members of the Church, so you had been killing them. </color>


'
      ScrollRectPosition: 0
    - Text: "\tJesus said goodbye to you with tears in his eyes and <color=red>gave
        you a ring to show that he would always be with you. </color>"
      ScrollRectPosition: 0
    - Text: 'He buried your body, and since then, you wandered the world alone.


'
      ScrollRectPosition: 0
    - Text: '<b>Year 26 AD - </b>You met a monster who was a werewolf, and his name
        was Lupin. '
      ScrollRectPosition: 0
    - Text: 'You told him the story about being killed by Jesus. '
      ScrollRectPosition: 0
    - Text: 'You pretended to be ruthless and expressed your resentment towards the
        Church all the time. '
      ScrollRectPosition: 0
    - Text: 'You also showed him the emblems you collected from killing the members
        of the Church. Lupin believed your story.


'
      ScrollRectPosition: 0
    - Text: "\t\r<color=red>Lupin usually appeared in human form and only turned
        into a werewolf during the full moon. When he was human, he was a tall man
        with blonde hair and green eyes; very handsome. </color>Lupin "
      ScrollRectPosition: 0
    - Text: "\tYou travelled together with Lupin, who took good care of you. You
        grew attached to him. "
      ScrollRectPosition: 0
    - Text: 'Soon enough, you found yourself in love with him, but you knew that
        you two would never be together. '
      ScrollRectPosition: 0
    - Text: "Lupin was a monster while you had an unshakable faith in God and Jesus.
        You hoped that you could slowly convert him into a good person. \n\n"
      ScrollRectPosition: 0
    - Text: "\tOne day, your body was pulled towards somewhere by an unknown force. "
      ScrollRectPosition: 0
    - Text: "You panicked and but couldn\u2019t fight the mysterious force. "
      ScrollRectPosition: 0
    - Text: 'You watched the landscape fly by before your eyes, and after a while,
        you finally stopped.


'
      ScrollRectPosition: 0
    - Text: "\t<color=red>You were shocked to see that your rotten corpse had been
        dug up. </color>"
      ScrollRectPosition: 0
    - Text: <color=red>In front of your corpse stood a monster with dark red skin,
        a head with two horns, and four animal-like limbs.  </color>
      ScrollRectPosition: 0
    - Text: <color=red>You shivered when he stared at you. He was holding an ancient
        book in his hands while looking at you curiously.  </color>
      ScrollRectPosition: 0
    - Text: "<color=red>It was him\u2014the monster who was present when you obtained
        your magic power on the day of your parents\u2019 deaths.   </color>\n\n"
      ScrollRectPosition: 0
    - Text: "\t<color=red>The monster introduced himself as Basilisk, who was the
        head of the Dark Council, the right-hand man of Satan, and the oldest monster
        in Hell.  </color>\n\n"
      ScrollRectPosition: 0
    - Text: "\tYou did not fear the monster after the initial shock. He seemed very
        interested in you and meant no harm."
      ScrollRectPosition: 0
    - Text: "And he was the head of the Dark Council! You couldn\u2019t believe your
        luck. This was a perfect opportunity to infiltrate the Dark Council.\n\n"
      ScrollRectPosition: 0
    - Text: "\tYou told him the tragic story of your life and how you were killed
        by Jesus, with an emphasis on your hatred towards the Church. "
      ScrollRectPosition: 0
    - Text: 'You practiced your story many times and it was almost flawless.


'
      ScrollRectPosition: 0
    - Text: "\tBasilisk was easily convinced and invited you to join the Dark Council. "
      ScrollRectPosition: 0
    - Text: 'At the Dark Council, he took you under his wings and taught you many
        things. '
      ScrollRectPosition: 0
    - Text: "Nevertheless, your goal was to destroy the Dark Council, and you knew
        you\u2019d fight Basilisk later, even though he had been nice to you. \n\n"
      ScrollRectPosition: 0
    - Text: "\t<color=red>Soon you established yourself at the Dark Council. You
        began to send intel to the Church. Thanks to these insider tips, Jesus was
        able to escape death every time.</color>\n\n"
      ScrollRectPosition: 0
    - Text: "\t<b>Year 33 AD - </b>You\u2019ve been an undercover agent at the Dark
        Council for a few years. "
      ScrollRectPosition: 0
    - Text: 'To avoid suspicion, you had to participate in evil missions every now
        and then. '
      ScrollRectPosition: 0
    - Text: "Basilisk liked you a lot and had promoted you to be a director of the
        Dark Council. \n\n"
      ScrollRectPosition: 0
    - Text: "\tThe Dark Council never stopped hunting Jesus, but Basilisk always
        sent his underlings to carry out the assassination, as he did not want to
        become the one who kills Jesus. \n\n"
      ScrollRectPosition: 0
    - Text: "\tIt was 15:10 pm on April 3rd, and you quietly arrived at Jesus's residence,
        which was a small wooden house, to see how he was doing. \n\n"
      ScrollRectPosition: 0
    - Text: "\tHowever, <color=red>you were shocked to see the house was burning
        with flames, while the doors and windows were nailed down from the outside.
        </color>You anxiously entered the house through the walls. \n\n"
      ScrollRectPosition: 0
    - Text: "\t<color=red>Jesus was pacing inside the house when you entered. You
        were about to call him when he suddenly stopped and collapsed to the ground.
        </color>"
      ScrollRectPosition: 0
    - Text: "Startled, you rushed forward to check on him. <color=red>Jesus\u2019
        face had turned dark, and his body soaked in blood. He was no longer breathing.
        </color>"
      ScrollRectPosition: 0
    - Text: "\tYou were devastated that your most treasured friend had just left
        you and there was nothing you could do about it. "
      ScrollRectPosition: 0
    - Text: 'You stood in the house and watched Jesus being consumed by the fire.
        You stayed for a while, just to be with him a little longer. There was no
        one else in the house.


'
      ScrollRectPosition: 0
    - Text: "\tAt 15:20, you left Jesus\u2019 house. \n\n"
      ScrollRectPosition: 0
    - Text: "\tAfter that, you hid your grief and pretended nothing had happened,
        moving around normally within the Dark Council. "
      ScrollRectPosition: 0
    - Text: 'Within two days, the news of Jesus''s death spread out, and the world
        was in shock. '
      ScrollRectPosition: 0
    - Text: "Heaven was outraged! But they did not have any clues as to who murdered
        Jesus. You thought it was your fault that Jesus died. \n\n"
      ScrollRectPosition: 0
    - Text: '<b>Year 132 AD - </b>Almost a hundred years had passed in the blink
        of an eye. '
      ScrollRectPosition: 0
    - Text: 'You never stopped passing on information to the Church over the years.
        Despite your intel, the Church was still at a disadvantage, and Jesus''s
        death was too great a blow to the morale. '
      ScrollRectPosition: 0
    - Text: 'You still had feelings for Lupin, but you did not confess them. '
      ScrollRectPosition: 0
    - Text: "Only after the Dark Council was destroyed, would you try to convert
        him. \n\n"
      ScrollRectPosition: 0
    - Text: "\tAfter Jesus died, the Dark Council had been attacking the Church quite
        efficiently over the years to the point of almost dominating the Earth. "
      ScrollRectPosition: 0
    - Text: 'Satan was extremely satisfied. He decided to launch a final attack in
        the near future to seize control of the Earth once and for all! '
      ScrollRectPosition: 0
    - Text: '<color=red>He gathered the six directors of the Dark Council, namely
        Lucifer, Basilisk, Lupin, Cerci, Cain, and you, for a meeting, and informed
        you all of the detailed plan of action.</color>


'
      ScrollRectPosition: 0
    - Text: "\tNeedless to say, you reported the plan of action back to the Church.\n\n"
      ScrollRectPosition: 0
    - Text: "\tOn the day of the operation, at the very moment when the Dark Council
        was preparing to launch the final attack, the Church Army suddenly descended
        out of nowhere and surrounded you, as if they knew your plan in advance.\n\n"
      ScrollRectPosition: 0
    - Text: "\tAfter a tough battle, the Dark Council was defeated.  "
      ScrollRectPosition: 0
    - Text: 'According to the bet between Michael and Satan, Satan would be sealed
        by him for 2000 years. '
      ScrollRectPosition: 0
    - Text: 'During this period, the Dark Council, without a proper leader, would
        definitely suffer the cruelest attack from the Church.


'
      ScrollRectPosition: 0
    - Text: "\tBefore Satan was sealed, he viciously stared at the directors of the
        Dark Council, and his eyes were burning with hellfire. "
      ScrollRectPosition: 0
    - Text: 'He roared furiously: "We were only defeated because there is a traitor
        among you guys! Such filthy betrayal will not be tolerated! When I return
        to Earth, I will punish the traitor! Prepare for my wrath!"


'
      ScrollRectPosition: 0
    - Text: "\tAs soon as the words were spoken, Satan was sealed into the deepest
        level of Hell. "
      ScrollRectPosition: 0
    - Text: 'And all the members of the Dark Council fled, hiding from the persecution
        of the Church. '
      ScrollRectPosition: 0
    - Text: 'You maintained your undercover identity and also went into hiding.


'
      ScrollRectPosition: 0
    - Text: '<b>Year 2020 AD - </b>1888 years had passed after the epic defeat. '
      ScrollRectPosition: 0
    - Text: 'Members of the Dark Council had been hiding on Earth or fallen into
        hibernation. '
      ScrollRectPosition: 0
    - Text: 'You kept a low profile, always hiding in the shadows. '
      ScrollRectPosition: 0
    - Text: 'You were also investigating who killed your sister and parents. '
      ScrollRectPosition: 0
    - Text: "You had a hunch that your enemies were still alive, but you couldn\u2019t
        figure out where they were. \n\n"
      ScrollRectPosition: 0
    - Text: "\tLupin had been protecting you all this time, but you had no courage
        to face him. "
      ScrollRectPosition: 0
    - Text: "One day, just as you were thinking about whether to confess your feelings
        to him, you heard Satan's voice: \n\n"
      ScrollRectPosition: 0
    - Text: "\t\"My servants, I will break out from the seal earlier than expected.
        When I return, you must find the one who betrayed me, and I will imprison
        his or her soul in Hell forever! "
      ScrollRectPosition: 0
    - Text: 'As a bargain for my early freedom, you must also find the killer of
        Jesus and hand him or her over to Archangel Michael. The killer will be punished
        by the Holy Light! '
      ScrollRectPosition: 0
    - Text: 'Finally, the term of the President of the Dark Council has come to an
        end, and you need to vote on a new president. '
      ScrollRectPosition: 0
    - Text: 'I''ve opened up the Dark Tower at headquarters for you. The winner will
        become the next President of the Dark Council."


'
      ScrollRectPosition: 0
    - Text: "\tYou were surprised that Satan was going to change the President of
        the Dark Council."
      ScrollRectPosition: 0
    - Text: 'After all, Basilisk had been the president for thousands of years! '
      ScrollRectPosition: 0
    - Text: 'It seemed that Satan was disappointed in Basilisk and was determined
        to find competent monsters to help him take revenge. '
      ScrollRectPosition: 0
    - Text: 'If you become the President of the Dark Council, it would be easy to
        control it and destroy it from inside. Thus, you decided to fight for the
        position.


'
      ScrollRectPosition: 0
    today: []
    task: "\n\n1. Find out who killed Jesus.\r\n\n2. Do not let anybody find out
      you were the traitor!!! (This is the ultimate secret that you can\u2019t reveal.)\r\n\n3.
      Be elected as the next President of the Dark Council (6 points). Or support
      a person to become the next President of the Dark Council (if that person is
      elected, you get 3 points).\r\n\n4. Find out who killed your parents. \r\n\n5.
      Find out who killed your sister. \r\n\n6. Find out why Basilisk was particularly
      nice to you. \r\n"
    setupsPerRound:
    - roundIndex: 2
      assignedClues:
      - {fileID: 11400000, guid: 8a31d3b96f560234993986aa560d6180, type: 2}
      - {fileID: 11400000, guid: 3003a42b9e1d8144ea2074757b9d08c3, type: 2}
    - roundIndex: 4
      assignedClues:
      - {fileID: 11400000, guid: ea89292da5379484f9f9f0519a53693a, type: 2}
      - {fileID: 11400000, guid: b5861f799e0a45e41903c4767159864c, type: 2}
      - {fileID: 11400000, guid: 4e44316aeaf3c2344bd8a43049d90203, type: 2}
    personalQuestions:
    - {fileID: 11400000, guid: 5bcf7aae6fe52d4428232b6e5c98bb7d, type: 2}
    - {fileID: 11400000, guid: f2a52a15bd927894e8c252902512b700, type: 2}
  author: 
  priceType: 1
  scriptType: 0
  searchMap: {fileID: 1624997191464913775, guid: fc4195fcad67c8e4bb12b880e142bd16,
    type: 3}
  isDebugScript: 0
  questions:
  - {fileID: 11400000, guid: df23698bbc1633644b855bc7cedcb091, type: 2}
  - {fileID: 11400000, guid: c15a568f16e89a544866c93af99d7691, type: 2}
  - {fileID: 11400000, guid: a7ba0a1b6db9536408a26bd2d010e713, type: 2}
  - {fileID: 11400000, guid: 84b415c4b771c9441b943c58b06d2d44, type: 2}
  accusedQuestionIndex: 0
  configsPerRound:
  - {fileID: 11400000, guid: 89be7e2de8fc27b4ebfdf59054830499, type: 2}
  - {fileID: 11400000, guid: 9fc01ac2d0a136e48b0e64cc3a4ea6d3, type: 2}
  - {fileID: 11400000, guid: 684fd9f5fd427f54aaa68714d4a9c206, type: 2}
  - {fileID: 11400000, guid: 656a7ec52b6331642b52393e90f0ac38, type: 2}
  - {fileID: 11400000, guid: bee6a4cf009b62242b7ecfa8df71ac45, type: 2}
  - {fileID: 11400000, guid: e9fd0768eaf68cf47998610661a64944, type: 2}
  - {fileID: 11400000, guid: c3f3c01d45f7fd04d909207e8a06bd22, type: 2}
  backgroundMusic: {fileID: 8300000, guid: 16e681c28cdddfb4bb895c7c8de195dc, type: 3}
  isUnderDev: 0
  currentCharacter: 
  popup: Demon
