%YAML 1.1
%TAG !u! tag:unity3d.com,2011:
--- !u!114 &11400000
MonoBehaviour:
  m_ObjectHideFlags: 0
  m_CorrespondingSourceObject: {fileID: 0}
  m_PrefabInstance: {fileID: 0}
  m_PrefabAsset: {fileID: 0}
  m_GameObject: {fileID: 0}
  m_Enabled: 1
  m_EditorHideFlags: 0
  m_Script: {fileID: 11500000, guid: 0399bae51e5d4b9faa8ccabbf4abb709, type: 3}
  m_Name: MurderAtTheAmusementPark 6
  m_EditorClassIdentifier: 
  scriptIndex: 1
  scriptId: 105
  thumbnail: {fileID: 21300000, guid: 132261a8de56a3c458f9784c430a5383, type: 3}
  title: Murder at the Amusement Park
  duration: 2
  timelineTitle: 1
  durationRange: 1-2 hrs
  wordCount: 1000
  theme: Realistic
  difficulty: 0
  brief: '<b>Brief introduction</b>



    The new amusement park was having a grand
    opening party with a spectacular magic show. At around 10 pm, the joyfull celebration
    was interrupted by a piercing alarm. There appeared to be a roller coaster accident
    and someone had fallen off from the moving roller coaster. The deceased turned
    out to be a Mr. Weinstein..

'
  background:
  - Text: '


      On September 28th, the new amusement park was having a grand
      opening party. '
    ScrollRectPosition: 0
  - Text: 'At around 10 pm, the joyful celebration was interrupted by a piercing
      alarm. '
    ScrollRectPosition: 0
  - Text: 'There appeared to be a roller coaster accident and someone had fallen
      off from the moving roller coaster. '
    ScrollRectPosition: 0
  - Text: "The dead person turned out to be the well-known businessman Mr. Weinstein\u2026
      \n\n"
    ScrollRectPosition: 0
  truth:
  - Text: '


      <b>The person who killed Mr. Weinstein was Clown. </b>


'
    ScrollRectPosition: 0
  - Text: "Critical evidences:\n\n 1) the victim\u2019s chest wound was very deep,
      and wider than a common knife;\n 2) the clean bullet found inside Clown\u2019s
      pocket. \n\n"
    ScrollRectPosition: 0
  - Text: '<b>The story:</b>


'
    ScrollRectPosition: 0
  - Text: 'Many years ago Clown was a wealthy businessman and a mentor of young Weinstein. '
    ScrollRectPosition: 0
  - Text: "However, due to Weinstein\u2019s betrayal, he was sent to jail and served
      a ten year sentence there."
    ScrollRectPosition: 0
  - Text: When Clown got out of the jail, he was penniless and had no family.
    ScrollRectPosition: 0
  - Text: 'Even worse, he was diagnosed of cancer. Clown read about Weinstein in
      magazines and watched him on TV, '
    ScrollRectPosition: 0
  - Text: 'Even worse, he was diagnosed of cancer. Clown read about Weinstein in
      magazines and watched him on TV, '
    ScrollRectPosition: 0
  - Text: "and felt it was completely unfair that Weinstein was so successful while
      he was a miserable loser. Clown changed identity and set up an appointment
      with Weinstein to buy cocaine at 10 pm at the amusement park. \n"
    ScrollRectPosition: 0
  - Text: "\n<b>On the day of the murder:</b> \n"
    ScrollRectPosition: 0
  - Text: "\n8:00 pm Clown put on makeup and started selling ice cream at the park.
      \n"
    ScrollRectPosition: 0
  - Text: '

      9:30 pm Clown closed the ice cream cart, took off his clown costume
      and changed into a black outfit.

'
    ScrollRectPosition: 0
  - Text: "\n9:45 pm Clown arrived at the roller-coaster from the east entrance.
      Weinstein has not showed up, so Clown found a place to hide. \n"
    ScrollRectPosition: 0
  - Text: "\n9:55 pm Weinstein arrived at the east entrance of the roller-coaster.
      Clown prepared a suitcase full of fake money and pretended to carry out the
      transaction, while he pulled out a gun and shot Weinstein right in his heart.
      Clown dragged his dead body into a roller-coaster car. In addition, to confuse
      the police, Clown used a knife to dig out the bullet and left the knife in
      Weinstein\u2019s chest. Clown dumped the black outfit into a trash can and
      ran away. When he returned to the makeup room, he wiped the blood off the bullet
      and put it in his pocket. . \n\n"
    ScrollRectPosition: 0
  - Text: '<b>Other suspects:</b>


'
    ScrollRectPosition: 0
  - Text: "1.Frank planned to kill Weinstein, but he was hit by the victim with a
      baseball bat in the locker room. He couldn\u2019t find Weinstein after that
      and thus had no opportunity.\n"
    ScrollRectPosition: 0
  - Text: '2.Crystal planned to kill Weinstein with Andy. She lost the victim after
      returning to the theatre. She went to look for Weinstein, and arrived at the
      east entrance of the roller coaster after recalling the message on his phone.
      However she found there was an accident and Weinstein was already dead.

'
    ScrollRectPosition: 0
  - Text: "3.Andy went to test the roller coaster as part of his job while he was
      looking for Weinstein, and he found Weinstein was stabbed to death by a knife.
      He assumed that Crystal did it, and in order to confuse the police, he started
      the roller coaster and create an accident. \n"
    ScrollRectPosition: 0
  - Text: "4.Magician invited Weinstein to the stage and played a magic trick to
      lock him into the locker room. When he arrived at the locker room, Weinstein
      was gone. He found the victim\u2019s phone and rushed to the roller coaster,
      but Weinstein was already dead. \n"
    ScrollRectPosition: 0
  characters:
  - name: Crystal
    gender: 0
    age: 21
    occupation: Pub Singer
    picture: {fileID: 21300000, guid: faa186c02a5e5cb41aa881a69e65ac82, type: 3}
    personalStoryText: 
    personalTodayText: 
    personalStory:
    - Text: '


        You grew up in a low-income family, and your parents worked
        hard to make ends meet. '
      ScrollRectPosition: 0
    - Text: 'After high school, you decided to find a job instead of going to college. '
      ScrollRectPosition: 0
    - Text: 'You moved to LA and dreamed of becoming an actress. '
      ScrollRectPosition: 0
    - Text: 'Since you were pretty and had a beautiful voice, you became a pub singer.


'
      ScrollRectPosition: 0
    - Text: "Quite a few men hit on you at the bar, but you didn\u2019t date any
        of them because you didn\u2019t think they really cared about you. "
      ScrollRectPosition: 0
    - Text: 'One day, you met a college student named Andy. '
      ScrollRectPosition: 0
    - Text: 'He was handsome and very attentive. '
      ScrollRectPosition: 0
    - Text: 'He waited until midnight every day to pick you up after work and brought
        you breakfast every morning. '
      ScrollRectPosition: 0
    - Text: 'He was there for you whenever you needed him. '
      ScrollRectPosition: 0
    - Text: 'After a while, you became his girlfriend.

'
      ScrollRectPosition: 0
    - Text: 'After Andy graduated from college, you two moved into a small apartment
        together. '
      ScrollRectPosition: 0
    - Text: "Andy was so nice to you that you didn\u2019t care that he was poor. "
      ScrollRectPosition: 0
    - Text: 'Andy said that he found a well-paying job in a startup company. '
      ScrollRectPosition: 0
    - Text: 'He promised to marry you soon and buy a big house for you. '
      ScrollRectPosition: 0
    - Text: 'You believed him and dreamed of a wonderful life in the near future.


'
      ScrollRectPosition: 0
    - Text: "Several months into his new job, Andy told you that his company was
        in trouble and wouldn\u2019t pay him, but he would figure it out soon enough. "
      ScrollRectPosition: 0
    - Text: 'Of course, you trusted him and supported both of you with the money
        you made from the singing gig. '
      ScrollRectPosition: 0
    - Text: 'However, one day, Andy told you that he was broke. '
      ScrollRectPosition: 0
    - Text: 'He told you that the startup was a fraud and went out of business, and
        the CEO disappeared. '
      ScrollRectPosition: 0
    - Text: 'Your heart sank, and you called him a liar and a loser. '
      ScrollRectPosition: 0
    - Text: 'To your surprise, he started yelling at you, claiming that he had tried
        his best. '
      ScrollRectPosition: 0
    - Text: 'You were very disappointed in him. '
      ScrollRectPosition: 0
    - Text: "You didn\u2019t want to live a poor life anymore, so you broke up with
        Andy and moved out of the apartment.\n\n"
      ScrollRectPosition: 0
    - Text: 'Some middle-aged men frequently came to the high-end bar where you worked,
        driving fancy sports cars and ordering the most expensive wine. '
      ScrollRectPosition: 0
    - Text: 'One of these wealthy men, Mr. Weinstein, was particularly interested
        in you. '
      ScrollRectPosition: 0
    - Text: 'He was much older than you, but he gave you huge tips and bought you
        designer clothes and handbags. '
      ScrollRectPosition: 0
    - Text: 'He even promised to invest in a movie and make you the female lead. '
      ScrollRectPosition: 0
    - Text: "You couldn\u2019t resist the temptation and started a sugar-baby relationship
        with him. "
      ScrollRectPosition: 0
    - Text: 'Unexpectedly, Andy crawled back to you, begging to get back together. '
      ScrollRectPosition: 0
    - Text: 'Mr. Weinstein found out about Andy, and he hired some thugs to brutally
        beat him up. '
      ScrollRectPosition: 0
    - Text: "Andy\u2019s arm was fractured, and you felt too guilty to talk to him
        again. \n\n"
      ScrollRectPosition: 0
    - Text: "Before long, you found yourself pregnant with Mr. Weinstein\u2019 child,
        but he didn\u2019t seem to be excited. What\u2019s worse, he became more
        and more ill-tempered. "
      ScrollRectPosition: 0
    - Text: 'He would hit you every time he got drunk. '
      ScrollRectPosition: 0
    - Text: 'You were frightened and tried to run away. '
      ScrollRectPosition: 0
    - Text: 'But he would always send people to retrieve you and beat you even harder. '
      ScrollRectPosition: 0
    - Text: "You were too scared to call the police. \n\n"
      ScrollRectPosition: 0
    - Text: "You couldn\u2019t put up with Mr. Weinstein anymore, so you called Andy
        again and realized he was still deeply in love with you. "
      ScrollRectPosition: 0
    - Text: 'Andy planned to help you get rid of Mr. Weinstein by killing him. '
      ScrollRectPosition: 0
    - Text: "You rejected his crazy plan at first, but you didn\u2019t know how to
        break free from Mr. Weinstein\u2019 control either. "
      ScrollRectPosition: 0
    - Text: 'Eventually, you gave in. '
      ScrollRectPosition: 0
    - Text: 'Andy now worked as a security guard in an amusement park that Mr. Weinstein
        invested in. '
      ScrollRectPosition: 0
    - Text: 'A grand opening party would take place in the amusement park on September
        28. '
      ScrollRectPosition: 0
    - Text: "You and Andy came up with a plan to kill Mr. Weinstein that night. \n\n"
      ScrollRectPosition: 0
    today:
    - Text: '


        You went to the party with Mr. Weinstein. '
      ScrollRectPosition: 0
    - Text: 'At 8:20 p.m., and you put Rohypnol in his wine. '
      ScrollRectPosition: 0
    - Text: 'The drug should take effect in one hour, and then Andy would kill him
        as planned. At 8:30 p.m., you accompanied Mr. Weinstein to watch a magic
        show. '
      ScrollRectPosition: 0
    - Text: "You were terribly nervous and couldn\u2019t focus on the show. "
      ScrollRectPosition: 0
    - Text: "About 40 minutes later, you received a text message from Andy. \n"
      ScrollRectPosition: 0
    - Text: "Andy: Where are you? I\u2019m outside the theatre. \n"
      ScrollRectPosition: 0
    - Text: 'You: Got it.


'
      ScrollRectPosition: 0
    - Text: 'You found an excuse to sneak out of the theatre and met up with Andy. '
      ScrollRectPosition: 0
    - Text: 'You said the drug would take effect shortly after, and you would carry
        Mr. Weinstein to a hidden place for Andy to finish him off. '
      ScrollRectPosition: 0
    - Text: 'You returned to the theatre at 9:30 p.m., and the show had just ended,
        with crowds of people leaving the theatre. '
      ScrollRectPosition: 0
    - Text: 'To your surprise, Mr. Weinstein was no longer in his seat. '
      ScrollRectPosition: 0
    - Text: 'Panicked, you texted Andy.

'
      ScrollRectPosition: 0
    - Text: "You: I can\u2019t find him!\n"
      ScrollRectPosition: 0
    - Text: 'Andy: What happened?


'
      ScrollRectPosition: 0
    - Text: 'You and Andy set out to look for Mr. Weinstein separately. '
      ScrollRectPosition: 0
    - Text: 'When it was almost 10 p.m., it suddenly occurred to you that someone
        had texted Mr. Weinstein several days ago to meet him at the roller coaster
        tonight. '
      ScrollRectPosition: 0
    - Text: 'The person asked Mr. Weinstein to enter through the east entrance because
        the facility was under repair. '
      ScrollRectPosition: 0
    - Text: 'The agreed-upon time was 10 p.m. sharp. '
      ScrollRectPosition: 0
    - Text: 'You decided to look for Mr. Weinstein at the roller coaster with a fruit
        knife that you carry in your handbag. '
      ScrollRectPosition: 0
    - Text: 'You sneaked in through the east entrance, only to find out that the
        roller coaster was moving. '
      ScrollRectPosition: 0
    - Text: 'Just then, the alarm was triggered. '
      ScrollRectPosition: 0
    - Text: 'Was there a roller coaster accident? Many security guards arrived and
        discovered a dead body on the ground beneath the roller coaster track. '
      ScrollRectPosition: 0
    - Text: 'The victim turned out to be Mr. Weinstein!


'
      ScrollRectPosition: 0
    task: "\n\n1. Find out who killed Mr. Weinstein and how.\n2. Do not reveal your
      plan with Andy to kill Mr. Weinstein. \n\n"
    setupsPerRound:
    - roundIndex: 2
      assignedClues:
      - {fileID: 11400000, guid: 81b398544742dca4b9f73b2c54a8b03b, type: 2}
      - {fileID: 11400000, guid: d0fda7f2511851f42a174aa40ace4a0b, type: 2}
      - {fileID: 11400000, guid: e1a69a7d6f2aa264f9c65da47d1c4aad, type: 2}
      - {fileID: 11400000, guid: d0ad07baba3835a4ea14eff3dc45f494, type: 2}
      - {fileID: 11400000, guid: be7e7c436d91ed5419e04b1046c8292a, type: 2}
    - roundIndex: 4
      assignedClues:
      - {fileID: 11400000, guid: d9f3fd443d15cbe4da3bb836a4ef3de3, type: 2}
    personalQuestions: []
  author: John Doe
  priceType: 0
  scriptType: 0
  searchMap: {fileID: 1624997191464913775, guid: 7a955a0f61c4ce644a06fff3ce6f9e22,
    type: 3}
  isDebugScript: 0
  questions:
  - {fileID: 11400000, guid: ca7998263b2a0e54c993630a49d499a8, type: 2}
  accusedQuestionIndex: 0
  configsPerRound:
  - {fileID: 11400000, guid: 89be7e2de8fc27b4ebfdf59054830499, type: 2}
  - {fileID: 11400000, guid: 9fc01ac2d0a136e48b0e64cc3a4ea6d3, type: 2}
  - {fileID: 11400000, guid: 684fd9f5fd427f54aaa68714d4a9c206, type: 2}
  - {fileID: 11400000, guid: 656a7ec52b6331642b52393e90f0ac38, type: 2}
  - {fileID: 11400000, guid: bee6a4cf009b62242b7ecfa8df71ac45, type: 2}
  - {fileID: 11400000, guid: e9fd0768eaf68cf47998610661a64944, type: 2}
  - {fileID: 11400000, guid: c3f3c01d45f7fd04d909207e8a06bd22, type: 2}
  backgroundMusic: {fileID: 8300000, guid: da69148c7a96de942aae297fa9535e49, type: 3}
  isUnderDev: 0
  currentCharacter: 
  popup: Crystal
