%YAML 1.1
%TAG !u! tag:unity3d.com,2011:
--- !u!114 &11400000
MonoBehaviour:
  m_ObjectHideFlags: 0
  m_CorrespondingSourceObject: {fileID: 0}
  m_PrefabInstance: {fileID: 0}
  m_PrefabAsset: {fileID: 0}
  m_GameObject: {fileID: 0}
  m_Enabled: 1
  m_EditorHideFlags: 0
  m_Script: {fileID: 11500000, guid: c6569a8594504e8aa07143dea7d55046, type: 3}
  m_Name: Storage Room 1
  m_EditorClassIdentifier: 
  thumbnail: {fileID: 21300000, guid: 1df2d2d70c57dd94cbebb393a35fa700, type: 3}
  title: Storage Room
  description: A baseball bat with blood on it lying on the ground of the storage
    room.
  NestedID: 
  nestedClue: []
  tagFound: 
