%YAML 1.1
%TAG !u! tag:unity3d.com,2011:
--- !u!114 &11400000
MonoBehaviour:
  m_ObjectHideFlags: 0
  m_CorrespondingSourceObject: {fileID: 0}
  m_PrefabInstance: {fileID: 0}
  m_PrefabAsset: {fileID: 0}
  m_GameObject: {fileID: 0}
  m_Enabled: 1
  m_EditorHideFlags: 0
  m_Script: {fileID: 11500000, guid: c6569a8594504e8aa07143dea7d55046, type: 3}
  m_Name: Anna_2_1
  m_EditorClassIdentifier: 
  thumbnail: {fileID: 21300000, guid: 4a30e1fbc4103e4469b7790496a42401, type: 3}
  title: Anna_2_1
  description: There was a huge explosion in the Heritage Mental Health Unit in 2012.
    Only one little boy survived the explosion.
  NestedID: 
  nestedClue: []
  tagFound: 
