%YAML 1.1
%TAG !u! tag:unity3d.com,2011:
--- !u!114 &11400000
MonoBehaviour:
  m_ObjectHideFlags: 0
  m_CorrespondingSourceObject: {fileID: 0}
  m_PrefabInstance: {fileID: 0}
  m_PrefabAsset: {fileID: 0}
  m_GameObject: {fileID: 0}
  m_Enabled: 1
  m_EditorHideFlags: 0
  m_Script: {fileID: 11500000, guid: c6569a8594504e8aa07143dea7d55046, type: 3}
  m_Name: Adrian2
  m_EditorClassIdentifier: 
  thumbnail: {fileID: 21300000, guid: a63f14156562f2d498ebc11b34f3f9e9, type: 3}
  title: Adrian2
  description: "2. A close friend of Adrian went to identify Gary\u2019s body with
    Adrian. He testified that Gary\u2019s dead body was twisted in a strange way,
    quite similar to that of Mr. Yates."
  NestedID: 
  nestedClue: []
  tagFound: 
