%YAML 1.1
%TAG !u! tag:unity3d.com,2011:
--- !u!114 &11400000
MonoBehaviour:
  m_ObjectHideFlags: 0
  m_CorrespondingSourceObject: {fileID: 0}
  m_PrefabInstance: {fileID: 0}
  m_PrefabAsset: {fileID: 0}
  m_GameObject: {fileID: 0}
  m_Enabled: 1
  m_EditorHideFlags: 0
  m_Script: {fileID: 11500000, guid: c6569a8594504e8aa07143dea7d55046, type: 3}
  m_Name: Lee_5
  m_EditorClassIdentifier: 
  thumbnail: {fileID: 21300000, guid: d3ca5f2ca8588264cbe598295d3e9bd3, type: 3}
  title: Lee_5
  description: A well kept test tube that contains inactivated virus.
  NestedID: 
  nestedClue: []
  tagFound: 
