%YAML 1.1
%TAG !u! tag:unity3d.com,2011:
--- !u!114 &11400000
MonoBehaviour:
  m_ObjectHideFlags: 0
  m_CorrespondingSourceObject: {fileID: 0}
  m_PrefabInstance: {fileID: 0}
  m_PrefabAsset: {fileID: 0}
  m_GameObject: {fileID: 0}
  m_Enabled: 1
  m_EditorHideFlags: 0
  m_Script: {fileID: 11500000, guid: c6569a8594504e8aa07143dea7d55046, type: 3}
  m_Name: Basement_4
  m_EditorClassIdentifier: 
  thumbnail: {fileID: 21300000, guid: 12f9509adeda1f94597ee1f786f669f9, type: 3}
  title: Basement_4
  description: The dead body was beheaded.
  NestedID: 
  nestedClue: []
  tagFound: 
