%YAML 1.1
%TAG !u! tag:unity3d.com,2011:
--- !u!114 &11400000
MonoBehaviour:
  m_ObjectHideFlags: 0
  m_CorrespondingSourceObject: {fileID: 0}
  m_PrefabInstance: {fileID: 0}
  m_PrefabAsset: {fileID: 0}
  m_GameObject: {fileID: 0}
  m_Enabled: 1
  m_EditorHideFlags: 0
  m_Script: {fileID: 11500000, guid: c6569a8594504e8aa07143dea7d55046, type: 3}
  m_Name: Zach_3
  m_EditorClassIdentifier: 
  thumbnail: {fileID: 21300000, guid: ea9a1b5c6768969449b7e50142dc0752, type: 3}
  title: Zach_3
  description: 'A deep cut wound in his back that has not fully healed. '
  NestedID: 
  nestedClue: []
  tagFound: 
