%YAML 1.1
%TAG !u! tag:unity3d.com,2011:
--- !u!114 &11400000
MonoBehaviour:
  m_ObjectHideFlags: 0
  m_CorrespondingSourceObject: {fileID: 0}
  m_PrefabInstance: {fileID: 0}
  m_PrefabAsset: {fileID: 0}
  m_GameObject: {fileID: 0}
  m_Enabled: 1
  m_EditorHideFlags: 0
  m_Script: {fileID: 11500000, guid: c6569a8594504e8aa07143dea7d55046, type: 3}
  m_Name: Theatre2_1
  m_EditorClassIdentifier: 
  thumbnail: {fileID: 21300000, guid: 4427c3911d8978b40bf55ee862e83a1a, type: 3}
  title: Theatre2_1
  description: A bloody napkin was found inside the trash can of the makeup room.
  NestedID: 
  nestedClue: []
  tagFound: 
