%YAML 1.1
%TAG !u! tag:unity3d.com,2011:
--- !u!114 &11400000
MonoBehaviour:
  m_ObjectHideFlags: 0
  m_CorrespondingSourceObject: {fileID: 0}
  m_PrefabInstance: {fileID: 0}
  m_PrefabAsset: {fileID: 0}
  m_GameObject: {fileID: 0}
  m_Enabled: 1
  m_EditorHideFlags: 0
  m_Script: {fileID: 11500000, guid: bbb281ee3bf0b054c82ac2347e9e782c, type: 3}
  m_Name: CuckoosNest
  m_EditorClassIdentifier: 
  m_GroupName: CuckoosNest
  m_Data:
    m_SerializedData: []
  m_GUID: 4ea98c7ac0268274aa19c1ddb7fd39c8
  m_SerializeEntries:
  - m_GUID: f66b0ddbe57815040bb9f0e00785c68a
    m_Address: Assets/Prefabs/Maps/CuckoosNest/CuckoosNest.prefab
    m_ReadOnly: 0
    m_SerializedLabels:
    - ckn3p
    m_MainAsset: {fileID: 1624997191464913774, guid: f66b0ddbe57815040bb9f0e00785c68a,
      type: 3}
    m_TargetAsset: {fileID: 1624997191464913774, guid: f66b0ddbe57815040bb9f0e00785c68a,
      type: 3}
  - m_GUID: a65a294eeab25a14198f2b67c753d82e
    m_Address: Assets/Prefabs/Maps/CuckoosNest/Basement.prefab
    m_ReadOnly: 0
    m_SerializedLabels:
    - ckn3p
    m_MainAsset: {fileID: 1624997191464913774, guid: a65a294eeab25a14198f2b67c753d82e,
      type: 3}
    m_TargetAsset: {fileID: 1624997191464913774, guid: a65a294eeab25a14198f2b67c753d82e,
      type: 3}
  - m_GUID: b9ba25a6eed15b746badc2fb6257797f
    m_Address: Assets/Scriptables/Game Questions/Cuckoos nest/Question 1.asset
    m_ReadOnly: 0
    m_SerializedLabels:
    - ckn3p
    m_MainAsset: {fileID: 11400000, guid: b9ba25a6eed15b746badc2fb6257797f, type: 2}
    m_TargetAsset: {fileID: 11400000, guid: b9ba25a6eed15b746badc2fb6257797f, type: 2}
  - m_GUID: 2a654a582ae6c244c96bbf734fcea869
    m_Address: Assets/Scriptables/Game Questions/Cuckoos nest/Question 2.asset
    m_ReadOnly: 0
    m_SerializedLabels:
    - ckn3p
    m_MainAsset: {fileID: 11400000, guid: 2a654a582ae6c244c96bbf734fcea869, type: 2}
    m_TargetAsset: {fileID: 11400000, guid: 2a654a582ae6c244c96bbf734fcea869, type: 2}
  - m_GUID: 4d448783c6b5f3e41be62601f4a22431
    m_Address: Assets/Scriptables/Game Questions/Cuckoos nest/Question 3.asset
    m_ReadOnly: 0
    m_SerializedLabels:
    - ckn3p
    m_MainAsset: {fileID: 11400000, guid: 4d448783c6b5f3e41be62601f4a22431, type: 2}
    m_TargetAsset: {fileID: 11400000, guid: 4d448783c6b5f3e41be62601f4a22431, type: 2}
  - m_GUID: bb01a70d6dd44b44f8fbd1a046937e9b
    m_Address: Assets/Scriptables/Game Questions/Cuckoos nest/Question 4.asset
    m_ReadOnly: 0
    m_SerializedLabels:
    - ckn3p
    m_MainAsset: {fileID: 11400000, guid: bb01a70d6dd44b44f8fbd1a046937e9b, type: 2}
    m_TargetAsset: {fileID: 11400000, guid: bb01a70d6dd44b44f8fbd1a046937e9b, type: 2}
  - m_GUID: cc65b67f6582d7547b799154861730d4
    m_Address: Assets/Scriptables/Game Questions/Cuckoos nest/Question 5.asset
    m_ReadOnly: 0
    m_SerializedLabels:
    - ckn3p
    m_MainAsset: {fileID: 11400000, guid: cc65b67f6582d7547b799154861730d4, type: 2}
    m_TargetAsset: {fileID: 11400000, guid: cc65b67f6582d7547b799154861730d4, type: 2}
  - m_GUID: 62f080f250a5ca2439942f234978602f
    m_Address: Assets/Scriptables/Game Scripts/Fat Man - Yung Logos.mp3
    m_ReadOnly: 0
    m_SerializedLabels:
    - ckn3p
    m_MainAsset: {fileID: 8300000, guid: 62f080f250a5ca2439942f234978602f, type: 3}
    m_TargetAsset: {fileID: 8300000, guid: 62f080f250a5ca2439942f234978602f, type: 3}
  - m_GUID: e9bf7102170db4a4893416ed01884b03
    m_Address: Assets/Scriptables/Game Clues/CuckoosNest/Anna/Anna_1.asset
    m_ReadOnly: 0
    m_SerializedLabels:
    - ckn3p
    m_MainAsset: {fileID: 11400000, guid: e9bf7102170db4a4893416ed01884b03, type: 2}
    m_TargetAsset: {fileID: 11400000, guid: e9bf7102170db4a4893416ed01884b03, type: 2}
  - m_GUID: 374753ca6ff327342959f0f790a9f57a
    m_Address: Assets/Scriptables/Game Clues/CuckoosNest/Anna/Anna_2.asset
    m_ReadOnly: 0
    m_SerializedLabels:
    - ckn3p
    m_MainAsset: {fileID: 11400000, guid: 374753ca6ff327342959f0f790a9f57a, type: 2}
    m_TargetAsset: {fileID: 11400000, guid: 374753ca6ff327342959f0f790a9f57a, type: 2}
  - m_GUID: ac795337d7f6e584c899b0d21c7710f7
    m_Address: Assets/Scriptables/Game Clues/CuckoosNest/Anna/Anna_2_1.asset
    m_ReadOnly: 0
    m_SerializedLabels:
    - ckn3p
    m_MainAsset: {fileID: 11400000, guid: ac795337d7f6e584c899b0d21c7710f7, type: 2}
    m_TargetAsset: {fileID: 11400000, guid: ac795337d7f6e584c899b0d21c7710f7, type: 2}
  - m_GUID: 501ea4f4bfb873c43977f77290735e24
    m_Address: Assets/Scriptables/Game Clues/CuckoosNest/Anna/Anna_2_2.asset
    m_ReadOnly: 0
    m_SerializedLabels:
    - ckn3p
    m_MainAsset: {fileID: 11400000, guid: 501ea4f4bfb873c43977f77290735e24, type: 2}
    m_TargetAsset: {fileID: 11400000, guid: 501ea4f4bfb873c43977f77290735e24, type: 2}
  - m_GUID: de8cd926ca81fca428d8b38a57d13087
    m_Address: Assets/Scriptables/Game Clues/CuckoosNest/Anna/Anna_3.asset
    m_ReadOnly: 0
    m_SerializedLabels:
    - ckn3p
    m_MainAsset: {fileID: 11400000, guid: de8cd926ca81fca428d8b38a57d13087, type: 2}
    m_TargetAsset: {fileID: 11400000, guid: de8cd926ca81fca428d8b38a57d13087, type: 2}
  - m_GUID: 5bd516955a8b1c14291a4ccbade3085d
    m_Address: Assets/Scriptables/Game Clues/CuckoosNest/Anna/Anna_fake.asset
    m_ReadOnly: 0
    m_SerializedLabels:
    - ckn3p
    m_MainAsset: {fileID: 11400000, guid: 5bd516955a8b1c14291a4ccbade3085d, type: 2}
    m_TargetAsset: {fileID: 11400000, guid: 5bd516955a8b1c14291a4ccbade3085d, type: 2}
  - m_GUID: b4d69a9ab5e73be438c58f72b5b490cb
    m_Address: Assets/Scriptables/Game Clues/CuckoosNest/Basement/Basement_1 1.asset
    m_ReadOnly: 0
    m_SerializedLabels:
    - ckn3p
    m_MainAsset: {fileID: 11400000, guid: b4d69a9ab5e73be438c58f72b5b490cb, type: 2}
    m_TargetAsset: {fileID: 11400000, guid: b4d69a9ab5e73be438c58f72b5b490cb, type: 2}
  - m_GUID: 116168ba336aeb048bda10ea2fe7ff88
    m_Address: Assets/Scriptables/Game Clues/CuckoosNest/Basement/Basement_2.asset
    m_ReadOnly: 0
    m_SerializedLabels:
    - ckn3p
    m_MainAsset: {fileID: 11400000, guid: 116168ba336aeb048bda10ea2fe7ff88, type: 2}
    m_TargetAsset: {fileID: 11400000, guid: 116168ba336aeb048bda10ea2fe7ff88, type: 2}
  - m_GUID: 9fb3935feeb88ff4cbcd831ffed70700
    m_Address: Assets/Scriptables/Game Clues/CuckoosNest/Basement/Basement_3.asset
    m_ReadOnly: 0
    m_SerializedLabels:
    - ckn3p
    m_MainAsset: {fileID: 11400000, guid: 9fb3935feeb88ff4cbcd831ffed70700, type: 2}
    m_TargetAsset: {fileID: 11400000, guid: 9fb3935feeb88ff4cbcd831ffed70700, type: 2}
  - m_GUID: 5e3636354d6aa4a499bd475efa60fc13
    m_Address: Assets/Scriptables/Game Clues/CuckoosNest/Basement/Basement_4.asset
    m_ReadOnly: 0
    m_SerializedLabels:
    - ckn3p
    m_MainAsset: {fileID: 11400000, guid: 5e3636354d6aa4a499bd475efa60fc13, type: 2}
    m_TargetAsset: {fileID: 11400000, guid: 5e3636354d6aa4a499bd475efa60fc13, type: 2}
  - m_GUID: 058c75a416c59ce429518985384a94c3
    m_Address: Assets/Scriptables/Game Clues/CuckoosNest/Basement/Basement_5.asset
    m_ReadOnly: 0
    m_SerializedLabels:
    - ckn3p
    m_MainAsset: {fileID: 11400000, guid: 058c75a416c59ce429518985384a94c3, type: 2}
    m_TargetAsset: {fileID: 11400000, guid: 058c75a416c59ce429518985384a94c3, type: 2}
  - m_GUID: 67b695f7ee63192438f5ed2b4093d069
    m_Address: Assets/Scriptables/Game Clues/CuckoosNest/Basement/Basement_6.asset
    m_ReadOnly: 0
    m_SerializedLabels:
    - ckn3p
    m_MainAsset: {fileID: 11400000, guid: 67b695f7ee63192438f5ed2b4093d069, type: 2}
    m_TargetAsset: {fileID: 11400000, guid: 67b695f7ee63192438f5ed2b4093d069, type: 2}
  - m_GUID: 907ebe15362cddf47a7db8db1eaa53de
    m_Address: Assets/Scriptables/Game Clues/CuckoosNest/Basement/Basement_7.asset
    m_ReadOnly: 0
    m_SerializedLabels:
    - ckn3p
    m_MainAsset: {fileID: 11400000, guid: 907ebe15362cddf47a7db8db1eaa53de, type: 2}
    m_TargetAsset: {fileID: 11400000, guid: 907ebe15362cddf47a7db8db1eaa53de, type: 2}
  - m_GUID: fd64f5ecb848343409e043af43cebfba
    m_Address: Assets/Scriptables/Game Clues/CuckoosNest/Basement/Basement_8.asset
    m_ReadOnly: 0
    m_SerializedLabels:
    - ckn3p
    m_MainAsset: {fileID: 11400000, guid: fd64f5ecb848343409e043af43cebfba, type: 2}
    m_TargetAsset: {fileID: 11400000, guid: fd64f5ecb848343409e043af43cebfba, type: 2}
  - m_GUID: 46901df384fc33746a0c0eb62b190a0c
    m_Address: Assets/Scriptables/Game Clues/CuckoosNest/Basement/Basement_9.asset
    m_ReadOnly: 0
    m_SerializedLabels:
    - ckn3p
    m_MainAsset: {fileID: 11400000, guid: 46901df384fc33746a0c0eb62b190a0c, type: 2}
    m_TargetAsset: {fileID: 11400000, guid: 46901df384fc33746a0c0eb62b190a0c, type: 2}
  - m_GUID: 12bc57f6e60df3a419fbe9054dca23b5
    m_Address: Assets/Scriptables/Game Clues/CuckoosNest/Basement/Basement_10.asset
    m_ReadOnly: 0
    m_SerializedLabels:
    - ckn3p
    m_MainAsset: {fileID: 11400000, guid: 12bc57f6e60df3a419fbe9054dca23b5, type: 2}
    m_TargetAsset: {fileID: 11400000, guid: 12bc57f6e60df3a419fbe9054dca23b5, type: 2}
  - m_GUID: 77824f8cf1d2aff4fa7bcfcd9c705e65
    m_Address: Assets/Scriptables/Game Clues/CuckoosNest/Basement/Basement_11.asset
    m_ReadOnly: 0
    m_SerializedLabels:
    - ckn3p
    m_MainAsset: {fileID: 11400000, guid: 77824f8cf1d2aff4fa7bcfcd9c705e65, type: 2}
    m_TargetAsset: {fileID: 11400000, guid: 77824f8cf1d2aff4fa7bcfcd9c705e65, type: 2}
  - m_GUID: dbac5fd2d06ae184eb6eac3674e84bbe
    m_Address: Assets/Scriptables/Game Clues/CuckoosNest/Basement/Basement_12.asset
    m_ReadOnly: 0
    m_SerializedLabels:
    - ckn3p
    m_MainAsset: {fileID: 11400000, guid: dbac5fd2d06ae184eb6eac3674e84bbe, type: 2}
    m_TargetAsset: {fileID: 11400000, guid: dbac5fd2d06ae184eb6eac3674e84bbe, type: 2}
  - m_GUID: 74bae436128a8ce4bbf8fd55154b0234
    m_Address: Assets/Scriptables/Game Clues/CuckoosNest/Bryan/Bryan_1.asset
    m_ReadOnly: 0
    m_SerializedLabels:
    - ckn3p
    m_MainAsset: {fileID: 11400000, guid: 74bae436128a8ce4bbf8fd55154b0234, type: 2}
    m_TargetAsset: {fileID: 11400000, guid: 74bae436128a8ce4bbf8fd55154b0234, type: 2}
  - m_GUID: 5803fc03950bedf408c5c5468043659f
    m_Address: Assets/Scriptables/Game Clues/CuckoosNest/Bryan/Bryan_2.asset
    m_ReadOnly: 0
    m_SerializedLabels:
    - ckn3p
    m_MainAsset: {fileID: 11400000, guid: 5803fc03950bedf408c5c5468043659f, type: 2}
    m_TargetAsset: {fileID: 11400000, guid: 5803fc03950bedf408c5c5468043659f, type: 2}
  - m_GUID: 37f4c403afec06942a8d0692de972b51
    m_Address: Assets/Scriptables/Game Clues/CuckoosNest/Bryan/Bryan_3.asset
    m_ReadOnly: 0
    m_SerializedLabels:
    - ckn3p
    m_MainAsset: {fileID: 11400000, guid: 37f4c403afec06942a8d0692de972b51, type: 2}
    m_TargetAsset: {fileID: 11400000, guid: 37f4c403afec06942a8d0692de972b51, type: 2}
  - m_GUID: 90351d0a59bd2334297a8d32aee3a98f
    m_Address: Assets/Scriptables/Game Clues/CuckoosNest/Bryan/Bryan_4.asset
    m_ReadOnly: 0
    m_SerializedLabels:
    - ckn3p
    m_MainAsset: {fileID: 11400000, guid: 90351d0a59bd2334297a8d32aee3a98f, type: 2}
    m_TargetAsset: {fileID: 11400000, guid: 90351d0a59bd2334297a8d32aee3a98f, type: 2}
  - m_GUID: ba5edd3fe6a6375428387b2a642c3556
    m_Address: Assets/Scriptables/Game Clues/CuckoosNest/Bryan/Bryan_5.asset
    m_ReadOnly: 0
    m_SerializedLabels:
    - ckn3p
    m_MainAsset: {fileID: 11400000, guid: ba5edd3fe6a6375428387b2a642c3556, type: 2}
    m_TargetAsset: {fileID: 11400000, guid: ba5edd3fe6a6375428387b2a642c3556, type: 2}
  - m_GUID: 6300b7fd502424c428772dffd6eb126f
    m_Address: Assets/Scriptables/Game Clues/CuckoosNest/Lee/Lee_1.asset
    m_ReadOnly: 0
    m_SerializedLabels:
    - ckn3p
    m_MainAsset: {fileID: 11400000, guid: 6300b7fd502424c428772dffd6eb126f, type: 2}
    m_TargetAsset: {fileID: 11400000, guid: 6300b7fd502424c428772dffd6eb126f, type: 2}
  - m_GUID: b8dfb4e7540dee4468b83b871b195c8f
    m_Address: Assets/Scriptables/Game Clues/CuckoosNest/Lee/Lee_2.asset
    m_ReadOnly: 0
    m_SerializedLabels:
    - ckn3p
    m_MainAsset: {fileID: 11400000, guid: b8dfb4e7540dee4468b83b871b195c8f, type: 2}
    m_TargetAsset: {fileID: 11400000, guid: b8dfb4e7540dee4468b83b871b195c8f, type: 2}
  - m_GUID: 9e951d961c600a3459ce5f0884c57aea
    m_Address: Assets/Scriptables/Game Clues/CuckoosNest/Lee/Lee_3.asset
    m_ReadOnly: 0
    m_SerializedLabels:
    - ckn3p
    m_MainAsset: {fileID: 11400000, guid: 9e951d961c600a3459ce5f0884c57aea, type: 2}
    m_TargetAsset: {fileID: 11400000, guid: 9e951d961c600a3459ce5f0884c57aea, type: 2}
  - m_GUID: 9dbb3bc47f7171f4ca3c7b8e086d7568
    m_Address: Assets/Scriptables/Game Clues/CuckoosNest/Lee/Lee_4.asset
    m_ReadOnly: 0
    m_SerializedLabels:
    - ckn3p
    m_MainAsset: {fileID: 11400000, guid: 9dbb3bc47f7171f4ca3c7b8e086d7568, type: 2}
    m_TargetAsset: {fileID: 11400000, guid: 9dbb3bc47f7171f4ca3c7b8e086d7568, type: 2}
  - m_GUID: 5e5c1ce32c374fb4fa73a5d2474ff364
    m_Address: Assets/Scriptables/Game Clues/CuckoosNest/Lee/Lee_5.asset
    m_ReadOnly: 0
    m_SerializedLabels:
    - ckn3p
    m_MainAsset: {fileID: 11400000, guid: 5e5c1ce32c374fb4fa73a5d2474ff364, type: 2}
    m_TargetAsset: {fileID: 11400000, guid: 5e5c1ce32c374fb4fa73a5d2474ff364, type: 2}
  - m_GUID: 581bf6cedf317ca49a612934888077ee
    m_Address: Assets/Scriptables/Game Clues/CuckoosNest/Lee/Lee_6.asset
    m_ReadOnly: 0
    m_SerializedLabels:
    - ckn3p
    m_MainAsset: {fileID: 11400000, guid: 581bf6cedf317ca49a612934888077ee, type: 2}
    m_TargetAsset: {fileID: 11400000, guid: 581bf6cedf317ca49a612934888077ee, type: 2}
  - m_GUID: ba1b6e3be7b02534a859cda1ae3b4395
    m_Address: Assets/Scriptables/Game Clues/CuckoosNest/Lee/Lee_7.asset
    m_ReadOnly: 0
    m_SerializedLabels:
    - ckn3p
    m_MainAsset: {fileID: 11400000, guid: ba1b6e3be7b02534a859cda1ae3b4395, type: 2}
    m_TargetAsset: {fileID: 11400000, guid: ba1b6e3be7b02534a859cda1ae3b4395, type: 2}
  - m_GUID: e7099abae0d75a945b704f091366b483
    m_Address: Assets/Scriptables/Game Clues/CuckoosNest/Linda/Linda_1.asset
    m_ReadOnly: 0
    m_SerializedLabels:
    - ckn3p
    m_MainAsset: {fileID: 11400000, guid: e7099abae0d75a945b704f091366b483, type: 2}
    m_TargetAsset: {fileID: 11400000, guid: e7099abae0d75a945b704f091366b483, type: 2}
  - m_GUID: 61714eb6d688a354ca9f5aa6a7b704d5
    m_Address: Assets/Scriptables/Game Clues/CuckoosNest/Linda/Linda_1_1.asset
    m_ReadOnly: 0
    m_SerializedLabels:
    - ckn3p
    m_MainAsset: {fileID: 11400000, guid: 61714eb6d688a354ca9f5aa6a7b704d5, type: 2}
    m_TargetAsset: {fileID: 11400000, guid: 61714eb6d688a354ca9f5aa6a7b704d5, type: 2}
  - m_GUID: 5120231119b410643b8473638e2e19bf
    m_Address: Assets/Scriptables/Game Clues/CuckoosNest/Linda/Linda_2.asset
    m_ReadOnly: 0
    m_SerializedLabels:
    - ckn3p
    m_MainAsset: {fileID: 11400000, guid: 5120231119b410643b8473638e2e19bf, type: 2}
    m_TargetAsset: {fileID: 11400000, guid: 5120231119b410643b8473638e2e19bf, type: 2}
  - m_GUID: ddc42584aeb3ac6478a80079de53482d
    m_Address: Assets/Scriptables/Game Clues/CuckoosNest/Ted/Ted_1.asset
    m_ReadOnly: 0
    m_SerializedLabels:
    - ckn3p
    m_MainAsset: {fileID: 11400000, guid: ddc42584aeb3ac6478a80079de53482d, type: 2}
    m_TargetAsset: {fileID: 11400000, guid: ddc42584aeb3ac6478a80079de53482d, type: 2}
  - m_GUID: b3ab231e8d2ed3f4a878bf6fd246ccfc
    m_Address: Assets/Scriptables/Game Clues/CuckoosNest/Ted/Ted_2.asset
    m_ReadOnly: 0
    m_SerializedLabels:
    - ckn3p
    m_MainAsset: {fileID: 11400000, guid: b3ab231e8d2ed3f4a878bf6fd246ccfc, type: 2}
    m_TargetAsset: {fileID: 11400000, guid: b3ab231e8d2ed3f4a878bf6fd246ccfc, type: 2}
  - m_GUID: fd9115004b8a4c347a62a77255ac5c3e
    m_Address: Assets/Scriptables/Game Clues/CuckoosNest/Ted/Ted_3.asset
    m_ReadOnly: 0
    m_SerializedLabels:
    - ckn3p
    m_MainAsset: {fileID: 11400000, guid: fd9115004b8a4c347a62a77255ac5c3e, type: 2}
    m_TargetAsset: {fileID: 11400000, guid: fd9115004b8a4c347a62a77255ac5c3e, type: 2}
  - m_GUID: 5b3059f02dbd6a54eb7e73fdeb6abd76
    m_Address: Assets/Scriptables/Game Clues/CuckoosNest/Ted/Ted_4.asset
    m_ReadOnly: 0
    m_SerializedLabels:
    - ckn3p
    m_MainAsset: {fileID: 11400000, guid: 5b3059f02dbd6a54eb7e73fdeb6abd76, type: 2}
    m_TargetAsset: {fileID: 11400000, guid: 5b3059f02dbd6a54eb7e73fdeb6abd76, type: 2}
  - m_GUID: ad2ae68d0d060b94face0fde50ce239e
    m_Address: Assets/Scriptables/Game Clues/CuckoosNest/Ted/Ted_5.asset
    m_ReadOnly: 0
    m_SerializedLabels:
    - ckn3p
    m_MainAsset: {fileID: 11400000, guid: ad2ae68d0d060b94face0fde50ce239e, type: 2}
    m_TargetAsset: {fileID: 11400000, guid: ad2ae68d0d060b94face0fde50ce239e, type: 2}
  - m_GUID: c3c265cc8a81a6b46bdcee33c3cc2993
    m_Address: Assets/Scriptables/Game Clues/CuckoosNest/Zach/Zach_1.asset
    m_ReadOnly: 0
    m_SerializedLabels:
    - ckn3p
    m_MainAsset: {fileID: 11400000, guid: c3c265cc8a81a6b46bdcee33c3cc2993, type: 2}
    m_TargetAsset: {fileID: 11400000, guid: c3c265cc8a81a6b46bdcee33c3cc2993, type: 2}
  - m_GUID: d21fa23bd71c71b49912fdb168cbc390
    m_Address: Assets/Scriptables/Game Clues/CuckoosNest/Zach/Zach_2.asset
    m_ReadOnly: 0
    m_SerializedLabels:
    - ckn3p
    m_MainAsset: {fileID: 11400000, guid: d21fa23bd71c71b49912fdb168cbc390, type: 2}
    m_TargetAsset: {fileID: 11400000, guid: d21fa23bd71c71b49912fdb168cbc390, type: 2}
  - m_GUID: 01ce96cd2b9476948a0025bc7f68d40f
    m_Address: Assets/Scriptables/Game Clues/CuckoosNest/Zach/Zach_2_1.asset
    m_ReadOnly: 0
    m_SerializedLabels:
    - ckn3p
    m_MainAsset: {fileID: 11400000, guid: 01ce96cd2b9476948a0025bc7f68d40f, type: 2}
    m_TargetAsset: {fileID: 11400000, guid: 01ce96cd2b9476948a0025bc7f68d40f, type: 2}
  - m_GUID: 7decdfad36614724bb542232483b5bec
    m_Address: Assets/Scriptables/Game Clues/CuckoosNest/Zach/Zach_2_2.asset
    m_ReadOnly: 0
    m_SerializedLabels:
    - ckn3p
    m_MainAsset: {fileID: 11400000, guid: 7decdfad36614724bb542232483b5bec, type: 2}
    m_TargetAsset: {fileID: 11400000, guid: 7decdfad36614724bb542232483b5bec, type: 2}
  - m_GUID: ea5c6de8c361553448df80cb33413359
    m_Address: Assets/Scriptables/Game Clues/CuckoosNest/Zach/Zach_2_fake.asset
    m_ReadOnly: 0
    m_SerializedLabels:
    - ckn3p
    m_MainAsset: {fileID: 11400000, guid: ea5c6de8c361553448df80cb33413359, type: 2}
    m_TargetAsset: {fileID: 11400000, guid: ea5c6de8c361553448df80cb33413359, type: 2}
  - m_GUID: b0270d80f1b43424cbd76826b0ded27a
    m_Address: Assets/Scriptables/Game Clues/CuckoosNest/Zach/Zach_3.asset
    m_ReadOnly: 0
    m_SerializedLabels:
    - ckn3p
    m_MainAsset: {fileID: 11400000, guid: b0270d80f1b43424cbd76826b0ded27a, type: 2}
    m_TargetAsset: {fileID: 11400000, guid: b0270d80f1b43424cbd76826b0ded27a, type: 2}
  - m_GUID: a78882cb2505cb249ba5feea929fef3f
    m_Address: Assets/Scriptables/Game Clues/CuckoosNest/Zach/Zach_4.asset
    m_ReadOnly: 0
    m_SerializedLabels:
    - ckn3p
    m_MainAsset: {fileID: 11400000, guid: a78882cb2505cb249ba5feea929fef3f, type: 2}
    m_TargetAsset: {fileID: 11400000, guid: a78882cb2505cb249ba5feea929fef3f, type: 2}
  - m_GUID: f83c2b417b860f04fa3189360c8e26a4
    m_Address: Assets/Sprites/Cuckoos nest/Clues/anna/anna1.jpg
    m_ReadOnly: 0
    m_SerializedLabels:
    - ckn3p
    m_MainAsset: {fileID: 2800000, guid: f83c2b417b860f04fa3189360c8e26a4, type: 3}
    m_TargetAsset: {fileID: 2800000, guid: f83c2b417b860f04fa3189360c8e26a4, type: 3}
  - m_GUID: 6e2888b7e5ac08047b51265339643c08
    m_Address: Assets/Sprites/Cuckoos nest/Clues/anna/anna2.jpg
    m_ReadOnly: 0
    m_SerializedLabels:
    - ckn3p
    m_MainAsset: {fileID: 2800000, guid: 6e2888b7e5ac08047b51265339643c08, type: 3}
    m_TargetAsset: {fileID: 2800000, guid: 6e2888b7e5ac08047b51265339643c08, type: 3}
  - m_GUID: 4a30e1fbc4103e4469b7790496a42401
    m_Address: Assets/Sprites/Cuckoos nest/Clues/anna/anna2_1.jpg
    m_ReadOnly: 0
    m_SerializedLabels:
    - ckn3p
    m_MainAsset: {fileID: 2800000, guid: 4a30e1fbc4103e4469b7790496a42401, type: 3}
    m_TargetAsset: {fileID: 2800000, guid: 4a30e1fbc4103e4469b7790496a42401, type: 3}
  - m_GUID: cac721c8a793f034182ca032d884b6a2
    m_Address: Assets/Sprites/Cuckoos nest/Clues/anna/anna2_2.jpg
    m_ReadOnly: 0
    m_SerializedLabels:
    - ckn3p
    m_MainAsset: {fileID: 2800000, guid: cac721c8a793f034182ca032d884b6a2, type: 3}
    m_TargetAsset: {fileID: 2800000, guid: cac721c8a793f034182ca032d884b6a2, type: 3}
  - m_GUID: 0c8937e9a0baadc4d9507cba99d62b77
    m_Address: Assets/Sprites/Cuckoos nest/Clues/anna/anna3.jpg
    m_ReadOnly: 0
    m_SerializedLabels:
    - ckn3p
    m_MainAsset: {fileID: 2800000, guid: 0c8937e9a0baadc4d9507cba99d62b77, type: 3}
    m_TargetAsset: {fileID: 2800000, guid: 0c8937e9a0baadc4d9507cba99d62b77, type: 3}
  - m_GUID: 591c865d4308fce4d97166f619948907
    m_Address: Assets/Sprites/Cuckoos nest/Clues/basement/base1.jpg
    m_ReadOnly: 0
    m_SerializedLabels:
    - ckn3p
    m_MainAsset: {fileID: 2800000, guid: 591c865d4308fce4d97166f619948907, type: 3}
    m_TargetAsset: {fileID: 2800000, guid: 591c865d4308fce4d97166f619948907, type: 3}
  - m_GUID: a1e37e287fed1b3489f383f61c471db4
    m_Address: Assets/Sprites/Cuckoos nest/Clues/basement/base2.jpg
    m_ReadOnly: 0
    m_SerializedLabels:
    - ckn3p
    m_MainAsset: {fileID: 2800000, guid: a1e37e287fed1b3489f383f61c471db4, type: 3}
    m_TargetAsset: {fileID: 2800000, guid: a1e37e287fed1b3489f383f61c471db4, type: 3}
  - m_GUID: 673b0c2b4040bbe4f901988dde9a1675
    m_Address: Assets/Sprites/Cuckoos nest/Clues/basement/base3.jpg
    m_ReadOnly: 0
    m_SerializedLabels:
    - ckn3p
    m_MainAsset: {fileID: 2800000, guid: 673b0c2b4040bbe4f901988dde9a1675, type: 3}
    m_TargetAsset: {fileID: 2800000, guid: 673b0c2b4040bbe4f901988dde9a1675, type: 3}
  - m_GUID: 12f9509adeda1f94597ee1f786f669f9
    m_Address: Assets/Sprites/Cuckoos nest/Clues/basement/base4.jpg
    m_ReadOnly: 0
    m_SerializedLabels:
    - ckn3p
    m_MainAsset: {fileID: 2800000, guid: 12f9509adeda1f94597ee1f786f669f9, type: 3}
    m_TargetAsset: {fileID: 2800000, guid: 12f9509adeda1f94597ee1f786f669f9, type: 3}
  - m_GUID: 820d6cebc9f414841a7a83cebb2b4014
    m_Address: Assets/Sprites/Cuckoos nest/Clues/basement/base5.jpg
    m_ReadOnly: 0
    m_SerializedLabels:
    - ckn3p
    m_MainAsset: {fileID: 2800000, guid: 820d6cebc9f414841a7a83cebb2b4014, type: 3}
    m_TargetAsset: {fileID: 2800000, guid: 820d6cebc9f414841a7a83cebb2b4014, type: 3}
  - m_GUID: 1d57bee1da3f36e4bac3c5ca14bbe401
    m_Address: Assets/Sprites/Cuckoos nest/Clues/basement/base6.jpg
    m_ReadOnly: 0
    m_SerializedLabels:
    - ckn3p
    m_MainAsset: {fileID: 2800000, guid: 1d57bee1da3f36e4bac3c5ca14bbe401, type: 3}
    m_TargetAsset: {fileID: 2800000, guid: 1d57bee1da3f36e4bac3c5ca14bbe401, type: 3}
  - m_GUID: 8ae5fccf76c00a3429f6d4795abfb1f3
    m_Address: Assets/Sprites/Cuckoos nest/Clues/basement/base7.jpg
    m_ReadOnly: 0
    m_SerializedLabels:
    - ckn3p
    m_MainAsset: {fileID: 2800000, guid: 8ae5fccf76c00a3429f6d4795abfb1f3, type: 3}
    m_TargetAsset: {fileID: 2800000, guid: 8ae5fccf76c00a3429f6d4795abfb1f3, type: 3}
  - m_GUID: c9f982cc75aaf4c42a951624652e666a
    m_Address: Assets/Sprites/Cuckoos nest/Clues/basement/base8.jpg
    m_ReadOnly: 0
    m_SerializedLabels:
    - ckn3p
    m_MainAsset: {fileID: 2800000, guid: c9f982cc75aaf4c42a951624652e666a, type: 3}
    m_TargetAsset: {fileID: 2800000, guid: c9f982cc75aaf4c42a951624652e666a, type: 3}
  - m_GUID: 4d0681af32d85ec4c9ecd15c6ba7f373
    m_Address: Assets/Sprites/Cuckoos nest/Clues/basement/base9.jpg
    m_ReadOnly: 0
    m_SerializedLabels:
    - ckn3p
    m_MainAsset: {fileID: 2800000, guid: 4d0681af32d85ec4c9ecd15c6ba7f373, type: 3}
    m_TargetAsset: {fileID: 2800000, guid: 4d0681af32d85ec4c9ecd15c6ba7f373, type: 3}
  - m_GUID: d877d8a9115cf3c4db000b03b0bd0431
    m_Address: Assets/Sprites/Cuckoos nest/Clues/basement/base10.jpg
    m_ReadOnly: 0
    m_SerializedLabels:
    - ckn3p
    m_MainAsset: {fileID: 2800000, guid: d877d8a9115cf3c4db000b03b0bd0431, type: 3}
    m_TargetAsset: {fileID: 2800000, guid: d877d8a9115cf3c4db000b03b0bd0431, type: 3}
  - m_GUID: 49c04d5042c077448aa5a308857bd4eb
    m_Address: Assets/Sprites/Cuckoos nest/Clues/basement/base11.jpg
    m_ReadOnly: 0
    m_SerializedLabels:
    - ckn3p
    m_MainAsset: {fileID: 2800000, guid: 49c04d5042c077448aa5a308857bd4eb, type: 3}
    m_TargetAsset: {fileID: 2800000, guid: 49c04d5042c077448aa5a308857bd4eb, type: 3}
  - m_GUID: 3198bc71c6a17d243ae9621424fae92a
    m_Address: Assets/Sprites/Cuckoos nest/Clues/basement/base12.jpg
    m_ReadOnly: 0
    m_SerializedLabels:
    - ckn3p
    m_MainAsset: {fileID: 2800000, guid: 3198bc71c6a17d243ae9621424fae92a, type: 3}
    m_TargetAsset: {fileID: 2800000, guid: 3198bc71c6a17d243ae9621424fae92a, type: 3}
  - m_GUID: c466e96247c700841a515813343214df
    m_Address: Assets/Sprites/Cuckoos nest/Clues/bryan/bryan.jpg
    m_ReadOnly: 0
    m_SerializedLabels:
    - ckn3p
    m_MainAsset: {fileID: 2800000, guid: c466e96247c700841a515813343214df, type: 3}
    m_TargetAsset: {fileID: 2800000, guid: c466e96247c700841a515813343214df, type: 3}
  - m_GUID: 769f4b7e975ba3947b2963ee9c0ad3ae
    m_Address: Assets/Sprites/Cuckoos nest/Clues/bryan/bryan2.jpg
    m_ReadOnly: 0
    m_SerializedLabels:
    - ckn3p
    m_MainAsset: {fileID: 2800000, guid: 769f4b7e975ba3947b2963ee9c0ad3ae, type: 3}
    m_TargetAsset: {fileID: 2800000, guid: 769f4b7e975ba3947b2963ee9c0ad3ae, type: 3}
  - m_GUID: 5fe7537238d85da4486e701c76135635
    m_Address: Assets/Sprites/Cuckoos nest/Clues/bryan/bryan3.jpg
    m_ReadOnly: 0
    m_SerializedLabels:
    - ckn3p
    m_MainAsset: {fileID: 2800000, guid: 5fe7537238d85da4486e701c76135635, type: 3}
    m_TargetAsset: {fileID: 2800000, guid: 5fe7537238d85da4486e701c76135635, type: 3}
  - m_GUID: 0c81ac9d369e1ee41a54f41cc3c90b2e
    m_Address: Assets/Sprites/Cuckoos nest/Clues/bryan/bryan4.jpg
    m_ReadOnly: 0
    m_SerializedLabels:
    - ckn3p
    m_MainAsset: {fileID: 2800000, guid: 0c81ac9d369e1ee41a54f41cc3c90b2e, type: 3}
    m_TargetAsset: {fileID: 2800000, guid: 0c81ac9d369e1ee41a54f41cc3c90b2e, type: 3}
  - m_GUID: 493cc01c6acd0d84a914c72d114ce630
    m_Address: Assets/Sprites/Cuckoos nest/Clues/bryan/bryan5.jpg
    m_ReadOnly: 0
    m_SerializedLabels:
    - ckn3p
    m_MainAsset: {fileID: 2800000, guid: 493cc01c6acd0d84a914c72d114ce630, type: 3}
    m_TargetAsset: {fileID: 2800000, guid: 493cc01c6acd0d84a914c72d114ce630, type: 3}
  - m_GUID: ad0a6ef22126b3247aeb86e41667af9d
    m_Address: Assets/Sprites/Cuckoos nest/Clues/lee/lee1.jpg
    m_ReadOnly: 0
    m_SerializedLabels:
    - ckn3p
    m_MainAsset: {fileID: 2800000, guid: ad0a6ef22126b3247aeb86e41667af9d, type: 3}
    m_TargetAsset: {fileID: 2800000, guid: ad0a6ef22126b3247aeb86e41667af9d, type: 3}
  - m_GUID: 8684ae7e8a7019440b0e2aeb3328e399
    m_Address: Assets/Sprites/Cuckoos nest/Clues/lee/lee2.jpg
    m_ReadOnly: 0
    m_SerializedLabels:
    - ckn3p
    m_MainAsset: {fileID: 2800000, guid: 8684ae7e8a7019440b0e2aeb3328e399, type: 3}
    m_TargetAsset: {fileID: 2800000, guid: 8684ae7e8a7019440b0e2aeb3328e399, type: 3}
  - m_GUID: c3953e22f6303324c897928a6e176662
    m_Address: Assets/Sprites/Cuckoos nest/Clues/lee/lee3.jpg
    m_ReadOnly: 0
    m_SerializedLabels:
    - ckn3p
    m_MainAsset: {fileID: 2800000, guid: c3953e22f6303324c897928a6e176662, type: 3}
    m_TargetAsset: {fileID: 2800000, guid: c3953e22f6303324c897928a6e176662, type: 3}
  - m_GUID: f8e0460fa65ae5c4a99d69f8eee17772
    m_Address: Assets/Sprites/Cuckoos nest/Clues/lee/lee4.jpg
    m_ReadOnly: 0
    m_SerializedLabels:
    - ckn3p
    m_MainAsset: {fileID: 2800000, guid: f8e0460fa65ae5c4a99d69f8eee17772, type: 3}
    m_TargetAsset: {fileID: 2800000, guid: f8e0460fa65ae5c4a99d69f8eee17772, type: 3}
  - m_GUID: d3ca5f2ca8588264cbe598295d3e9bd3
    m_Address: Assets/Sprites/Cuckoos nest/Clues/lee/lee5.jpg
    m_ReadOnly: 0
    m_SerializedLabels:
    - ckn3p
    m_MainAsset: {fileID: 2800000, guid: d3ca5f2ca8588264cbe598295d3e9bd3, type: 3}
    m_TargetAsset: {fileID: 2800000, guid: d3ca5f2ca8588264cbe598295d3e9bd3, type: 3}
  - m_GUID: dc47e97eead091348b149175e9274473
    m_Address: Assets/Sprites/Cuckoos nest/Clues/lee/lee6.jpg
    m_ReadOnly: 0
    m_SerializedLabels:
    - ckn3p
    m_MainAsset: {fileID: 2800000, guid: dc47e97eead091348b149175e9274473, type: 3}
    m_TargetAsset: {fileID: 2800000, guid: dc47e97eead091348b149175e9274473, type: 3}
  - m_GUID: 4048051907daa504d948ec059f0491b6
    m_Address: Assets/Sprites/Cuckoos nest/Clues/lee/lee7.jpg
    m_ReadOnly: 0
    m_SerializedLabels:
    - ckn3p
    m_MainAsset: {fileID: 2800000, guid: 4048051907daa504d948ec059f0491b6, type: 3}
    m_TargetAsset: {fileID: 2800000, guid: 4048051907daa504d948ec059f0491b6, type: 3}
  - m_GUID: 2361602be8226684397882d69cf89523
    m_Address: Assets/Sprites/Cuckoos nest/Clues/linda/linda1'.jpg
    m_ReadOnly: 0
    m_SerializedLabels:
    - ckn3p
    m_MainAsset: {fileID: 2800000, guid: 2361602be8226684397882d69cf89523, type: 3}
    m_TargetAsset: {fileID: 2800000, guid: 2361602be8226684397882d69cf89523, type: 3}
  - m_GUID: 8f3faae0d44f36d4d9339d6459e7fd17
    m_Address: Assets/Sprites/Cuckoos nest/Clues/linda/linda1.jpg
    m_ReadOnly: 0
    m_SerializedLabels:
    - ckn3p
    m_MainAsset: {fileID: 2800000, guid: 8f3faae0d44f36d4d9339d6459e7fd17, type: 3}
    m_TargetAsset: {fileID: 2800000, guid: 8f3faae0d44f36d4d9339d6459e7fd17, type: 3}
  - m_GUID: e75e2fc75d0bf9e4c97e5f4a88f17ffb
    m_Address: Assets/Sprites/Cuckoos nest/Clues/linda/linda3.jpg
    m_ReadOnly: 0
    m_SerializedLabels:
    - ckn3p
    m_MainAsset: {fileID: 2800000, guid: e75e2fc75d0bf9e4c97e5f4a88f17ffb, type: 3}
    m_TargetAsset: {fileID: 2800000, guid: e75e2fc75d0bf9e4c97e5f4a88f17ffb, type: 3}
  - m_GUID: 7d2431bb089282645896c55699b43323
    m_Address: Assets/Sprites/Cuckoos nest/Clues/ted/ted1.jpg
    m_ReadOnly: 0
    m_SerializedLabels:
    - ckn3p
    m_MainAsset: {fileID: 2800000, guid: 7d2431bb089282645896c55699b43323, type: 3}
    m_TargetAsset: {fileID: 2800000, guid: 7d2431bb089282645896c55699b43323, type: 3}
  - m_GUID: 6cfdb3a331ef6b94f80f4076410342f9
    m_Address: Assets/Sprites/Cuckoos nest/Clues/ted/ted2.jpg
    m_ReadOnly: 0
    m_SerializedLabels:
    - ckn3p
    m_MainAsset: {fileID: 2800000, guid: 6cfdb3a331ef6b94f80f4076410342f9, type: 3}
    m_TargetAsset: {fileID: 2800000, guid: 6cfdb3a331ef6b94f80f4076410342f9, type: 3}
  - m_GUID: 60bd81be4b97e8241a14c5e9499023b7
    m_Address: Assets/Sprites/Cuckoos nest/Clues/ted/ted3.jpg
    m_ReadOnly: 0
    m_SerializedLabels:
    - ckn3p
    m_MainAsset: {fileID: 2800000, guid: 60bd81be4b97e8241a14c5e9499023b7, type: 3}
    m_TargetAsset: {fileID: 2800000, guid: 60bd81be4b97e8241a14c5e9499023b7, type: 3}
  - m_GUID: 88673d380ff2c884a94ff69ec4440e69
    m_Address: Assets/Sprites/Cuckoos nest/Clues/ted/ted4.jpg
    m_ReadOnly: 0
    m_SerializedLabels:
    - ckn3p
    m_MainAsset: {fileID: 2800000, guid: 88673d380ff2c884a94ff69ec4440e69, type: 3}
    m_TargetAsset: {fileID: 2800000, guid: 88673d380ff2c884a94ff69ec4440e69, type: 3}
  - m_GUID: 3450d9b6e1eddf24abc3a7bb9defba17
    m_Address: Assets/Sprites/Cuckoos nest/Clues/ted/ted5.jpg
    m_ReadOnly: 0
    m_SerializedLabels:
    - ckn3p
    m_MainAsset: {fileID: 2800000, guid: 3450d9b6e1eddf24abc3a7bb9defba17, type: 3}
    m_TargetAsset: {fileID: 2800000, guid: 3450d9b6e1eddf24abc3a7bb9defba17, type: 3}
  - m_GUID: bf05d0f82d50f0a4d967476b44922405
    m_Address: Assets/Sprites/Cuckoos nest/Clues/zach/zach.jpg
    m_ReadOnly: 0
    m_SerializedLabels:
    - ckn3p
    m_MainAsset: {fileID: 2800000, guid: bf05d0f82d50f0a4d967476b44922405, type: 3}
    m_TargetAsset: {fileID: 2800000, guid: bf05d0f82d50f0a4d967476b44922405, type: 3}
  - m_GUID: f2c931fa0be11354bb2f99b21d0372ec
    m_Address: Assets/Sprites/Cuckoos nest/Clues/zach/zach2.jpg
    m_ReadOnly: 0
    m_SerializedLabels:
    - ckn3p
    m_MainAsset: {fileID: 2800000, guid: f2c931fa0be11354bb2f99b21d0372ec, type: 3}
    m_TargetAsset: {fileID: 2800000, guid: f2c931fa0be11354bb2f99b21d0372ec, type: 3}
  - m_GUID: 795daa778391393499da760e2dc5cb13
    m_Address: Assets/Sprites/Cuckoos nest/Clues/zach/zach2_1.jpg
    m_ReadOnly: 0
    m_SerializedLabels:
    - ckn3p
    m_MainAsset: {fileID: 2800000, guid: 795daa778391393499da760e2dc5cb13, type: 3}
    m_TargetAsset: {fileID: 2800000, guid: 795daa778391393499da760e2dc5cb13, type: 3}
  - m_GUID: 5293ccab678d00b4982f0c4aa6998bf0
    m_Address: Assets/Sprites/Cuckoos nest/Clues/zach/zach2_2.jpg
    m_ReadOnly: 0
    m_SerializedLabels:
    - ckn3p
    m_MainAsset: {fileID: 2800000, guid: 5293ccab678d00b4982f0c4aa6998bf0, type: 3}
    m_TargetAsset: {fileID: 2800000, guid: 5293ccab678d00b4982f0c4aa6998bf0, type: 3}
  - m_GUID: ea9a1b5c6768969449b7e50142dc0752
    m_Address: Assets/Sprites/Cuckoos nest/Clues/zach/zach3.jpg
    m_ReadOnly: 0
    m_SerializedLabels:
    - ckn3p
    m_MainAsset: {fileID: 2800000, guid: ea9a1b5c6768969449b7e50142dc0752, type: 3}
    m_TargetAsset: {fileID: 2800000, guid: ea9a1b5c6768969449b7e50142dc0752, type: 3}
  - m_GUID: a4821ae48183c1741a4ffa5535bd6145
    m_Address: Assets/Sprites/Cuckoos nest/Clues/zach/zach4.jpg
    m_ReadOnly: 0
    m_SerializedLabels:
    - ckn3p
    m_MainAsset: {fileID: 2800000, guid: a4821ae48183c1741a4ffa5535bd6145, type: 3}
    m_TargetAsset: {fileID: 2800000, guid: a4821ae48183c1741a4ffa5535bd6145, type: 3}
  - m_GUID: bccdcba94c5c9b84992ec168846edfe4
    m_Address: Assets/Sprites/Cuckoos nest/Maps/basement_bg.png
    m_ReadOnly: 0
    m_SerializedLabels:
    - ckn3p
    m_MainAsset: {fileID: 0}
    m_TargetAsset: {fileID: 0}
  - m_GUID: 772fa1606b3620a46af6fd7bb13115b1
    m_Address: Assets/Sprites/Cuckoos nest/Maps/bg.png
    m_ReadOnly: 0
    m_SerializedLabels:
    - ckn3p
    m_MainAsset: {fileID: 0}
    m_TargetAsset: {fileID: 0}
  - m_GUID: 4dc4c25fdcb2a8c4c989584c85ce3ce6
    m_Address: Assets/Scriptables/Game Scripts/Cuckoos nest.asset
    m_ReadOnly: 0
    m_SerializedLabels:
    - ckn3p
    m_MainAsset: {fileID: 0}
    m_TargetAsset: {fileID: 0}
  m_ReadOnly: 0
  m_Settings: {fileID: 11400000, guid: 7906c1094604a3643896619b28befd11, type: 2}
  m_SchemaSet:
    m_Schemas:
    - {fileID: 11400000, guid: 464f4920b83825f49bde9fdcb754ea78, type: 2}
    - {fileID: 11400000, guid: f9526835b27f4c1408487198506c6954, type: 2}
