%YAML 1.1
%TAG !u! tag:unity3d.com,2011:
--- !u!21 &2100000
Material:
  serializedVersion: 6
  m_ObjectHideFlags: 0
  m_CorrespondingSourceObject: {fileID: 0}
  m_PrefabInstance: {fileID: 0}
  m_PrefabAsset: {fileID: 0}
  m_Name: MFEP_Rock_1
  m_Shader: {fileID: 4800000, guid: f7919cc65d017d149bfacaf7d3a1f3ea, type: 3}
  m_ShaderKeywords: _DETAILUVMAP_UV0 _DETAIL_MULX2 _DETAIL_TEXTURED _EMISSION _METALLICGLOSSMAP
    _NORMALMAP _PARALLAXMAP _PARALLAXMAP_2MAPS _TESSELLATION_DISPLACEMENT _WETNESS_NONE
  m_LightmapFlags: 4
  m_EnableInstancingVariants: 0
  m_DoubleSidedGI: 0
  m_CustomRenderQueue: -1
  stringTagMap: {}
  disabledShaderPasses: []
  m_SavedProperties:
    serializedVersion: 3
    m_TexEnvs:
    - _Albedo_Base:
        m_Texture: {fileID: 2800000, guid: 1f2d17caba6afbf41a78fc33f492a18f, type: 3}
        m_Scale: {x: 1, y: 1}
        m_Offset: {x: 0, y: 0}
    - _Albedo_Cover:
        m_Texture: {fileID: 2800000, guid: db5873331bc2c2442bc5f61542caf221, type: 3}
        m_Scale: {x: 4, y: 4}
        m_Offset: {x: 0, y: 0}
    - _Albedo_Moss:
        m_Texture: {fileID: 2800000, guid: db5873331bc2c2442bc5f61542caf221, type: 3}
        m_Scale: {x: 2, y: 2}
        m_Offset: {x: 0, y: 0}
    - _BumpMap:
        m_Texture: {fileID: 2800000, guid: 7e1ad5c662311304ab5365956671741e, type: 3}
        m_Scale: {x: 1, y: 1}
        m_Offset: {x: 0, y: 0}
    - _BumpMap2:
        m_Texture: {fileID: 2800000, guid: c1de8a19686c6eb4fb3757bd5404e53a, type: 3}
        m_Scale: {x: 1, y: 1}
        m_Offset: {x: 0, y: 0}
    - _CoverageMask:
        m_Texture: {fileID: 0}
        m_Scale: {x: 1, y: 1}
        m_Offset: {x: 0, y: 0}
    - _DetailAlbedo:
        m_Texture: {fileID: 0}
        m_Scale: {x: 1, y: 1}
        m_Offset: {x: 0, y: 0}
    - _DetailAlbedoMap:
        m_Texture: {fileID: 0}
        m_Scale: {x: 2, y: 2}
        m_Offset: {x: 0, y: 0}
    - _DetailMap:
        m_Texture: {fileID: 2800000, guid: fe90b40457d24014a9085b1f8e9cc909, type: 3}
        m_Scale: {x: 4, y: 4}
        m_Offset: {x: 0, y: 0}
    - _DetailMask:
        m_Texture: {fileID: 0}
        m_Scale: {x: 1, y: 1}
        m_Offset: {x: 0, y: 0}
    - _DetailNormal:
        m_Texture: {fileID: 0}
        m_Scale: {x: 1, y: 1}
        m_Offset: {x: 0, y: 0}
    - _DetailNormalMap:
        m_Texture: {fileID: 2800000, guid: f9f20b48d3b19c34385ae375dada686c, type: 3}
        m_Scale: {x: 1, y: 1}
        m_Offset: {x: 0, y: 0}
    - _DisplacementTex:
        m_Texture: {fileID: 2800000, guid: f2127834338464042a58052345ec94b9, type: 3}
        m_Scale: {x: 1, y: 1}
        m_Offset: {x: 0, y: 0}
    - _DropletsMap:
        m_Texture: {fileID: 2800000, guid: 471631afc291fae4087fd072b5dbe4f3, type: 3}
        m_Scale: {x: 1, y: 1}
        m_Offset: {x: 0, y: 0}
    - _EmissionMap:
        m_Texture: {fileID: 0}
        m_Scale: {x: 1, y: 1}
        m_Offset: {x: 0, y: 0}
    - _MainTex:
        m_Texture: {fileID: 2800000, guid: 1f2d17caba6afbf41a78fc33f492a18f, type: 3}
        m_Scale: {x: 1, y: 1}
        m_Offset: {x: 0, y: 0}
    - _MainTex2:
        m_Texture: {fileID: 2800000, guid: db5873331bc2c2442bc5f61542caf221, type: 3}
        m_Scale: {x: 1, y: 1}
        m_Offset: {x: 0, y: 0}
    - _Mask:
        m_Texture: {fileID: 2800000, guid: 4bf67f72ca3980240b5755ee50581b78, type: 3}
        m_Scale: {x: 3, y: 3}
        m_Offset: {x: 0, y: 0}
    - _MaskMap:
        m_Texture: {fileID: 2800000, guid: e0de61cf03eef6348a579e40ac8f5bac, type: 3}
        m_Scale: {x: 1, y: 1}
        m_Offset: {x: 0, y: 0}
    - _MetallicGlossMap:
        m_Texture: {fileID: 2800000, guid: dc220b0f53bdb294e98454220db31b76, type: 3}
        m_Scale: {x: 1, y: 1}
        m_Offset: {x: 0, y: 0}
    - _MetallicGlossMap2:
        m_Texture: {fileID: 2800000, guid: 9889fb51ef6e68247bd8a2980b681679, type: 3}
        m_Scale: {x: 1, y: 1}
        m_Offset: {x: 0, y: 0}
    - _MetallicGlossMapDetail:
        m_Texture: {fileID: 0}
        m_Scale: {x: 1, y: 1}
        m_Offset: {x: 0, y: 0}
    - _MetallicRoughness_Moss:
        m_Texture: {fileID: 2800000, guid: f77e8137381b78c45bede37228ef0825, type: 3}
        m_Scale: {x: 2, y: 2}
        m_Offset: {x: 0, y: 0}
    - _Metallic_Base:
        m_Texture: {fileID: 2800000, guid: dc220b0f53bdb294e98454220db31b76, type: 3}
        m_Scale: {x: 1, y: 1}
        m_Offset: {x: 0, y: 0}
    - _Metallic_Cover:
        m_Texture: {fileID: 2800000, guid: f77e8137381b78c45bede37228ef0825, type: 3}
        m_Scale: {x: 4, y: 4}
        m_Offset: {x: 0, y: 0}
    - _MossDetailmap:
        m_Texture: {fileID: 2800000, guid: 843c111985eec614a981078bb54447fd, type: 3}
        m_Scale: {x: 1, y: 1}
        m_Offset: {x: 0, y: 0}
    - _Normal_Base:
        m_Texture: {fileID: 2800000, guid: 7e1ad5c662311304ab5365956671741e, type: 3}
        m_Scale: {x: 1, y: 1}
        m_Offset: {x: 0, y: 0}
    - _Normal_Cover:
        m_Texture: {fileID: 2800000, guid: c1de8a19686c6eb4fb3757bd5404e53a, type: 3}
        m_Scale: {x: 4, y: 4}
        m_Offset: {x: 0, y: 0}
    - _Normal_Moss:
        m_Texture: {fileID: 2800000, guid: c1de8a19686c6eb4fb3757bd5404e53a, type: 3}
        m_Scale: {x: 2, y: 2}
        m_Offset: {x: 0, y: 0}
    - _ObjectNormalsTex:
        m_Texture: {fileID: 0}
        m_Scale: {x: 1, y: 1}
        m_Offset: {x: 0, y: 0}
    - _ObjectTangentsTex:
        m_Texture: {fileID: 0}
        m_Scale: {x: 1, y: 1}
        m_Offset: {x: 0, y: 0}
    - _Occlusion:
        m_Texture: {fileID: 2800000, guid: b0c046bac1a100f488140d6303e8c802, type: 3}
        m_Scale: {x: 1, y: 1}
        m_Offset: {x: 0, y: 0}
    - _OcclusionMap:
        m_Texture: {fileID: 2800000, guid: b0c046bac1a100f488140d6303e8c802, type: 3}
        m_Scale: {x: 1, y: 1}
        m_Offset: {x: 0, y: 0}
    - _ParallaxMap:
        m_Texture: {fileID: 2800000, guid: 9f21f5dcc94695c449bea2419983ebae, type: 3}
        m_Scale: {x: 1, y: 1}
        m_Offset: {x: 0, y: 0}
    - _ParallaxMap2:
        m_Texture: {fileID: 2800000, guid: 01414d95f41108b44a3c0d8c45f2fce6, type: 3}
        m_Scale: {x: 1, y: 1}
        m_Offset: {x: 0, y: 0}
    - _RippleMap:
        m_Texture: {fileID: 2800000, guid: 4d78c388d122b294d9dad82d13d2d3bc, type: 3}
        m_Scale: {x: 1, y: 1}
        m_Offset: {x: 0, y: 0}
    - _RippleMapSnow:
        m_Texture: {fileID: 2800000, guid: 4d78c388d122b294d9dad82d13d2d3bc, type: 3}
        m_Scale: {x: 1, y: 1}
        m_Offset: {x: 0, y: 0}
    - _RippleMapWet:
        m_Texture: {fileID: 2800000, guid: 4d78c388d122b294d9dad82d13d2d3bc, type: 3}
        m_Scale: {x: 1, y: 1}
        m_Offset: {x: 0, y: 0}
    - _SparkleMap:
        m_Texture: {fileID: 2800000, guid: 8311693489c9728459f451148124b4ae, type: 3}
        m_Scale: {x: 1, y: 1}
        m_Offset: {x: 0, y: 0}
    - _SparkleMapGlitter:
        m_Texture: {fileID: 2800000, guid: 8311693489c9728459f451148124b4ae, type: 3}
        m_Scale: {x: 1, y: 1}
        m_Offset: {x: 0, y: 0}
    - _SparkleMapSnow:
        m_Texture: {fileID: 2800000, guid: 8311693489c9728459f451148124b4ae, type: 3}
        m_Scale: {x: 1, y: 1}
        m_Offset: {x: 0, y: 0}
    - _SpecularRGBGlossADetail:
        m_Texture: {fileID: 0}
        m_Scale: {x: 1, y: 1}
        m_Offset: {x: 0, y: 0}
    - _TopTexture0:
        m_Texture: {fileID: 2800000, guid: f77e8137381b78c45bede37228ef0825, type: 3}
        m_Scale: {x: 1, y: 1}
        m_Offset: {x: 0, y: 0}
    - _texcoord:
        m_Texture: {fileID: 0}
        m_Scale: {x: 1, y: 1}
        m_Offset: {x: 0, y: 0}
    - _texcoord2:
        m_Texture: {fileID: 0}
        m_Scale: {x: 1, y: 1}
        m_Offset: {x: 0, y: 0}
    m_Floats:
    - _BaseSmoothness: 0.5
    - _BendNormalsFreq: 4
    - _BendNormalsStrength: 0.05
    - _BumpScale: 1
    - _BumpScale2: 1
    - _Coverage: 1
    - _CoverageMaskTiling: 0.2
    - _CoverageNormalInfluence: 0.166
    - _CoverageOcclusionMask: 0.85
    - _CurvatureCustomU: 0
    - _CurvatureCustomV: 0
    - _CurvatureMultU: 1
    - _CurvatureMultV: 1
    - _Cutoff: 0.5
    - _DecalMask: 1
    - _DecalMaskGUI: 3
    - _Depth: 0.1
    - _DepthReductionDistance: 20
    - _DepthWrite: 0
    - _DetailAlbedo: 1
    - _DetailBark_Albedo: 2
    - _DetailBark_Albedo1: 2
    - _DetailEmissiveness: 0
    - _DetailGloss: 0
    - _DetailMetalness: 0
    - _DetailNormalLerp: 0
    - _DetailNormalMapScale: 1.5
    - _DetailNormalScale: 1
    - _DetailNormalValue: 0
    - _DetailSmoothness: 0.75
    - _DetailSpecLerp: 0
    - _DetailUVMap: 0
    - _DetailUVMult: 1
    - _DiffuseScatter: 1
    - _DiffuseScatteringExponent: 8
    - _DiffuseScatteringOffset: 0
    - _Displacement: 0.15
    - _DistSteps: 64
    - _DistStepsShadows: 64
    - _DropletsAnimSpeed: 10
    - _DropletsTiling: 1
    - _DstBlend: 0
    - _EdgeLength: 22
    - _EmissionPulsateSpeed: 0
    - _Float0: 1
    - _FlowCycleScale: 2
    - _FresnelPower: 1.08
    - _FresnelScale: 1
    - _Frost: 0
    - _FrostFromGlobal: 0
    - _Glitter: 0
    - _GlitterAnimationFrequency: 0.02
    - _GlitterColorization: 0.2
    - _GlitterDensity: 0.2
    - _GlitterFilter: -1
    - _GlitterMask: 0
    - _GlitterShown: 1
    - _GlitterTiling: 1
    - _GlossMapScale: 1
    - _GlossMax: 1
    - _GlossMin: 0
    - _Glossiness: 0.8
    - _Glossiness2: 0.75
    - _GlossyReflections: 1
    - _HorizontalCoverage: 1
    - _MainShown: 1
    - _Metallic: 0.45
    - _Metallic2: 0.25
    - _MetallicStrength: 0
    - _Midpoint: -0.04
    - _MinPulseBrightness: 0
    - _Mode: 0
    - _OcclusionPower: 1
    - _OcclusionStrength: 1
    - _OcclusionStrength2: 0
    - _Occlusion_from_albedo_alpha: 0
    - _POM: 0
    - _POMCurvatureType: 0
    - _POMPrecomputedFlag: 0
    - _POMShadows: 0
    - _POMShown: 1
    - _POM_BottomCut: 0
    - _POM_ExtrudeVolume: 0
    - _POM_MeshIsVolume: 0
    - _PanEmissionMask: 0
    - _PanUSpeed: 0
    - _PanVSpeed: 0
    - _Parallax: 0
    - _Parallax2: 0
    - _Phong: 0.75
    - _Pierceable: 0
    - _PresetsShown: 0
    - _PulsateEmission: 0
    - _RainIntensity: 1
    - _RainIntensityFromGlobal: 0
    - _Refraction: 0.02
    - _RefractionBumpScale: 0.5
    - _RefractionChromaticAberration: 0
    - _ReliefMIPbias: 0
    - _RippleAnimSpeed: 0.5
    - _RippleRefraction: 0.3
    - _RippleSpecFilter: 0.02
    - _RippleStrength: 0.5
    - _RippleStrengthFromGlobal: 0
    - _RippleTiling: 1
    - _SecOcclusionStrength: 0
    - _SecondaryShown: 1
    - _ShadowCull: 2
    - _ShadowMIPbias: 0
    - _ShadowStrength: 1
    - _SmoothnessTextureChannel: 0
    - _Snow: 0
    - _SnowBumpMacro: 0.1
    - _SnowBumpMicro: 0.08
    - _SnowBumpMicroFromGlobal: 0
    - _SnowDeepSmoothen: 4
    - _SnowDiffuseScatteringExponent: 6
    - _SnowDiffuseScatteringOffset: 0.4
    - _SnowDissolve: 2
    - _SnowDissolveFromGlobal: 0
    - _SnowDissolveMaskOcclusion: 0
    - _SnowGlitterColorFromGlobal: 0
    - _SnowHeightThreshold: -10000
    - _SnowHeightThresholdTransition: 1000
    - _SnowLevelFromGlobal: 0
    - _SnowMacroTiling: 1
    - _SnowMicroTiling: 4
    - _SnowShown: 1
    - _SnowSlopeDamp: 2
    - _SnowSpecGlossFromGlobal: 0
    - _SnowWorldMapping: 0
    - _Softness: 2
    - _SoftnessFade: 0.4
    - _SpecularHighlights: 1
    - _SrcBlend: 1
    - _Tan2ObjCustomU: 1
    - _Tan2ObjCustomV: 1
    - _Tan2ObjMultU: 1
    - _Tan2ObjMultV: 1
    - _Tess: 10
    - _TessDepth: 0.45
    - _TessEdgeLengthLimit: 12
    - _TessMax: 7
    - _TessMaxDisp: 8
    - _TessMin: 1
    - _TessOffset: 0.503
    - _TessPhongStrength: 0.45
    - _TessValue: 6
    - _Translucency: 0
    - _TranslucencyConstant: 0.1
    - _TranslucencyDeferredLightIndex: 0
    - _TranslucencyExponent: 30
    - _TranslucencyNDotL: 0
    - _TranslucencyNormalOffset: 0.05
    - _TranslucencyOcclusion: 0
    - _TranslucencyPointLightDirectionality: 0.7
    - _TranslucencyShown: 1
    - _TranslucencyStrength: 4
    - _TranslucencySuppressRealtimeShadows: 0.5
    - _UVSec: 0
    - _UVSecOcclusion: 0
    - _UVSecOcclusionLightmapPacked: 0
    - _UV_Clip: 0
    - _WetDroplets: 0
    - _WetRipples: 0
    - _Wetness: 0
    - _WetnessConst: 0
    - _WetnessConstFromGlobal: 0
    - _WetnessDarkening: 2
    - _WetnessEmissiveness: 0
    - _WetnessEmissivenessWrap: 0
    - _WetnessFlowGlobalTime: 1
    - _WetnessLevel: 1
    - _WetnessLevelFromGlobal: 0
    - _WetnessMergeWithSnowPerMaterial: 0
    - _WetnessNormMIP: 5
    - _WetnessNormStrength: 2
    - _WetnessNormalInfluence: 0.5
    - _WetnessShown: 1
    - _WetnessUVMult: 1
    - _ZWrite: 1
    - __dirty: 0
    - maxDist: 10
    - minDist: 1
    m_Colors:
    - _Color: {r: 1, g: 0.9834906, b: 0.9339623, a: 1}
    - _Color0: {r: 0, g: 0, b: 0, a: 0}
    - _Color2: {r: 1, g: 1, b: 1, a: 1}
    - _CoverageDirection: {r: 1, g: 3, b: 0, a: 0}
    - _CoverageRemap: {r: 0, g: 0, b: 0, a: 0}
    - _CoverageRemap2: {r: 1.4, g: 1.5, b: 0, a: 1}
    - _CurvatureMultOffset: {r: 0, g: 0, b: 0, a: 0}
    - _CutoffEdgeGlow: {r: 0, g: 0, b: 0, a: 0.02}
    - _DetailColor: {r: 1, g: 1, b: 1, a: 1}
    - _DetailSpecGloss: {r: 1, g: 1, b: 1, a: 1}
    - _DiffuseScatteringColor: {r: 0, g: 0, b: 0, a: 0}
    - _DiffuseScatteringColor2: {r: 0, g: 0, b: 0, a: 0}
    - _EmissionColor: {r: 0, g: 0, b: 0, a: 1}
    - _FresnelColor: {r: 0.9354583, g: 0.9622642, b: 0.4085084, a: 0}
    - _FresnelValues: {r: 0, g: 1, b: 1, a: 0}
    - _GlitterColor: {r: 0.8, g: 0.8, b: 0.8, a: 0.2}
    - _GlitterColor2: {r: 0.8, g: 0.8, b: 0.8, a: 0.2}
    - _MossColor: {r: 0.84705883, g: 1, b: 0.2666666, a: 0}
    - _SnowColorAndCoverage: {r: 1, g: 1, b: 1, a: 1}
    - _SnowDiffuseScatteringColor: {r: 1, g: 1, b: 1, a: 0}
    - _SnowEmissionTransparency: {r: 0.09999997, g: 0.09999997, b: 0.09999997, a: 1}
    - _SnowGlitterColor: {r: 0.8, g: 0.8, b: 0.8, a: 0.2}
    - _SnowSpecGloss: {r: 0.09999997, g: 0.09999997, b: 0.09999997, a: 0.15}
    - _SnowTranslucencyColor: {r: 0.75, g: 1, b: 1, a: 1}
    - _Tan2ObjectMultOffset: {r: 0, g: 0, b: 1, a: 1}
    - _TranslucencyColor: {r: 1, g: 1, b: 1, a: 1}
    - _TranslucencyColor2: {r: 1, g: 1, b: 1, a: 1}
    - _UV_Clip_Borders: {r: 0, g: 0, b: 1, a: 1}
    - _Vector0: {r: 0, g: 1, b: 1, a: 0}
    - _WetnessColor: {r: 0, g: 0, b: 0, a: 0}
    - _WetnessSpecGloss: {r: 0.049999982, g: 0.049999982, b: 0.049999982, a: 0.7}
    - bumpMap2TexelSize: {r: 0.00048828125, g: 0.00048828125, b: 2048, a: 2048}
    - bumpMapTexelSize: {r: 0.00024414062, g: 0.00024414062, b: 4096, a: 4096}
    - heightMapTexelSize: {r: 0.0009765625, g: 0.0009765625, b: 1024, a: 1024}
