%YAML 1.1
%TAG !u! tag:unity3d.com,2011:
--- !u!114 &11400000
MonoBehaviour:
  m_ObjectHideFlags: 0
  m_PrefabParentObject: {fileID: 0}
  m_PrefabInternal: {fileID: 0}
  m_GameObject: {fileID: 0}
  m_Enabled: 1
  m_EditorHideFlags: 0
  m_Script: {fileID: 11500000, guid: f6cc665d8f4824635820c3d72582ffdd, type: 3}
  m_Name: Authentic Sky - Cumulus B
  m_EditorClassIdentifier: 
  Parameter:
    VolumeTexture: {fileID: 11700000, guid: 961077df5894b4d44b03279a5379efc0, type: 2}
    Tiling: {x: 1, y: 1}
    Octave: 13
    Sculpture: 0.377
    Phase: -0.4
    DetailDistance: 1597
    Renderer: 4
    Ramp: 0
    RampTexture: {fileID: 0}
    RampScale: 0
    RampOffset: 0
    RampStrength: 0
    Softness: 0.684
    Density: 0.218
    Dissolve: 0
    Transparency: 0
    Scale: 3.8
    ScrollVelocity: {x: 500, y: 0, z: 500}
    Lighting: 0.782
    DirectLight: 0.342
    Ambient: 1
    LightingQuality: 0.145
    LightSmoothness: 0
    LightScattering: 0.804
    Shading: 0.802
    EdgeLighting: 0.588
    GlobalLighting: 0.11
    GlobalLightingRange: 0.608
    Shadow: 1
    ShadowSoftness: 0.038
    ShadowQuality: 0
    ShadowStrength: 0.23
    ShadowThreshold: 0
    VolumetricShadow: 0
    VolumetricShadowDensity: 0.139
    VolumetricShadowStrength: 1
    Brightness: 0
    Contrast: 0
    Horizontal: 1
    RelativeHeight: 0
    HorizontalSoftnessTop: 0.492
    HorizontalSoftnessBottom: 0.589
    HorizontalSoftnessFigure: 0.438
    FromHeight: 1357
    ToHeight: 2083
    Thickness: 1048
    FromDistance: 0
    MaxDistance: 30794
    Iteration: 129
    Fade: 0.78
    Optimize: 0.503
    HeightFog: 1
    GroundHeight: -262
    HeightFogFromDistance: 4623
    HeightFogRange: 1428
