%YAML 1.1
%TAG !u! tag:unity3d.com,2011:
--- !u!114 &11400000
MonoBehaviour:
  m_ObjectHideFlags: 0
  m_CorrespondingSourceObject: {fileID: 0}
  m_PrefabInstance: {fileID: 0}
  m_PrefabAsset: {fileID: 0}
  m_GameObject: {fileID: 0}
  m_Enabled: 1
  m_EditorHideFlags: 0
  m_Script: {fileID: 11500000, guid: f6cc665d8f4824635820c3d72582ffdd, type: 3}
  m_Name: Cumulus Surface A
  m_EditorClassIdentifier: 
  Parameter:
    VolumeTexture: {fileID: 11700000, guid: 8a3769d6c92258a45b8a1c8840707eb5, type: 2}
    Tiling: {x: 1, y: 1}
    Octave: 14.2
    Sculpture: 0.413
    Phase: -0.43
    DetailDistance: 0
    Renderer: 0
    Ramp: 0
    RampTexture: {fileID: 0}
    RampScale: 0
    RampOffset: 0
    RampStrength: 0
    Softness: 0.408
    Density: 0.85
    Dissolve: 0
    FarDissolve: 0
    Transparency: 0
    Scale: 1.67
    ScrollVelocity: {x: 500, y: 0, z: 500}
    Lighting: 0.582
    DirectLight: 0.292
    Ambient: 1
    LightingQuality: 0.131
    LightSmoothness: 0
    LightScattering: 0.224
    Shading: 0.507
    EdgeLighting: 0.34
    GlobalLighting: -0.3
    GlobalLightingRange: 0.292
    Shadow: 1
    ShadowSoftness: 0.21
    ShadowQuality: 0
    ShadowStrength: 0.402
    ShadowThreshold: 0
    VolumetricShadow: 0
    VolumetricShadowDensity: 0
    VolumetricShadowStrength: 0
    Brightness: -0.09
    Contrast: -0.11
    Horizontal: 1
    RelativeHeight: 0
    HorizontalSoftnessTop: 1
    HorizontalSoftnessBottom: 0.31
    HorizontalSoftnessFigure: 0.742
    FromHeight: 1316
    ToHeight: 1796
    Thickness: 1048
    FromDistance: 0
    MaxDistance: 60000
    Iteration: 159
    Fade: 2.39
    Optimize: 0.574
    HeightFog: 1
    GroundHeight: 49
    HeightFogFromDistance: 7055
    HeightFogRange: 2073
    FarHeightFogRange: 0
    HeightFogDensity: 0
