%YAML 1.1
%TAG !u! tag:unity3d.com,2011:
--- !u!1 &100000
GameObject:
  m_ObjectHideFlags: 0
  m_CorrespondingSourceObject: {fileID: 0}
  m_PrefabInstance: {fileID: 0}
  m_PrefabAsset: {fileID: 0}
  serializedVersion: 6
  m_Component:
  - component: {fileID: 400000}
  - component: {fileID: 11400000}
  m_Layer: 0
  m_Name: Flock Controller Wild Synced
  m_TagString: Untagged
  m_Icon: {fileID: 0}
  m_NavMeshLayer: 0
  m_StaticEditorFlags: 0
  m_IsActive: 1
--- !u!4 &400000
Transform:
  m_ObjectHideFlags: 0
  m_CorrespondingSourceObject: {fileID: 0}
  m_PrefabInstance: {fileID: 0}
  m_PrefabAsset: {fileID: 0}
  m_GameObject: {fileID: 100000}
  m_LocalRotation: {x: 0, y: 0, z: 0, w: 1}
  m_LocalPosition: {x: 0, y: 0, z: 0}
  m_LocalScale: {x: 1, y: 1, z: 1}
  m_Children: []
  m_Father: {fileID: 0}
  m_RootOrder: 0
  m_LocalEulerAnglesHint: {x: 0, y: 0, z: 0}
--- !u!114 &11400000
MonoBehaviour:
  m_ObjectHideFlags: 0
  m_CorrespondingSourceObject: {fileID: 0}
  m_PrefabInstance: {fileID: 0}
  m_PrefabAsset: {fileID: 0}
  m_GameObject: {fileID: 100000}
  m_Enabled: 1
  m_EditorHideFlags: 0
  m_Script: {fileID: 11500000, guid: 5564f499341508a43819ce17743cd92b, type: 3}
  m_Name: 
  m_EditorClassIdentifier: 
  _childPrefab: {fileID: 11400000, guid: 07d7e58af8a09f94cb4fcf51063bac59, type: 3}
  _childAmount: 147
  _slowSpawn: 0
  _spawnSphere: 3
  _spawnSphereHeight: 1.5
  _spawnSphereDepth: 3
  _minSpeed: 6.53
  _maxSpeed: 10
  _minScale: 0.7
  _maxScale: 1
  _soarFrequency: 0
  _soarAnimation: Soar
  _flapAnimation: Flap
  _idleAnimation: Idle
  _diveValue: 7
  _diveFrequency: 0
  _minDamping: 1
  _maxDamping: 2
  _waypointDistance: 1
  _minAnimationSpeed: 2
  _maxAnimationSpeed: 4
  _randomPositionTimer: 3
  _positionSphere: 25
  _positionSphereHeight: 5
  _positionSphereDepth: 25
  _childTriggerPos: 1
  _forceChildWaypoints: 1
  _forcedRandomDelay: 2
  _flatFly: 0
  _flatSoar: 0
  _birdAvoid: 0
  _birdAvoidHorizontalForce: 1000
  _birdAvoidDown: 0
  _birdAvoidUp: 0
  _birdAvoidVerticalForce: 300
  _birdAvoidDistanceMax: 4.5
  _birdAvoidDistanceMin: 5
  _soarMaxTime: 0
  _avoidanceMask:
    serializedVersion: 2
    m_Bits: 4294967295
  _roamers: []
  _posBuffer: {x: 0, y: 0, z: 0}
  _updateDivisor: 1
  _newDelta: 0
  _updateCounter: 0
  _activeChildren: 0
  _groupChildToNewTransform: 0
  _groupTransform: {fileID: 0}
  _groupName: 
  _groupChildToFlock: 1
  _startPosOffset: {x: 0, y: 0, z: 0}
  _thisT: {fileID: 400000}
