%YAML 1.1
%TAG !u! tag:unity3d.com,2011:
--- !u!21 &2100000
Material:
  serializedVersion: 6
  m_ObjectHideFlags: 0
  m_CorrespondingSourceObject: {fileID: 0}
  m_PrefabInstance: {fileID: 0}
  m_PrefabAsset: {fileID: 0}
  m_Name: Mesh_QuantumMetaCloud_8-Mat
  m_Shader: {fileID: 4800000, guid: e3d512551f08e3b41bc2e55f4c106c6c, type: 3}
  m_ShaderKeywords: 
  m_LightmapFlags: 5
  m_EnableInstancingVariants: 0
  m_DoubleSidedGI: 0
  m_CustomRenderQueue: -1
  stringTagMap: {}
  disabledShaderPasses: []
  m_SavedProperties:
    serializedVersion: 3
    m_TexEnvs:
    - _CloudTexture:
        m_Texture: {fileID: 2800000, guid: a7f8b565744c36942a9c104d0d5d49cd, type: 3}
        m_Scale: {x: 1, y: 1}
        m_Offset: {x: 0, y: 0}
    - _MainTex:
        m_Texture: {fileID: 2800000, guid: a7f8b565744c36942a9c104d0d5d49cd, type: 3}
        m_Scale: {x: 1, y: 1}
        m_Offset: {x: 0, y: 0}
    m_Floats:
    - _AlphaCutoff: 0
    - _Bias: 0.7800179
    - _CloudContrast: 1.4854814
    - _CloudGrowth: -0.2772501
    - _Cutoff: 0.5
    m_Colors:
    - _AmbientColor: {r: 0.2712644, g: 0.38350105, b: 0.45282984, a: 1}
    - _Color: {r: 0.5882353, g: 0.5882353, b: 0.5882353, a: 1}
    - _SunColor: {r: 0.8490566, g: 0.74947, b: 0.65281236, a: 1}
--- !u!1002 &2100001
EditorExtensionImpl:
  serializedVersion: 6
