%YAML 1.1
%TAG !u! tag:unity3d.com,2011:
--- !u!21 &2100000
Material:
  serializedVersion: 6
  m_ObjectHideFlags: 0
  m_PrefabParentObject: {fileID: 0}
  m_PrefabInternal: {fileID: 0}
  m_Name: Gold
  m_Shader: {fileID: 46, guid: 0000000000000000f000000000000000, type: 0}
  m_ShaderKeywords: _RENDERER_SURFACE
  m_LightmapFlags: 4
  m_EnableInstancingVariants: 0
  m_DoubleSidedGI: 0
  m_CustomRenderQueue: -1
  stringTagMap: {}
  disabledShaderPasses: []
  m_SavedProperties:
    serializedVersion: 3
    m_TexEnvs:
    - _BumpMap:
        m_Texture: {fileID: 0}
        m_Scale: {x: 1, y: 1}
        m_Offset: {x: 0, y: 0}
    - _DetailAlbedoMap:
        m_Texture: {fileID: 0}
        m_Scale: {x: 5, y: 5}
        m_Offset: {x: 0, y: 0}
    - _DetailMask:
        m_Texture: {fileID: 0}
        m_Scale: {x: 1, y: 1}
        m_Offset: {x: 0, y: 0}
    - _DetailNormalMap:
        m_Texture: {fileID: 0}
        m_Scale: {x: 1, y: 1}
        m_Offset: {x: 0, y: 0}
    - _EmissionMap:
        m_Texture: {fileID: 0}
        m_Scale: {x: 5, y: 5}
        m_Offset: {x: 0, y: 0}
    - _MainTex:
        m_Texture: {fileID: 10305, guid: 0000000000000000f000000000000000, type: 0}
        m_Scale: {x: 5, y: 5}
        m_Offset: {x: 0, y: 0}
    - _MetallicGlossMap:
        m_Texture: {fileID: 0}
        m_Scale: {x: 1, y: 1}
        m_Offset: {x: 0, y: 0}
    - _OcclusionMap:
        m_Texture: {fileID: 0}
        m_Scale: {x: 1, y: 1}
        m_Offset: {x: 0, y: 0}
    - _ParallaxMap:
        m_Texture: {fileID: 0}
        m_Scale: {x: 1, y: 1}
        m_Offset: {x: 0, y: 0}
    - _RampTex:
        m_Texture: {fileID: 0}
        m_Scale: {x: 1, y: 1}
        m_Offset: {x: 0, y: 0}
    - _VolumeTex:
        m_Texture: {fileID: 0}
        m_Scale: {x: 1, y: 1}
        m_Offset: {x: 0, y: 0}
    m_Floats:
    - _Brightness: 0
    - _BumpScale: 1
    - _ConstantLightPower: 0
    - _Contrast: 0
    - _Cutoff: 0.5
    - _Density: 0
    - _DetailNormalMapScale: 1
    - _Dissolve: 1
    - _DstBlend: 0
    - _EdgeLighting: 0
    - _Fade: 1
    - _FromDistance: 1
    - _FromHeight: 1
    - _GlobalLighting: 0
    - _GlobalLightingRange: 1
    - _GlossMapScale: 1
    - _Glossiness: 0.524
    - _GlossyReflections: 1
    - _GroundHeight: 0
    - _HEIGHTFOG: 0
    - _HORIZONTAL: 0
    - _HeightFogFromDistance: 0
    - _HeightFogRange: 0
    - _HorizontalSoftnessBottom: 0.1
    - _HorizontalSoftnessFigure: 0.5
    - _HorizontalSoftnessTop: 0.1
    - _IsLinear: 0
    - _Iteration: 16
    - _LightScattering: 0
    - _LightSmoothness: 0
    - _Lighting: 1
    - _LightingQuality: 1
    - _MaxDistance: 5000
    - _Metallic: 0.744
    - _Mode: 0
    - _OcclusionStrength: 1
    - _Octave: 1
    - _Optimize: 1
    - _Parallax: 0.02
    - _Phase: 0
    - _RAMP: 0
    - _RENDERER: 0
    - _RampOffset: 0
    - _RampScale: 0.5
    - _RampStrength: 0
    - _RelativeHeight: 0
    - _SHADOW: 0
    - _Scale: 1
    - _Sculpture: 0
    - _Shading: 1
    - _ShadowQuality: 0
    - _ShadowSoftness: 0
    - _ShadowStrength: 0
    - _ShadowThreshold: 0
    - _SmoothnessTextureChannel: 0
    - _Softness: 0.001
    - _SpecularHighlights: 1
    - _SrcBlend: 1
    - _Thickness: 50
    - _Transparency: 1
    - _UVSec: 0
    - _ZWrite: 1
    m_Colors:
    - _BaseColor: {r: 1, g: 1, b: 1, a: 1}
    - _Color: {r: 1, g: 0.92917776, b: 0.5735294, a: 1}
    - _EmissionColor: {r: 0.008, g: 0.008, b: 0.008, a: 1}
    - _FogColor: {r: 1, g: 1, b: 1, a: 1}
    - _ScrollVelocity: {r: 0, g: 0, b: 0, a: 0}
    - _ShadowColor: {r: 0, g: 0, b: 0, a: 0}
