%YAML 1.1
%TAG !u! tag:unity3d.com,2011:
--- !u!21 &2100000
Material:
  serializedVersion: 6
  m_ObjectHideFlags: 0
  m_CorrespondingSourceObject: {fileID: 0}
  m_PrefabInstance: {fileID: 0}
  m_PrefabAsset: {fileID: 0}
  m_Name: MFEP_BigTree_1
  m_Shader: {fileID: 4800000, guid: 41175ecf99105cf4489c98bbec661b3c, type: 3}
  m_ShaderKeywords: _DETAILUVMAP_UV0 _DETAIL_MULX2 _DETAIL_TEXTURED _EMISSION _METALLICGLOSSMAP
    _NORMALMAP _TESSELLATION_DISPLACEMENT _WETNESS_NONE
  m_LightmapFlags: 4
  m_EnableInstancingVariants: 0
  m_DoubleSidedGI: 0
  m_CustomRenderQueue: -1
  stringTagMap: {}
  disabledShaderPasses: []
  m_SavedProperties:
    serializedVersion: 3
    m_TexEnvs:
    - _1Albedo_Layer2:
        m_Texture: {fileID: 0}
        m_Scale: {x: 1, y: 1}
        m_Offset: {x: 0, y: 0}
    - _2Occlusion_Tiled:
        m_Texture: {fileID: 0}
        m_Scale: {x: 1, y: 1}
        m_Offset: {x: 0, y: 0}
    - _ASDF:
        m_Texture: {fileID: 0}
        m_Scale: {x: 1, y: 1}
        m_Offset: {x: 0, y: 0}
    - _AlbedoTiled:
        m_Texture: {fileID: 2800000, guid: 405d914c6adb872419068a58f5e6c919, type: 3}
        m_Scale: {x: 5, y: 5}
        m_Offset: {x: 0, y: 0}
    - _Albedo_Base:
        m_Texture: {fileID: 2800000, guid: 189a45a4a38d93d418feb6ef120b485d, type: 3}
        m_Scale: {x: 1, y: 1}
        m_Offset: {x: 0, y: 0}
    - _Albedo_Cover:
        m_Texture: {fileID: 2800000, guid: db5873331bc2c2442bc5f61542caf221, type: 3}
        m_Scale: {x: 1, y: 1}
        m_Offset: {x: 0, y: 0}
    - _Albedo_Layer2:
        m_Texture: {fileID: 2800000, guid: 405d914c6adb872419068a58f5e6c919, type: 3}
        m_Scale: {x: 1, y: 1}
        m_Offset: {x: 0, y: 0}
    - _Albedo_Moss:
        m_Texture: {fileID: 2800000, guid: db5873331bc2c2442bc5f61542caf221, type: 3}
        m_Scale: {x: 3, y: 3}
        m_Offset: {x: 0, y: 0}
    - _BotTexture3:
        m_Texture: {fileID: 0}
        m_Scale: {x: 1, y: 1}
        m_Offset: {x: 0, y: 0}
    - _BumpMap:
        m_Texture: {fileID: 2800000, guid: 638b5d1a0e8941d4f8279d89170fdd4e, type: 3}
        m_Scale: {x: 1, y: 1}
        m_Offset: {x: 0, y: 0}
    - _BumpMap2:
        m_Texture: {fileID: 2800000, guid: b472cf4f547608b489ed214d88f890c2, type: 3}
        m_Scale: {x: 1, y: 1}
        m_Offset: {x: 0, y: 0}
    - _CoverageMask:
        m_Texture: {fileID: 0}
        m_Scale: {x: 1, y: 1}
        m_Offset: {x: 0, y: 0}
    - _DetailAlbedo:
        m_Texture: {fileID: 0}
        m_Scale: {x: 1, y: 1}
        m_Offset: {x: 0, y: 0}
    - _DetailAlbedoMap:
        m_Texture: {fileID: 2800000, guid: 50a20f25284fdb641bdbc1cdbb689547, type: 3}
        m_Scale: {x: 1.5, y: 1.5}
        m_Offset: {x: 0, y: 0}
    - _DetailMap:
        m_Texture: {fileID: 2800000, guid: de13c6c2fca5fe0408df18fb9b387956, type: 3}
        m_Scale: {x: 3, y: 3}
        m_Offset: {x: 0, y: 0}
    - _DetailMask:
        m_Texture: {fileID: 0}
        m_Scale: {x: 1, y: 1}
        m_Offset: {x: 0, y: 0}
    - _DetailNormal:
        m_Texture: {fileID: 0}
        m_Scale: {x: 1, y: 1}
        m_Offset: {x: 0, y: 0}
    - _DetailNormalMap:
        m_Texture: {fileID: 2800000, guid: b472cf4f547608b489ed214d88f890c2, type: 3}
        m_Scale: {x: 1, y: 1}
        m_Offset: {x: 0, y: 0}
    - _DisplacementBase:
        m_Texture: {fileID: 2800000, guid: a046ae593599d3f4bb9a02fc6523f552, type: 3}
        m_Scale: {x: 1, y: 1}
        m_Offset: {x: 0, y: 0}
    - _DisplacementTex:
        m_Texture: {fileID: 2800000, guid: e1155ce415adf77419cd3b0dd18dbacc, type: 3}
        m_Scale: {x: 1, y: 1}
        m_Offset: {x: 0, y: 0}
    - _DisplacementTex1:
        m_Texture: {fileID: 0}
        m_Scale: {x: 1, y: 1}
        m_Offset: {x: 0, y: 0}
    - _DisplacementTex2:
        m_Texture: {fileID: 0}
        m_Scale: {x: 1, y: 1}
        m_Offset: {x: 0, y: 0}
    - _DisplacementTiled:
        m_Texture: {fileID: 2800000, guid: e1155ce415adf77419cd3b0dd18dbacc, type: 3}
        m_Scale: {x: 1, y: 1}
        m_Offset: {x: 0, y: 0}
    - _DisplacementasdfTex:
        m_Texture: {fileID: 0}
        m_Scale: {x: 1, y: 1}
        m_Offset: {x: 0, y: 0}
    - _DropletsMap:
        m_Texture: {fileID: 2800000, guid: 471631afc291fae4087fd072b5dbe4f3, type: 3}
        m_Scale: {x: 1, y: 1}
        m_Offset: {x: 0, y: 0}
    - _EmissionMap:
        m_Texture: {fileID: 0}
        m_Scale: {x: 1, y: 1}
        m_Offset: {x: 0, y: 0}
    - _MainTex:
        m_Texture: {fileID: 2800000, guid: 189a45a4a38d93d418feb6ef120b485d, type: 3}
        m_Scale: {x: 1, y: 1}
        m_Offset: {x: 0, y: 0}
    - _MainTex2:
        m_Texture: {fileID: 2800000, guid: d74182be67d41344eb1838f5360f79e9, type: 3}
        m_Scale: {x: 1, y: 1}
        m_Offset: {x: 0, y: 0}
    - _Mask:
        m_Texture: {fileID: 2800000, guid: 2c9d2c0bb74a8374ea339f3e73344056, type: 3}
        m_Scale: {x: 1, y: 1}
        m_Offset: {x: 0, y: 0}
    - _MaskMap:
        m_Texture: {fileID: 2800000, guid: 103e554cc082f184b87c3df690f34b9f, type: 3}
        m_Scale: {x: 1, y: 1}
        m_Offset: {x: 0, y: 0}
    - _MaskMapBase:
        m_Texture: {fileID: 2800000, guid: 103e554cc082f184b87c3df690f34b9f, type: 3}
        m_Scale: {x: 1, y: 1}
        m_Offset: {x: 0, y: 0}
    - _MaskMapTiled:
        m_Texture: {fileID: 2800000, guid: f43aa66216d1dd644afb4923916ebdbf, type: 3}
        m_Scale: {x: 5, y: 5}
        m_Offset: {x: 0, y: 0}
    - _MetallicGlossMap:
        m_Texture: {fileID: 2800000, guid: 73a91b26567de4945892b61397d93461, type: 3}
        m_Scale: {x: 1, y: 1}
        m_Offset: {x: 0, y: 0}
    - _MetallicGlossMap2:
        m_Texture: {fileID: 2800000, guid: 7185dde555df23b489d5c8f0b26e4c72, type: 3}
        m_Scale: {x: 1, y: 1}
        m_Offset: {x: 0, y: 0}
    - _MetallicGlossMapDetail:
        m_Texture: {fileID: 0}
        m_Scale: {x: 1, y: 1}
        m_Offset: {x: 0, y: 0}
    - _MetallicRoughness_Moss:
        m_Texture: {fileID: 2800000, guid: f77e8137381b78c45bede37228ef0825, type: 3}
        m_Scale: {x: 3, y: 3}
        m_Offset: {x: 0, y: 0}
    - _Metallic_Base:
        m_Texture: {fileID: 2800000, guid: 73a91b26567de4945892b61397d93461, type: 3}
        m_Scale: {x: 1, y: 1}
        m_Offset: {x: 0, y: 0}
    - _Metallic_Cover:
        m_Texture: {fileID: 2800000, guid: f77e8137381b78c45bede37228ef0825, type: 3}
        m_Scale: {x: 1, y: 1}
        m_Offset: {x: 0, y: 0}
    - _Metallic_Layer2:
        m_Texture: {fileID: 2800000, guid: 7185dde555df23b489d5c8f0b26e4c72, type: 3}
        m_Scale: {x: 1, y: 1}
        m_Offset: {x: 0, y: 0}
    - _MidTexture3:
        m_Texture: {fileID: 0}
        m_Scale: {x: 1, y: 1}
        m_Offset: {x: 0, y: 0}
    - _MossDetailmap:
        m_Texture: {fileID: 2800000, guid: 843c111985eec614a981078bb54447fd, type: 3}
        m_Scale: {x: 1, y: 1}
        m_Offset: {x: 0, y: 0}
    - _NormalTiled:
        m_Texture: {fileID: 2800000, guid: b472cf4f547608b489ed214d88f890c2, type: 3}
        m_Scale: {x: 5, y: 5}
        m_Offset: {x: 0, y: 0}
    - _Normal_Base:
        m_Texture: {fileID: 2800000, guid: 638b5d1a0e8941d4f8279d89170fdd4e, type: 3}
        m_Scale: {x: 1, y: 1}
        m_Offset: {x: 0, y: 0}
    - _Normal_Cover:
        m_Texture: {fileID: 2800000, guid: c1de8a19686c6eb4fb3757bd5404e53a, type: 3}
        m_Scale: {x: 1, y: 1}
        m_Offset: {x: 0, y: 0}
    - _Normal_Layer2:
        m_Texture: {fileID: 2800000, guid: b472cf4f547608b489ed214d88f890c2, type: 3}
        m_Scale: {x: 1, y: 1}
        m_Offset: {x: 0, y: 0}
    - _Normal_Moss:
        m_Texture: {fileID: 2800000, guid: c1de8a19686c6eb4fb3757bd5404e53a, type: 3}
        m_Scale: {x: 3, y: 3}
        m_Offset: {x: 0, y: 0}
    - _ObjectNormalsTex:
        m_Texture: {fileID: 0}
        m_Scale: {x: 1, y: 1}
        m_Offset: {x: 0, y: 0}
    - _ObjectTangentsTex:
        m_Texture: {fileID: 0}
        m_Scale: {x: 1, y: 1}
        m_Offset: {x: 0, y: 0}
    - _Occlusion:
        m_Texture: {fileID: 2800000, guid: 7a2d9c39f38e5f6469b9fafee0151a74, type: 3}
        m_Scale: {x: 1, y: 1}
        m_Offset: {x: 0, y: 0}
    - _OcclusionMap:
        m_Texture: {fileID: 2800000, guid: f0b76a205fd56e649bc4bc1cc6781a0a, type: 3}
        m_Scale: {x: 1, y: 1}
        m_Offset: {x: 0, y: 0}
    - _Occlusion_Base:
        m_Texture: {fileID: 2800000, guid: f0b76a205fd56e649bc4bc1cc6781a0a, type: 3}
        m_Scale: {x: 1, y: 1}
        m_Offset: {x: 0, y: 0}
    - _Occlusion_Tiled:
        m_Texture: {fileID: 2800000, guid: 7a2d9c39f38e5f6469b9fafee0151a74, type: 3}
        m_Scale: {x: 1, y: 1}
        m_Offset: {x: 0, y: 0}
    - _ParallaxMap:
        m_Texture: {fileID: 0}
        m_Scale: {x: 1, y: 1}
        m_Offset: {x: 0, y: 0}
    - _ParallaxMap2:
        m_Texture: {fileID: 0}
        m_Scale: {x: 1, y: 1}
        m_Offset: {x: 0, y: 0}
    - _RippleMap:
        m_Texture: {fileID: 2800000, guid: 4d78c388d122b294d9dad82d13d2d3bc, type: 3}
        m_Scale: {x: 1, y: 1}
        m_Offset: {x: 0, y: 0}
    - _RippleMapSnow:
        m_Texture: {fileID: 2800000, guid: 4d78c388d122b294d9dad82d13d2d3bc, type: 3}
        m_Scale: {x: 1, y: 1}
        m_Offset: {x: 0, y: 0}
    - _RippleMapWet:
        m_Texture: {fileID: 2800000, guid: 4d78c388d122b294d9dad82d13d2d3bc, type: 3}
        m_Scale: {x: 1, y: 1}
        m_Offset: {x: 0, y: 0}
    - _RockAlbedo:
        m_Texture: {fileID: 2800000, guid: 189a45a4a38d93d418feb6ef120b485d, type: 3}
        m_Scale: {x: 1, y: 1}
        m_Offset: {x: 0, y: 0}
    - _RockNormal:
        m_Texture: {fileID: 2800000, guid: 638b5d1a0e8941d4f8279d89170fdd4e, type: 3}
        m_Scale: {x: 1, y: 1}
        m_Offset: {x: 0, y: 0}
    - _RockSpecular:
        m_Texture: {fileID: 2800000, guid: 73a91b26567de4945892b61397d93461, type: 3}
        m_Scale: {x: 1, y: 1}
        m_Offset: {x: 0, y: 0}
    - _SnowAlbedo:
        m_Texture: {fileID: 2800000, guid: db5873331bc2c2442bc5f61542caf221, type: 3}
        m_Scale: {x: 4, y: 4}
        m_Offset: {x: 0, y: 0}
    - _SnowNormal:
        m_Texture: {fileID: 2800000, guid: c1de8a19686c6eb4fb3757bd5404e53a, type: 3}
        m_Scale: {x: 4, y: 4}
        m_Offset: {x: 0, y: 0}
    - _SnowSpecular:
        m_Texture: {fileID: 2800000, guid: f77e8137381b78c45bede37228ef0825, type: 3}
        m_Scale: {x: 4, y: 4}
        m_Offset: {x: 0, y: 0}
    - _SparkleMap:
        m_Texture: {fileID: 2800000, guid: 8311693489c9728459f451148124b4ae, type: 3}
        m_Scale: {x: 1, y: 1}
        m_Offset: {x: 0, y: 0}
    - _SparkleMapGlitter:
        m_Texture: {fileID: 2800000, guid: 8311693489c9728459f451148124b4ae, type: 3}
        m_Scale: {x: 1, y: 1}
        m_Offset: {x: 0, y: 0}
    - _SparkleMapSnow:
        m_Texture: {fileID: 2800000, guid: 8311693489c9728459f451148124b4ae, type: 3}
        m_Scale: {x: 1, y: 1}
        m_Offset: {x: 0, y: 0}
    - _SpecularRGBGlossADetail:
        m_Texture: {fileID: 0}
        m_Scale: {x: 1, y: 1}
        m_Offset: {x: 0, y: 0}
    - _TextureSample0:
        m_Texture: {fileID: 0}
        m_Scale: {x: 1, y: 1}
        m_Offset: {x: 0, y: 0}
    - _TopTexture0:
        m_Texture: {fileID: 0}
        m_Scale: {x: 1, y: 1}
        m_Offset: {x: 0, y: 0}
    - _asdf:
        m_Texture: {fileID: 0}
        m_Scale: {x: 1, y: 1}
        m_Offset: {x: 0, y: 0}
    - _texcoord:
        m_Texture: {fileID: 0}
        m_Scale: {x: 1, y: 1}
        m_Offset: {x: 0, y: 0}
    - _texcoord2:
        m_Texture: {fileID: 0}
        m_Scale: {x: 1, y: 1}
        m_Offset: {x: 0, y: 0}
    m_Floats:
    - _ASEOutlineWidth: 0
    - _Base_Smoothness: 0.8
    - _BendNormalsFreq: 4
    - _BendNormalsStrength: 0.05
    - _BumpScale: 1
    - _BumpScale2: 1
    - _Coverage: 1
    - _CoverageMaskTiling: 0
    - _CoverageNormalInfluence: 1
    - _CoverageNormalInfluence1: 1
    - _CoverageOcclusionMask: 0.5
    - _CoverageOcclusionMask1: 0
    - _CurvatureCustomU: 0
    - _CurvatureCustomV: 0
    - _CurvatureMultU: 1
    - _CurvatureMultV: 1
    - _Cutoff: 0.5
    - _DecalMask: 1
    - _DecalMaskGUI: 3
    - _Depth: 0.1
    - _DepthReductionDistance: 20
    - _DepthWrite: 0
    - _DetailAlbedo: 1.25
    - _DetailEmissiveness: 0
    - _DetailGloss: 0
    - _DetailMetalness: 0
    - _DetailNormalLerp: 0
    - _DetailNormalMapScale: 0.5
    - _DetailNormalScale: 1
    - _DetailNormalValue: 0
    - _DetailSmoothness: 1
    - _DetailSpecLerp: 0
    - _DetailUVMap: 0
    - _DetailUVMult: 1
    - _DiffuseScatter: 0
    - _DiffuseScatteringExponent: 2
    - _DiffuseScatteringOffset: -0.2
    - _Displacement: 0.1
    - _Displacement1: 0
    - _DistSteps: 64
    - _DistStepsShadows: 64
    - _DropletsAnimSpeed: 10
    - _DropletsTiling: 1
    - _DstBlend: 0
    - _EdgeLength: 22
    - _EmissionPulsateSpeed: 0
    - _Float0: 2
    - _Float1: 1
    - _Float2: 0
    - _Float3: 0
    - _FlowCycleScale: 2
    - _Frost: 0.237
    - _FrostFromGlobal: 0
    - _Glitter: 0
    - _GlitterAnimationFrequency: 0.02
    - _GlitterColorization: 0.2
    - _GlitterDensity: 0.2
    - _GlitterFilter: -1
    - _GlitterMask: 0
    - _GlitterShown: 1
    - _GlitterTiling: 1
    - _GlossMapScale: 0.25
    - _GlossMax: 1
    - _GlossMin: 0
    - _Glossiness: 0.5
    - _Glossiness2: 1
    - _GlossyReflections: 1
    - _HorizontalCoverage: 1
    - _HorizontalCoverageMultiplier: 1
    - _MainShown: 1
    - _MaskClipValue: 0.5
    - _Metallic: 0.5
    - _Metallic2: 1
    - _Midpoint: 0.008
    - _Midpoint1: 0
    - _MinPulseBrightness: 0
    - _Mode: 0
    - _MossTiling: 1
    - _OcclusionPower: 0
    - _OcclusionStrength: 0.75
    - _OcclusionStrength2: 0
    - _Occlusion_from_albedo_alpha: 0
    - _POM: 0
    - _POMCurvatureType: 0
    - _POMPrecomputedFlag: 0
    - _POMShadows: 0
    - _POMShown: 1
    - _POM_BottomCut: 0
    - _POM_ExtrudeVolume: 0
    - _POM_MeshIsVolume: 0
    - _PanEmissionMask: 0
    - _PanUSpeed: 0
    - _PanVSpeed: 0
    - _Parallax: 0
    - _Parallax2: 0
    - _Phong: 1
    - _Pierceable: 0
    - _PresetsShown: 0
    - _PulsateEmission: 0
    - _RainIntensity: 1
    - _RainIntensityFromGlobal: 0
    - _Refraction: 0.02
    - _RefractionBumpScale: 0.5
    - _RefractionChromaticAberration: 0
    - _ReliefMIPbias: 0
    - _RippleAnimSpeed: 0.5
    - _RippleRefraction: 0.3
    - _RippleSpecFilter: 0.02
    - _RippleStrength: 0.5
    - _RippleStrengthFromGlobal: 0
    - _RippleTiling: 1
    - _SecOcclusionStrength: 0
    - _SecondaryShown: 1
    - _ShadowCull: 2
    - _ShadowMIPbias: 0
    - _ShadowStrength: 1
    - _Smoothness: 1
    - _SmoothnessTextureChannel: 0
    - _Snow: 0
    - _SnowAmount: 1.613
    - _SnowBumpMacro: 0.1
    - _SnowBumpMicro: 0.08
    - _SnowBumpMicroFromGlobal: 0
    - _SnowDeepSmoothen: 4.36
    - _SnowDiffuseScatteringExponent: 9.06
    - _SnowDiffuseScatteringOffset: 0.4
    - _SnowDissolve: 1.52
    - _SnowDissolveFromGlobal: 0
    - _SnowDissolveMaskOcclusion: 0
    - _SnowGlitterColorFromGlobal: 0
    - _SnowHeightThreshold: -10000
    - _SnowHeightThresholdTransition: 1589
    - _SnowLevelFromGlobal: 0
    - _SnowMacroTiling: 1
    - _SnowMicroTiling: 4
    - _SnowShown: 1
    - _SnowSlopeDamp: 2
    - _SnowSpecGlossFromGlobal: 0
    - _SnowWorldMapping: 1
    - _Softness: 2
    - _SoftnessFade: 0.4
    - _SpecularHighlights: 1
    - _SrcBlend: 1
    - _Tan2ObjCustomU: 1
    - _Tan2ObjCustomV: 1
    - _Tan2ObjMultU: 1
    - _Tan2ObjMultV: 1
    - _Tess: 8.5
    - _TessDepth: 0.3
    - _TessEdgeLengthLimit: 14
    - _TessMax: 11
    - _TessMaxDisp: 7
    - _TessMin: 10
    - _TessOffset: 0.526
    - _TessPhongStrength: 0.5
    - _TessValue: 32
    - _Tessellation: 0
    - _Translucency: 0
    - _TranslucencyConstant: 0.1
    - _TranslucencyDeferredLightIndex: 0
    - _TranslucencyExponent: 30
    - _TranslucencyNDotL: 0
    - _TranslucencyNormalOffset: 0.05
    - _TranslucencyOcclusion: 0
    - _TranslucencyPointLightDirectionality: 0.7
    - _TranslucencyShown: 1
    - _TranslucencyStrength: 4
    - _TranslucencySuppressRealtimeShadows: 0.5
    - _UVSec: 0
    - _UVSecOcclusion: 0
    - _UVSecOcclusionLightmapPacked: 0
    - _UV_Clip: 0
    - _WetDroplets: 1
    - _WetRipples: 1
    - _Wetness: 0
    - _WetnessConst: 0
    - _WetnessConstFromGlobal: 0
    - _WetnessDarkening: 2
    - _WetnessEmissiveness: 0
    - _WetnessEmissivenessWrap: 0
    - _WetnessFlowGlobalTime: 1
    - _WetnessLevel: 1
    - _WetnessLevelFromGlobal: 0
    - _WetnessMergeWithSnowPerMaterial: 0
    - _WetnessNormMIP: 5
    - _WetnessNormStrength: 2
    - _WetnessNormalInfluence: 0.5
    - _WetnessShown: 1
    - _WetnessUVMult: 1
    - _ZWrite: 1
    - __dirty: 0
    - maxDist: 15
    - minDist: 1
    m_Colors:
    - _ASEOutlineColor: {r: 0, g: 0, b: 0, a: 0}
    - _Color: {r: 1, g: 0.9427992, b: 0.9117647, a: 1}
    - _Color2: {r: 0.6838235, g: 0.6838235, b: 0.6838235, a: 1}
    - _CoverageDirection: {r: 1, g: 3, b: 0, a: 0}
    - _CoverageDirection1: {r: 0, g: 6, b: 0, a: 0}
    - _CoverageRemap2: {r: 0, g: 1, b: 0, a: 1}
    - _CoverageRemap3: {r: 0, g: 1, b: 0, a: 1}
    - _CurvatureMultOffset: {r: 0, g: 0, b: 0, a: 0}
    - _CutoffEdgeGlow: {r: 0, g: 0, b: 0, a: 0.02}
    - _DetailColor: {r: 1, g: 1, b: 1, a: 1}
    - _DetailSpecGloss: {r: 1, g: 1, b: 1, a: 1}
    - _DiffuseScatteringColor: {r: 0, g: 0, b: 0, a: 0}
    - _DiffuseScatteringColor2: {r: 0, g: 0, b: 0, a: 0}
    - _EmissionColor: {r: 0, g: 0, b: 0, a: 1}
    - _FullColor: {r: 1, g: 0.9311663, b: 0.894, a: 0}
    - _GlitterColor: {r: 0.8, g: 0.8, b: 0.8, a: 0.2}
    - _GlitterColor2: {r: 0.8, g: 0.8, b: 0.8, a: 0.2}
    - _MossColor: {r: 0.8470588, g: 1, b: 0.26666665, a: 0}
    - _SnowColorAndCoverage: {r: 1, g: 1, b: 1, a: 1}
    - _SnowDiffuseScatteringColor: {r: 1, g: 1, b: 1, a: 0}
    - _SnowEmissionTransparency: {r: 0.09999997, g: 0.09999997, b: 0.09999997, a: 1}
    - _SnowGlitterColor: {r: 0.8, g: 0.8, b: 0.8, a: 0.2}
    - _SnowSpecGloss: {r: 0.09999997, g: 0.09999997, b: 0.09999997, a: 0.15}
    - _SnowTranslucencyColor: {r: 0.75, g: 1, b: 1, a: 1}
    - _Tan2ObjectMultOffset: {r: 0, g: 0, b: 1, a: 1}
    - _TranslucencyColor: {r: 1, g: 1, b: 1, a: 1}
    - _TranslucencyColor2: {r: 1, g: 1, b: 1, a: 1}
    - _UV_Clip_Borders: {r: 0, g: 0, b: 1, a: 1}
    - _WetnessColor: {r: 0, g: 0, b: 0, a: 0}
    - _WetnessSpecGloss: {r: 0.049999982, g: 0.049999982, b: 0.049999982, a: 0.7}
    - bumpMap2TexelSize: {r: 0.00024414062, g: 0.00024414062, b: 4096, a: 4096}
    - bumpMapTexelSize: {r: 0.00024414062, g: 0.00024414062, b: 4096, a: 4096}
    - heightMapTexelSize: {r: 1, g: 1, b: 1, a: 1}
