%YAML 1.1
%TAG !u! tag:unity3d.com,2011:
--- !u!1 &2005301754751673172
GameObject:
  m_ObjectHideFlags: 0
  m_CorrespondingSourceObject: {fileID: 0}
  m_PrefabInstance: {fileID: 0}
  m_PrefabAsset: {fileID: 0}
  serializedVersion: 6
  m_Component:
  - component: {fileID: 6090222407958174258}
  m_Layer: 0
  m_Name: TerminalMaritima
  m_TagString: Untagged
  m_Icon: {fileID: 0}
  m_NavMeshLayer: 0
  m_StaticEditorFlags: 0
  m_IsActive: 1
--- !u!4 &6090222407958174258
Transform:
  m_ObjectHideFlags: 0
  m_CorrespondingSourceObject: {fileID: 0}
  m_PrefabInstance: {fileID: 0}
  m_PrefabAsset: {fileID: 0}
  m_GameObject: {fileID: 2005301754751673172}
  m_LocalRotation: {x: 0, y: 0, z: 0, w: 1}
  m_LocalPosition: {x: -1861.7, y: 203, z: 16.3}
  m_LocalScale: {x: 0.1925316, y: 0.1925316, z: 0.1925316}
  m_Children:
  - {fileID: 2830192031565307942}
  - {fileID: 2829984034286767125}
  m_Father: {fileID: 0}
  m_RootOrder: 0
  m_LocalEulerAnglesHint: {x: 0, y: 0, z: 0}
--- !u!1001 &2834928987112928887
PrefabInstance:
  m_ObjectHideFlags: 0
  serializedVersion: 2
  m_Modification:
    m_TransformParent: {fileID: 6090222407958174258}
    m_Modifications:
    - target: {fileID: 1768067461857696, guid: 6a70531d35c484f46b1671ef011384d2, type: 3}
      propertyPath: m_Name
      value: SM_Ship_Station_04
      objectReference: {fileID: 0}
    - target: {fileID: 4978146065676898, guid: 6a70531d35c484f46b1671ef011384d2, type: 3}
      propertyPath: m_RootOrder
      value: 1
      objectReference: {fileID: 0}
    - target: {fileID: 4978146065676898, guid: 6a70531d35c484f46b1671ef011384d2, type: 3}
      propertyPath: m_LocalPosition.x
      value: 0
      objectReference: {fileID: 0}
    - target: {fileID: 4978146065676898, guid: 6a70531d35c484f46b1671ef011384d2, type: 3}
      propertyPath: m_LocalPosition.y
      value: 0
      objectReference: {fileID: 0}
    - target: {fileID: 4978146065676898, guid: 6a70531d35c484f46b1671ef011384d2, type: 3}
      propertyPath: m_LocalPosition.z
      value: 0
      objectReference: {fileID: 0}
    - target: {fileID: 4978146065676898, guid: 6a70531d35c484f46b1671ef011384d2, type: 3}
      propertyPath: m_LocalRotation.w
      value: 1
      objectReference: {fileID: 0}
    - target: {fileID: 4978146065676898, guid: 6a70531d35c484f46b1671ef011384d2, type: 3}
      propertyPath: m_LocalRotation.x
      value: -0
      objectReference: {fileID: 0}
    - target: {fileID: 4978146065676898, guid: 6a70531d35c484f46b1671ef011384d2, type: 3}
      propertyPath: m_LocalRotation.y
      value: -0
      objectReference: {fileID: 0}
    - target: {fileID: 4978146065676898, guid: 6a70531d35c484f46b1671ef011384d2, type: 3}
      propertyPath: m_LocalRotation.z
      value: -0
      objectReference: {fileID: 0}
    - target: {fileID: 4978146065676898, guid: 6a70531d35c484f46b1671ef011384d2, type: 3}
      propertyPath: m_LocalEulerAnglesHint.x
      value: 0
      objectReference: {fileID: 0}
    - target: {fileID: 4978146065676898, guid: 6a70531d35c484f46b1671ef011384d2, type: 3}
      propertyPath: m_LocalEulerAnglesHint.y
      value: 0
      objectReference: {fileID: 0}
    - target: {fileID: 4978146065676898, guid: 6a70531d35c484f46b1671ef011384d2, type: 3}
      propertyPath: m_LocalEulerAnglesHint.z
      value: 0
      objectReference: {fileID: 0}
    m_RemovedComponents: []
  m_SourcePrefab: {fileID: 100100000, guid: 6a70531d35c484f46b1671ef011384d2, type: 3}
--- !u!4 &2829984034286767125 stripped
Transform:
  m_CorrespondingSourceObject: {fileID: 4978146065676898, guid: 6a70531d35c484f46b1671ef011384d2, type: 3}
  m_PrefabInstance: {fileID: 2834928987112928887}
  m_PrefabAsset: {fileID: 0}
--- !u!1001 &2834928987236039848
PrefabInstance:
  m_ObjectHideFlags: 0
  serializedVersion: 2
  m_Modification:
    m_TransformParent: {fileID: 6090222407958174258}
    m_Modifications:
    - target: {fileID: 1445680428104048, guid: 85b2dea197ce2524f8fad180d568d80a, type: 3}
      propertyPath: m_Name
      value: SM_Ship_Station_06
      objectReference: {fileID: 0}
    - target: {fileID: 4904150697385102, guid: 85b2dea197ce2524f8fad180d568d80a, type: 3}
      propertyPath: m_RootOrder
      value: 0
      objectReference: {fileID: 0}
    - target: {fileID: 4904150697385102, guid: 85b2dea197ce2524f8fad180d568d80a, type: 3}
      propertyPath: m_LocalScale.x
      value: 4
      objectReference: {fileID: 0}
    - target: {fileID: 4904150697385102, guid: 85b2dea197ce2524f8fad180d568d80a, type: 3}
      propertyPath: m_LocalScale.y
      value: 1
      objectReference: {fileID: 0}
    - target: {fileID: 4904150697385102, guid: 85b2dea197ce2524f8fad180d568d80a, type: 3}
      propertyPath: m_LocalScale.z
      value: 4
      objectReference: {fileID: 0}
    - target: {fileID: 4904150697385102, guid: 85b2dea197ce2524f8fad180d568d80a, type: 3}
      propertyPath: m_LocalPosition.x
      value: 0
      objectReference: {fileID: 0}
    - target: {fileID: 4904150697385102, guid: 85b2dea197ce2524f8fad180d568d80a, type: 3}
      propertyPath: m_LocalPosition.y
      value: -73.399994
      objectReference: {fileID: 0}
    - target: {fileID: 4904150697385102, guid: 85b2dea197ce2524f8fad180d568d80a, type: 3}
      propertyPath: m_LocalPosition.z
      value: 0
      objectReference: {fileID: 0}
    - target: {fileID: 4904150697385102, guid: 85b2dea197ce2524f8fad180d568d80a, type: 3}
      propertyPath: m_LocalRotation.w
      value: 0.99077654
      objectReference: {fileID: 0}
    - target: {fileID: 4904150697385102, guid: 85b2dea197ce2524f8fad180d568d80a, type: 3}
      propertyPath: m_LocalRotation.x
      value: -0
      objectReference: {fileID: 0}
    - target: {fileID: 4904150697385102, guid: 85b2dea197ce2524f8fad180d568d80a, type: 3}
      propertyPath: m_LocalRotation.y
      value: -0.13550621
      objectReference: {fileID: 0}
    - target: {fileID: 4904150697385102, guid: 85b2dea197ce2524f8fad180d568d80a, type: 3}
      propertyPath: m_LocalRotation.z
      value: -0
      objectReference: {fileID: 0}
    - target: {fileID: 4904150697385102, guid: 85b2dea197ce2524f8fad180d568d80a, type: 3}
      propertyPath: m_LocalEulerAnglesHint.x
      value: 0
      objectReference: {fileID: 0}
    - target: {fileID: 4904150697385102, guid: 85b2dea197ce2524f8fad180d568d80a, type: 3}
      propertyPath: m_LocalEulerAnglesHint.y
      value: -15.576
      objectReference: {fileID: 0}
    - target: {fileID: 4904150697385102, guid: 85b2dea197ce2524f8fad180d568d80a, type: 3}
      propertyPath: m_LocalEulerAnglesHint.z
      value: 0
      objectReference: {fileID: 0}
    m_RemovedComponents: []
  m_SourcePrefab: {fileID: 100100000, guid: 85b2dea197ce2524f8fad180d568d80a, type: 3}
--- !u!4 &2830192031565307942 stripped
Transform:
  m_CorrespondingSourceObject: {fileID: 4904150697385102, guid: 85b2dea197ce2524f8fad180d568d80a, type: 3}
  m_PrefabInstance: {fileID: 2834928987236039848}
  m_PrefabAsset: {fileID: 0}
