%YAML 1.1
%TAG !u! tag:unity3d.com,2011:
--- !u!114 &11400000
MonoBehaviour:
  m_ObjectHideFlags: 0
  m_CorrespondingSourceObject: {fileID: 0}
  m_PrefabInstance: {fileID: 0}
  m_PrefabAsset: {fileID: 0}
  m_GameObject: {fileID: 0}
  m_Enabled: 1
  m_EditorHideFlags: 0
  m_Script: {fileID: 11500000, guid: 3e82deb1434a4e745afc0dbf04a5fef9, type: 3}
  m_Name: TransicionEnergetica
  m_EditorClassIdentifier: 
  tutorials:
  - {fileID: 4578418638051516259, guid: b8a408ef5e0427d4d8e565c8174ccda4, type: 3}
  popUps: []
  toolTips: []
  achivement: []
  intValues: 2d000000
  floatValues: []
  stringValues: []
  animationClips:
  - {fileID: 7400000, guid: ab5b869af200e7a439369fb374ddd01e, type: 2}
  sprites:
  - {fileID: 10913, guid: 0000000000000000f000000000000000, type: 0}
