%YAML 1.1
%TAG !u! tag:unity3d.com,2011:
--- !u!1045 &1
EditorBuildSettings:
  m_ObjectHideFlags: 0
  serializedVersion: 2
  m_Scenes:
  - enabled: 1
    path: Assets/Scenes/Menu.unity
    guid: f390a3087baef5041abd6453739ab1f3
  - enabled: 1
    path: Assets/Vehicles/MotoBikes/Scenes/Tutorial.unity
    guid: f372bb15a317f4f0f89f5cdcdfc856c7
  m_configObjects: {}
