%YAML 1.1
%TAG !u! tag:unity3d.com,2011:
--- !u!78 &1
TagManager:
  serializedVersion: 2
  tags:
  - accept-tag
  - Env
  - Camera
  - Checkpoint
  - Track
  layers:
  - Default
  - TransparentFX
  - Ignore Raycast
  - pp2
  - Water
  - UI
  - cam1
  - cam2
  - cam3
  - cam4
  - pp
  - another
  - 
  - 
  - 
  - 
  - 
  - 
  - 
  - 
  - 
  - 
  - 
  - 
  - 
  - 
  - 
  - 
  - 
  - 
  - 
  - 
  m_SortingLayers:
  - name: Default
    uniqueID: 0
    locked: 0
