%YAML 1.1
%TAG !u! tag:unity3d.com,2011:
--- !u!114 &11400000
MonoBehaviour:
  m_ObjectHideFlags: 0
  m_CorrespondingSourceObject: {fileID: 0}
  m_PrefabInstance: {fileID: 0}
  m_PrefabAsset: {fileID: 0}
  m_GameObject: {fileID: 0}
  m_Enabled: 1
  m_EditorHideFlags: 0
  m_Script: {fileID: 11500000, guid: c8920597392a6534998416988561c469, type: 3}
  m_Name: DialoguesData
  m_EditorClassIdentifier: 
  screens:
  - screenName: Background Frame
    textsOnBubble: []
    id: 9
    background: {fileID: 21300000, guid: ac425e3999bc6ca4c843de96c27b7c11, type: 3}
  - screenName: Penguin ask
    textsOnBubble:
    - Hmm...
    - My friends said they'd be here. Did they leave without me?"
    id: 0
    background: {fileID: 21300000, guid: ac425e3999bc6ca4c843de96c27b7c11, type: 3}
  - screenName: Gecko greet
    textsOnBubble:
    - Surprise! I was hiding in the sand hehe..
    id: 1
    background: {fileID: 21300000, guid: ac425e3999bc6ca4c843de96c27b7c11, type: 3}
  - screenName: Penguin respond
    textsOnBubble:
    - Nice try buddy.. I've got nerves of steel.
    id: 2
    background: {fileID: 0}
  - screenName: Where is bear?
    textsOnBubble:
    - '"You''re no fun.. Btw, where''s Bear? Wasn''t she coming with you?"'
    id: 3
    background: {fileID: 0}
  - screenName: Screen Flash
    textsOnBubble: []
    id: 4
    background: {fileID: 0}
  - screenName: Bronze Bear new app
    textsOnBubble:
    - NO WAY!
    - 'THIS NEW APP ALLOWS YOU TO TELEPORT ANYWHERE YOU

      WANT!'
    id: 5
    background: {fileID: 0}
  - screenName: Pengunin wants to go to the mall
    textsOnBubble:
    - LET'S USE IT TO GO TO THE MALL!
    id: 6
    background: {fileID: 0}
  - screenName: Gecko surf shop
    textsOnBubble:
    - Nah, I say let's use it to head to the surf shop..
    id: 7
    background: {fileID: 0}
  - screenName: Bronze bear decisition
    textsOnBubble:
    - How about we enjoy our time here at the beach.
    id: 8
    background: {fileID: 0}
