%YAML 1.1
%TAG !u! tag:unity3d.com,2011:
--- !u!29 &1
OcclusionCullingSettings:
  m_ObjectHideFlags: 0
  serializedVersion: 2
  m_OcclusionBakeSettings:
    smallestOccluder: 5
    smallestHole: 0.25
    backfaceThreshold: 100
  m_SceneGUID: 00000000000000000000000000000000
  m_OcclusionCullingData: {fileID: 0}
--- !u!104 &2
RenderSettings:
  m_ObjectHideFlags: 0
  serializedVersion: 9
  m_Fog: 0
  m_FogColor: {r: 0.5, g: 0.5, b: 0.5, a: 1}
  m_FogMode: 3
  m_FogDensity: 0.01
  m_LinearFogStart: 0
  m_LinearFogEnd: 300
  m_AmbientSkyColor: {r: 0.212, g: 0.227, b: 0.259, a: 1}
  m_AmbientEquatorColor: {r: 0.114, g: 0.125, b: 0.133, a: 1}
  m_AmbientGroundColor: {r: 0.047, g: 0.043, b: 0.035, a: 1}
  m_AmbientIntensity: 0.3
  m_AmbientMode: 0
  m_SubtractiveShadowColor: {r: 0.42, g: 0.478, b: 0.627, a: 1}
  m_SkyboxMaterial: {fileID: 10304, guid: 0000000000000000f000000000000000, type: 0}
  m_HaloStrength: 0.5
  m_FlareStrength: 1
  m_FlareFadeSpeed: 3
  m_HaloTexture: {fileID: 0}
  m_SpotCookie: {fileID: 10001, guid: 0000000000000000e000000000000000, type: 0}
  m_DefaultReflectionMode: 0
  m_DefaultReflectionResolution: 128
  m_ReflectionBounces: 1
  m_ReflectionIntensity: 1
  m_CustomReflection: {fileID: 0}
  m_Sun: {fileID: 533238206}
  m_IndirectSpecularColor: {r: 0, g: 0, b: 0, a: 1}
  m_UseRadianceAmbientProbe: 0
--- !u!157 &3
LightmapSettings:
  m_ObjectHideFlags: 0
  serializedVersion: 11
  m_GIWorkflowMode: 1
  m_GISettings:
    serializedVersion: 2
    m_BounceScale: 1
    m_IndirectOutputScale: 1.2
    m_AlbedoBoost: 1.7
    m_EnvironmentLightingMode: 0
    m_EnableBakedLightmaps: 1
    m_EnableRealtimeLightmaps: 1
  m_LightmapEditorSettings:
    serializedVersion: 10
    m_Resolution: 2
    m_BakeResolution: 40
    m_AtlasSize: 1024
    m_AO: 0
    m_AOMaxDistance: 1
    m_CompAOExponent: 1
    m_CompAOExponentDirect: 0
    m_Padding: 2
    m_LightmapParameters: {fileID: 0}
    m_LightmapsBakeMode: 1
    m_TextureCompression: 1
    m_FinalGather: 0
    m_FinalGatherFiltering: 1
    m_FinalGatherRayCount: 256
    m_ReflectionCompression: 2
    m_MixedBakeMode: 1
    m_BakeBackend: 0
    m_PVRSampling: 1
    m_PVRDirectSampleCount: 32
    m_PVRSampleCount: 500
    m_PVRBounces: 2
    m_PVRFilterTypeDirect: 0
    m_PVRFilterTypeIndirect: 0
    m_PVRFilterTypeAO: 0
    m_PVRFilteringMode: 0
    m_PVRCulling: 1
    m_PVRFilteringGaussRadiusDirect: 1
    m_PVRFilteringGaussRadiusIndirect: 5
    m_PVRFilteringGaussRadiusAO: 2
    m_PVRFilteringAtrousPositionSigmaDirect: 0.5
    m_PVRFilteringAtrousPositionSigmaIndirect: 2
    m_PVRFilteringAtrousPositionSigmaAO: 1
    m_ShowResolutionOverlay: 1
  m_LightingDataAsset: {fileID: 112000001, guid: 9fedd510b99f656498b848786cbb72bf,
    type: 2}
  m_UseShadowmask: 0
--- !u!196 &4
NavMeshSettings:
  serializedVersion: 2
  m_ObjectHideFlags: 0
  m_BuildSettings:
    serializedVersion: 2
    agentTypeID: 0
    agentRadius: 0.5
    agentHeight: 2
    agentSlope: 45
    agentClimb: 0.4
    ledgeDropHeight: 0
    maxJumpAcrossDistance: 0
    minRegionArea: 2
    manualCellSize: 0
    cellSize: 0.16666667
    manualTileSize: 0
    tileSize: 256
    accuratePlacement: 0
    debug:
      m_Flags: 0
  m_NavMeshData: {fileID: 0}
--- !u!1001 &281676047
PrefabInstance:
  m_ObjectHideFlags: 0
  serializedVersion: 2
  m_Modification:
    m_TransformParent: {fileID: 0}
    m_Modifications:
    - target: {fileID: 4558790678386024, guid: dca2b2cb634e6dd489273f801472ac51, type: 2}
      propertyPath: m_LocalPosition.x
      value: -0.001
      objectReference: {fileID: 0}
    - target: {fileID: 4558790678386024, guid: dca2b2cb634e6dd489273f801472ac51, type: 2}
      propertyPath: m_LocalPosition.y
      value: 0.95
      objectReference: {fileID: 0}
    - target: {fileID: 4558790678386024, guid: dca2b2cb634e6dd489273f801472ac51, type: 2}
      propertyPath: m_LocalPosition.z
      value: -7.363
      objectReference: {fileID: 0}
    - target: {fileID: 4558790678386024, guid: dca2b2cb634e6dd489273f801472ac51, type: 2}
      propertyPath: m_LocalRotation.x
      value: 0
      objectReference: {fileID: 0}
    - target: {fileID: 4558790678386024, guid: dca2b2cb634e6dd489273f801472ac51, type: 2}
      propertyPath: m_LocalRotation.y
      value: 0
      objectReference: {fileID: 0}
    - target: {fileID: 4558790678386024, guid: dca2b2cb634e6dd489273f801472ac51, type: 2}
      propertyPath: m_LocalRotation.z
      value: 0
      objectReference: {fileID: 0}
    - target: {fileID: 4558790678386024, guid: dca2b2cb634e6dd489273f801472ac51, type: 2}
      propertyPath: m_LocalRotation.w
      value: 1
      objectReference: {fileID: 0}
    - target: {fileID: 4558790678386024, guid: dca2b2cb634e6dd489273f801472ac51, type: 2}
      propertyPath: m_RootOrder
      value: 1
      objectReference: {fileID: 0}
    m_RemovedComponents: []
  m_SourcePrefab: {fileID: 100100000, guid: dca2b2cb634e6dd489273f801472ac51, type: 2}
--- !u!1 &533238205
GameObject:
  m_ObjectHideFlags: 0
  m_CorrespondingSourceObject: {fileID: 0}
  m_PrefabInstance: {fileID: 0}
  m_PrefabAsset: {fileID: 0}
  serializedVersion: 6
  m_Component:
  - component: {fileID: 533238207}
  - component: {fileID: 533238206}
  m_Layer: 0
  m_Name: Directional Light
  m_TagString: Untagged
  m_Icon: {fileID: 0}
  m_NavMeshLayer: 0
  m_StaticEditorFlags: 0
  m_IsActive: 1
--- !u!108 &533238206
Light:
  m_ObjectHideFlags: 0
  m_CorrespondingSourceObject: {fileID: 0}
  m_PrefabInstance: {fileID: 0}
  m_PrefabAsset: {fileID: 0}
  m_GameObject: {fileID: 533238205}
  m_Enabled: 1
  serializedVersion: 8
  m_Type: 1
  m_Color: {r: 1, g: 0.99655175, b: 0.875, a: 1}
  m_Intensity: 1.2
  m_Range: 10
  m_SpotAngle: 30
  m_CookieSize: 10
  m_Shadows:
    m_Type: 2
    m_Resolution: -1
    m_CustomResolution: -1
    m_Strength: 0.4
    m_Bias: 0.05
    m_NormalBias: 0.4
    m_NearPlane: 0.2
  m_Cookie: {fileID: 0}
  m_DrawHalo: 0
  m_Flare: {fileID: 0}
  m_RenderMode: 0
  m_CullingMask:
    serializedVersion: 2
    m_Bits: 4294967295
  m_Lightmapping: 4
  m_LightShadowCasterMode: 0
  m_AreaSize: {x: 1, y: 1}
  m_BounceIntensity: 0.81
  m_ColorTemperature: 6570
  m_UseColorTemperature: 0
  m_ShadowRadius: 0
  m_ShadowAngle: 0
--- !u!4 &533238207
Transform:
  m_ObjectHideFlags: 0
  m_CorrespondingSourceObject: {fileID: 0}
  m_PrefabInstance: {fileID: 0}
  m_PrefabAsset: {fileID: 0}
  m_GameObject: {fileID: 533238205}
  m_LocalRotation: {x: 0.08120697, y: -0.892391, z: 0.31537154, w: 0.3123852}
  m_LocalPosition: {x: 1.83, y: 1.773, z: -8.36}
  m_LocalScale: {x: 1, y: 1, z: 1}
  m_Children: []
  m_Father: {fileID: 0}
  m_RootOrder: 3
  m_LocalEulerAnglesHint: {x: 37.851, y: -140.117, z: 3.7830002}
--- !u!1 &628852550
GameObject:
  m_ObjectHideFlags: 0
  m_CorrespondingSourceObject: {fileID: 0}
  m_PrefabInstance: {fileID: 0}
  m_PrefabAsset: {fileID: 0}
  serializedVersion: 6
  m_Component:
  - component: {fileID: 628852555}
  - component: {fileID: 628852554}
  - component: {fileID: 628852553}
  - component: {fileID: 628852552}
  - component: {fileID: 628852551}
  m_Layer: 0
  m_Name: Main Camera
  m_TagString: MainCamera
  m_Icon: {fileID: 0}
  m_NavMeshLayer: 0
  m_StaticEditorFlags: 0
  m_IsActive: 1
--- !u!81 &628852551
AudioListener:
  m_ObjectHideFlags: 0
  m_CorrespondingSourceObject: {fileID: 0}
  m_PrefabInstance: {fileID: 0}
  m_PrefabAsset: {fileID: 0}
  m_GameObject: {fileID: 628852550}
  m_Enabled: 1
--- !u!124 &628852552
Behaviour:
  m_ObjectHideFlags: 0
  m_CorrespondingSourceObject: {fileID: 0}
  m_PrefabInstance: {fileID: 0}
  m_PrefabAsset: {fileID: 0}
  m_GameObject: {fileID: 628852550}
  m_Enabled: 1
--- !u!92 &628852553
Behaviour:
  m_ObjectHideFlags: 0
  m_CorrespondingSourceObject: {fileID: 0}
  m_PrefabInstance: {fileID: 0}
  m_PrefabAsset: {fileID: 0}
  m_GameObject: {fileID: 628852550}
  m_Enabled: 1
--- !u!20 &628852554
Camera:
  m_ObjectHideFlags: 0
  m_CorrespondingSourceObject: {fileID: 0}
  m_PrefabInstance: {fileID: 0}
  m_PrefabAsset: {fileID: 0}
  m_GameObject: {fileID: 628852550}
  m_Enabled: 1
  serializedVersion: 2
  m_ClearFlags: 1
  m_BackGroundColor: {r: 0.19215687, g: 0.3019608, b: 0.4745098, a: 0}
  m_projectionMatrixMode: 1
  m_SensorSize: {x: 36, y: 24}
  m_LensShift: {x: 0, y: 0}
  m_GateFitMode: 2
  m_FocalLength: 50
  m_NormalizedViewPortRect:
    serializedVersion: 2
    x: 0
    y: 0
    width: 1
    height: 1
  near clip plane: 0.3
  far clip plane: 1000
  field of view: 60
  orthographic: 0
  orthographic size: 5
  m_Depth: -1
  m_CullingMask:
    serializedVersion: 2
    m_Bits: 4294967295
  m_RenderingPath: -1
  m_TargetTexture: {fileID: 0}
  m_TargetDisplay: 0
  m_TargetEye: 3
  m_HDR: 0
  m_AllowMSAA: 1
  m_AllowDynamicResolution: 0
  m_ForceIntoRT: 0
  m_OcclusionCulling: 1
  m_StereoConvergence: 10
  m_StereoSeparation: 0.022
--- !u!4 &628852555
Transform:
  m_ObjectHideFlags: 0
  m_CorrespondingSourceObject: {fileID: 0}
  m_PrefabInstance: {fileID: 0}
  m_PrefabAsset: {fileID: 0}
  m_GameObject: {fileID: 628852550}
  m_LocalRotation: {x: -0, y: 0.99164367, z: -0.12900719, w: 0}
  m_LocalPosition: {x: -0.255, y: 1.587, z: -5.91}
  m_LocalScale: {x: 1, y: 1, z: 1}
  m_Children: []
  m_Father: {fileID: 0}
  m_RootOrder: 0
  m_LocalEulerAnglesHint: {x: 14.824, y: 180.00002, z: 0}
--- !u!1 &2008514226
GameObject:
  m_ObjectHideFlags: 0
  m_CorrespondingSourceObject: {fileID: 0}
  m_PrefabInstance: {fileID: 0}
  m_PrefabAsset: {fileID: 0}
  serializedVersion: 6
  m_Component:
  - component: {fileID: 2008514230}
  - component: {fileID: 2008514229}
  - component: {fileID: 2008514228}
  - component: {fileID: 2008514227}
  m_Layer: 0
  m_Name: Cylinder
  m_TagString: Untagged
  m_Icon: {fileID: 0}
  m_NavMeshLayer: 0
  m_StaticEditorFlags: 0
  m_IsActive: 1
--- !u!23 &2008514227
MeshRenderer:
  m_ObjectHideFlags: 0
  m_CorrespondingSourceObject: {fileID: 0}
  m_PrefabInstance: {fileID: 0}
  m_PrefabAsset: {fileID: 0}
  m_GameObject: {fileID: 2008514226}
  m_Enabled: 1
  m_CastShadows: 1
  m_ReceiveShadows: 1
  m_DynamicOccludee: 1
  m_MotionVectors: 1
  m_LightProbeUsage: 1
  m_ReflectionProbeUsage: 1
  m_RenderingLayerMask: 1
  m_RendererPriority: 0
  m_Materials:
  - {fileID: 10303, guid: 0000000000000000f000000000000000, type: 0}
  m_StaticBatchInfo:
    firstSubMesh: 0
    subMeshCount: 0
  m_StaticBatchRoot: {fileID: 0}
  m_ProbeAnchor: {fileID: 0}
  m_LightProbeVolumeOverride: {fileID: 0}
  m_ScaleInLightmap: 1
  m_PreserveUVs: 1
  m_IgnoreNormalsForChartDetection: 0
  m_ImportantGI: 0
  m_StitchLightmapSeams: 0
  m_SelectedEditorRenderState: 3
  m_MinimumChartSize: 4
  m_AutoUVMaxDistance: 0.5
  m_AutoUVMaxAngle: 89
  m_LightmapParameters: {fileID: 0}
  m_SortingLayerID: 0
  m_SortingLayer: 0
  m_SortingOrder: 0
--- !u!136 &2008514228
CapsuleCollider:
  m_ObjectHideFlags: 0
  m_CorrespondingSourceObject: {fileID: 0}
  m_PrefabInstance: {fileID: 0}
  m_PrefabAsset: {fileID: 0}
  m_GameObject: {fileID: 2008514226}
  m_Material: {fileID: 0}
  m_IsTrigger: 0
  m_Enabled: 1
  m_Radius: 0.5
  m_Height: 2
  m_Direction: 1
  m_Center: {x: 0, y: 0, z: 0}
--- !u!33 &2008514229
MeshFilter:
  m_ObjectHideFlags: 0
  m_CorrespondingSourceObject: {fileID: 0}
  m_PrefabInstance: {fileID: 0}
  m_PrefabAsset: {fileID: 0}
  m_GameObject: {fileID: 2008514226}
  m_Mesh: {fileID: 10206, guid: 0000000000000000e000000000000000, type: 0}
--- !u!4 &2008514230
Transform:
  m_ObjectHideFlags: 0
  m_CorrespondingSourceObject: {fileID: 0}
  m_PrefabInstance: {fileID: 0}
  m_PrefabAsset: {fileID: 0}
  m_GameObject: {fileID: 2008514226}
  m_LocalRotation: {x: 0, y: 0, z: 0, w: 1}
  m_LocalPosition: {x: -0.239, y: 0.888, z: -7.365}
  m_LocalScale: {x: 2.0167997, y: -0.017015656, z: 2.0168}
  m_Children: []
  m_Father: {fileID: 0}
  m_RootOrder: 4
  m_LocalEulerAnglesHint: {x: 0, y: 0, z: 0}
--- !u!1001 &2134177424
PrefabInstance:
  m_ObjectHideFlags: 0
  serializedVersion: 2
  m_Modification:
    m_TransformParent: {fileID: 0}
    m_Modifications:
    - target: {fileID: 4084349093795320, guid: 4f3f9f6ab35c4324dbff495be4a1ce75, type: 3}
      propertyPath: m_LocalPosition.x
      value: -0.15770718
      objectReference: {fileID: 0}
    - target: {fileID: 4084349093795320, guid: 4f3f9f6ab35c4324dbff495be4a1ce75, type: 3}
      propertyPath: m_LocalPosition.y
      value: 0.97104263
      objectReference: {fileID: 0}
    - target: {fileID: 4084349093795320, guid: 4f3f9f6ab35c4324dbff495be4a1ce75, type: 3}
      propertyPath: m_LocalPosition.z
      value: 2.4330616
      objectReference: {fileID: 0}
    - target: {fileID: 4084349093795320, guid: 4f3f9f6ab35c4324dbff495be4a1ce75, type: 3}
      propertyPath: m_LocalRotation.x
      value: -0
      objectReference: {fileID: 0}
    - target: {fileID: 4084349093795320, guid: 4f3f9f6ab35c4324dbff495be4a1ce75, type: 3}
      propertyPath: m_LocalRotation.y
      value: -0
      objectReference: {fileID: 0}
    - target: {fileID: 4084349093795320, guid: 4f3f9f6ab35c4324dbff495be4a1ce75, type: 3}
      propertyPath: m_LocalRotation.z
      value: -0
      objectReference: {fileID: 0}
    - target: {fileID: 4084349093795320, guid: 4f3f9f6ab35c4324dbff495be4a1ce75, type: 3}
      propertyPath: m_LocalRotation.w
      value: 1
      objectReference: {fileID: 0}
    - target: {fileID: 4084349093795320, guid: 4f3f9f6ab35c4324dbff495be4a1ce75, type: 3}
      propertyPath: m_RootOrder
      value: 2
      objectReference: {fileID: 0}
    - target: {fileID: 4562436608217070, guid: 4f3f9f6ab35c4324dbff495be4a1ce75, type: 3}
      propertyPath: m_LocalPosition.z
      value: -4247
      objectReference: {fileID: 0}
    - target: {fileID: 4562436608217070, guid: 4f3f9f6ab35c4324dbff495be4a1ce75, type: 3}
      propertyPath: m_LocalPosition.x
      value: 2561
      objectReference: {fileID: 0}
    - target: {fileID: 4801090260444960, guid: 4f3f9f6ab35c4324dbff495be4a1ce75, type: 3}
      propertyPath: m_LocalPosition.x
      value: 97.4
      objectReference: {fileID: 0}
    - target: {fileID: 4801090260444960, guid: 4f3f9f6ab35c4324dbff495be4a1ce75, type: 3}
      propertyPath: m_LocalPosition.z
      value: -28.9
      objectReference: {fileID: 0}
    - target: {fileID: 4157311916141712, guid: 4f3f9f6ab35c4324dbff495be4a1ce75, type: 3}
      propertyPath: m_LocalPosition.x
      value: 97.4
      objectReference: {fileID: 0}
    - target: {fileID: 4157311916141712, guid: 4f3f9f6ab35c4324dbff495be4a1ce75, type: 3}
      propertyPath: m_LocalPosition.z
      value: -32
      objectReference: {fileID: 0}
    - target: {fileID: 4322274185763542, guid: 4f3f9f6ab35c4324dbff495be4a1ce75, type: 3}
      propertyPath: m_LocalPosition.x
      value: 97.4
      objectReference: {fileID: 0}
    - target: {fileID: 4322274185763542, guid: 4f3f9f6ab35c4324dbff495be4a1ce75, type: 3}
      propertyPath: m_LocalPosition.z
      value: -28.9
      objectReference: {fileID: 0}
    - target: {fileID: 4216798705999296, guid: 4f3f9f6ab35c4324dbff495be4a1ce75, type: 3}
      propertyPath: m_LocalPosition.x
      value: -8745
      objectReference: {fileID: 0}
    - target: {fileID: 4216798705999296, guid: 4f3f9f6ab35c4324dbff495be4a1ce75, type: 3}
      propertyPath: m_LocalPosition.z
      value: -1402
      objectReference: {fileID: 0}
    - target: {fileID: 4052754092451370, guid: 4f3f9f6ab35c4324dbff495be4a1ce75, type: 3}
      propertyPath: m_LocalPosition.x
      value: -8745
      objectReference: {fileID: 0}
    - target: {fileID: 4052754092451370, guid: 4f3f9f6ab35c4324dbff495be4a1ce75, type: 3}
      propertyPath: m_LocalPosition.z
      value: -1402
      objectReference: {fileID: 0}
    - target: {fileID: 4518957713633542, guid: 4f3f9f6ab35c4324dbff495be4a1ce75, type: 3}
      propertyPath: m_LocalPosition.x
      value: -14459
      objectReference: {fileID: 0}
    - target: {fileID: 4793570261946116, guid: 4f3f9f6ab35c4324dbff495be4a1ce75, type: 3}
      propertyPath: m_LocalPosition.x
      value: -14458
      objectReference: {fileID: 0}
    - target: {fileID: 4494425011995820, guid: 4f3f9f6ab35c4324dbff495be4a1ce75, type: 3}
      propertyPath: m_LocalPosition.x
      value: -2978
      objectReference: {fileID: 0}
    - target: {fileID: 4494425011995820, guid: 4f3f9f6ab35c4324dbff495be4a1ce75, type: 3}
      propertyPath: m_LocalPosition.z
      value: 2580
      objectReference: {fileID: 0}
    - target: {fileID: 4206759715665654, guid: 4f3f9f6ab35c4324dbff495be4a1ce75, type: 3}
      propertyPath: m_LocalPosition.x
      value: -2977
      objectReference: {fileID: 0}
    - target: {fileID: 4206759715665654, guid: 4f3f9f6ab35c4324dbff495be4a1ce75, type: 3}
      propertyPath: m_LocalPosition.z
      value: 2602
      objectReference: {fileID: 0}
    - target: {fileID: 4764303385995594, guid: 4f3f9f6ab35c4324dbff495be4a1ce75, type: 3}
      propertyPath: m_LocalPosition.x
      value: 7096
      objectReference: {fileID: 0}
    - target: {fileID: 4764303385995594, guid: 4f3f9f6ab35c4324dbff495be4a1ce75, type: 3}
      propertyPath: m_LocalPosition.z
      value: -23313
      objectReference: {fileID: 0}
    - target: {fileID: 4164104470866332, guid: 4f3f9f6ab35c4324dbff495be4a1ce75, type: 3}
      propertyPath: m_LocalPosition.x
      value: 7096
      objectReference: {fileID: 0}
    - target: {fileID: 4164104470866332, guid: 4f3f9f6ab35c4324dbff495be4a1ce75, type: 3}
      propertyPath: m_LocalPosition.z
      value: -23909
      objectReference: {fileID: 0}
    - target: {fileID: 4843404021199954, guid: 4f3f9f6ab35c4324dbff495be4a1ce75, type: 3}
      propertyPath: m_LocalPosition.x
      value: -6145
      objectReference: {fileID: 0}
    - target: {fileID: 4843404021199954, guid: 4f3f9f6ab35c4324dbff495be4a1ce75, type: 3}
      propertyPath: m_LocalPosition.z
      value: -16717
      objectReference: {fileID: 0}
    - target: {fileID: 4382060769251766, guid: 4f3f9f6ab35c4324dbff495be4a1ce75, type: 3}
      propertyPath: m_LocalPosition.x
      value: -6144
      objectReference: {fileID: 0}
    - target: {fileID: 4382060769251766, guid: 4f3f9f6ab35c4324dbff495be4a1ce75, type: 3}
      propertyPath: m_LocalPosition.z
      value: -16695
      objectReference: {fileID: 0}
    - target: {fileID: 4462348592493710, guid: 4f3f9f6ab35c4324dbff495be4a1ce75, type: 3}
      propertyPath: m_LocalPosition.z
      value: 13232
      objectReference: {fileID: 0}
    - target: {fileID: 4106832090400442, guid: 4f3f9f6ab35c4324dbff495be4a1ce75, type: 3}
      propertyPath: m_LocalPosition.z
      value: 13232
      objectReference: {fileID: 0}
    - target: {fileID: 4328670439900614, guid: 4f3f9f6ab35c4324dbff495be4a1ce75, type: 3}
      propertyPath: m_LocalPosition.z
      value: 12983
      objectReference: {fileID: 0}
    - target: {fileID: 4890551742732484, guid: 4f3f9f6ab35c4324dbff495be4a1ce75, type: 3}
      propertyPath: m_LocalPosition.x
      value: -6797
      objectReference: {fileID: 0}
    - target: {fileID: 4890551742732484, guid: 4f3f9f6ab35c4324dbff495be4a1ce75, type: 3}
      propertyPath: m_LocalPosition.z
      value: 8008
      objectReference: {fileID: 0}
    - target: {fileID: 4242970771478110, guid: 4f3f9f6ab35c4324dbff495be4a1ce75, type: 3}
      propertyPath: m_LocalPosition.x
      value: -6797
      objectReference: {fileID: 0}
    - target: {fileID: 4242970771478110, guid: 4f3f9f6ab35c4324dbff495be4a1ce75, type: 3}
      propertyPath: m_LocalPosition.z
      value: 7297
      objectReference: {fileID: 0}
    - target: {fileID: 4241426367711982, guid: 4f3f9f6ab35c4324dbff495be4a1ce75, type: 3}
      propertyPath: m_LocalPosition.z
      value: -4398
      objectReference: {fileID: 0}
    - target: {fileID: 4241426367711982, guid: 4f3f9f6ab35c4324dbff495be4a1ce75, type: 3}
      propertyPath: m_LocalPosition.x
      value: 2547
      objectReference: {fileID: 0}
    - target: {fileID: 4369877187965112, guid: 4f3f9f6ab35c4324dbff495be4a1ce75, type: 3}
      propertyPath: m_LocalPosition.x
      value: -12875
      objectReference: {fileID: 0}
    - target: {fileID: 4369877187965112, guid: 4f3f9f6ab35c4324dbff495be4a1ce75, type: 3}
      propertyPath: m_LocalPosition.z
      value: -7916
      objectReference: {fileID: 0}
    - target: {fileID: 4172942500893034, guid: 4f3f9f6ab35c4324dbff495be4a1ce75, type: 3}
      propertyPath: m_LocalPosition.x
      value: -12875
      objectReference: {fileID: 0}
    - target: {fileID: 4172942500893034, guid: 4f3f9f6ab35c4324dbff495be4a1ce75, type: 3}
      propertyPath: m_LocalPosition.z
      value: -8316
      objectReference: {fileID: 0}
    m_RemovedComponents: []
  m_SourcePrefab: {fileID: 100100000, guid: 4f3f9f6ab35c4324dbff495be4a1ce75, type: 3}
