%YAML 1.1
%TAG !u! tag:unity3d.com,2011:
--- !u!1 &1189634168653162
GameObject:
  m_ObjectHideFlags: 0
  m_CorrespondingSourceObject: {fileID: 0}
  m_PrefabInstance: {fileID: 0}
  m_PrefabAsset: {fileID: 0}
  serializedVersion: 6
  m_Component:
  - component: {fileID: 4843973702231040}
  - component: {fileID: 114680750276417488}
  m_Layer: 0
  m_Name: PrefsTrack
  m_TagString: Untagged
  m_Icon: {fileID: 0}
  m_NavMeshLayer: 0
  m_StaticEditorFlags: 0
  m_IsActive: 1
--- !u!4 &4843973702231040
Transform:
  m_ObjectHideFlags: 0
  m_CorrespondingSourceObject: {fileID: 0}
  m_PrefabInstance: {fileID: 0}
  m_PrefabAsset: {fileID: 0}
  m_GameObject: {fileID: 1189634168653162}
  m_LocalRotation: {x: 0, y: 0, z: 0, w: 1}
  m_LocalPosition: {x: -57.593544, y: 13.05909, z: 122.4}
  m_LocalScale: {x: 1, y: 1, z: 1}
  m_Children: []
  m_Father: {fileID: 0}
  m_RootOrder: 0
  m_LocalEulerAnglesHint: {x: 0, y: 0, z: 0}
--- !u!114 &114680750276417488
MonoBehaviour:
  m_ObjectHideFlags: 0
  m_CorrespondingSourceObject: {fileID: 0}
  m_PrefabInstance: {fileID: 0}
  m_PrefabAsset: {fileID: 0}
  m_GameObject: {fileID: 1189634168653162}
  m_Enabled: 1
  m_EditorHideFlags: 0
  m_Script: {fileID: 11500000, guid: fe31a538a6b70a745b11d52d2120f2fe, type: 3}
  m_Name: 
  m_EditorClassIdentifier: 
  isPersistant: 0
  Creloj: Creloj
  tn1: tn1
  estrellasGanadasN1: estrellasGanadasN1
  tn2: tn2
  estrellasGanadasN2: estrellasGanadasN2
  tn3: tn3
  estrellasGanadasN3: estrellasGanadasN3
  tn4: tn4
  estrellasGanadasN4: estrellasGanadasN4
  tn5: tn5
  estrellasGanadasN5: estrellasGanadasN5
  level: level
  Tutorial: Tutorial
  v_Creloj: 0
  TirosLibresNivel1: 0
  EarnedStars1: 0
  TirosLibresNivel2: 0
  EarnedStars2: 0
  TirosLibresNivel3: 0
  EarnedStars3: 0
  TirosLibresNivel4: 0
  EarnedStars4: 0
  TirosLibresNivel5: 0
  EarnedStars5: 0
  levelValue: 0
  tutorialFlag: 0
