{
  "project_info": {
    "project_number": "659710273974",
    "firebase_url": "https://chromescore-6c6db-default-rtdb.firebaseio.com",
    "project_id": "chromescore-6c6db",
    "storage_bucket": "chromescore-6c6db.appspot.com"
  },
  "client": [
    {
      "client_info": {
        "mobilesdk_app_id": "1:659710273974:android:cc90fdd87e53b46c82b917",
        "android_client_info": {
          "package_name": "com.ChromeScore.ShowMas"
        }
      },
      "oauth_client": [
        {
          "client_id": "659710273974-cq739eb770rv2drml7iefrlg25292hvl.apps.googleusercontent.com",
          "client_type": 3
        }
      ],
      "api_key": [
        {
          "current_key": "AIzaSyArhs1bGFbbaomRe2VXT40LFwpwPBEiwPw"
        }
      ],
      "services": {
        "appinvite_service": {
          "other_platform_oauth_client": [
            {
              "client_id": "659710273974-cq739eb770rv2drml7iefrlg25292hvl.apps.googleusercontent.com",
              "client_type": 3
            }
          ]
        }
      }
    }
  ],
  "configuration_version": "1"
}