C:\Users\nicky\Documents\sfeir\interview\algo\src\main\java\sfeir\algo\CmdsParser.java
C:\Users\nicky\Documents\sfeir\interview\algo\src\main\java\sfeir\algo\Commands.java
C:\Users\nicky\Documents\sfeir\interview\algo\src\main\java\sfeir\algo\Tail.java
C:\Users\nicky\Documents\sfeir\interview\algo\src\main\java\sfeir\algo\App.java
