{
  "unpublishedPage": {
    "name": "User Information",
    "slug": "user-information",
    "layouts": [
      {
        "viewMode": false,
        "dsl": {
          "widgetName": "MainContainer",
          "backgroundColor": "none",
          "rightColumn": 4896,
          "snapColumns": 64,
          "detachFromLayout": true,
          "widgetId": "0",
          "topRow": 0,
          "bottomRow": 410,
          "containerStyle": "none",
          "snapRows": 124,
          "parentRowSpace": 1,
          "type": "CANVAS_WIDGET",
          "canExtend": true,
          "version": 80,
          "minHeight": 1292,
          "dynamicTriggerPathList": [],
          "parentColumnSpace": 1,
          "dynamicBindingPathList": [],
          "leftColumn": 0,
          "children": [
            {
              "boxShadow": "{{appsmith.theme.boxShadow.appBoxShadow}}",
              "borderColor": "#E0DEDE",
              "isVisibleDownload": true,
              "iconSVG": "/static/media/icon.24905525921dd6f5ff46d0dd843b9e12.svg",
              "topRow": 0,
              "isSortable": true,
              "type": "TABLE_WIDGET_V2",
              "inlineEditingSaveOption": "ROW_LEVEL",
              "animateLoading": true,
              "dynamicBindingPathList": [
                {
                  "key": "accentColor"
                },
                {
                  "key": "borderRadius"
                },
                {
                  "key": "boxShadow"
                },
                {
                  "key": "tableData"
                },
                {
                  "key": "primaryColumns.id.computedValue"
                },
                {
                  "key": "primaryColumns.gender.computedValue"
                },
                {
                  "key": "primaryColumns.latitude.computedValue"
                },
                {
                  "key": "primaryColumns.longitude.computedValue"
                },
                {
                  "key": "primaryColumns.dob.computedValue"
                },
                {
                  "key": "primaryColumns.phone.computedValue"
                },
                {
                  "key": "primaryColumns.email.computedValue"
                },
                {
                  "key": "primaryColumns.image.computedValue"
                },
                {
                  "key": "primaryColumns.country.computedValue"
                },
                {
                  "key": "primaryColumns.name.computedValue"
                }
              ],
              "needsHeightForContent": true,
              "leftColumn": 0,
              "delimiter": ",",
              "defaultSelectedRowIndex": 0,
              "accentColor": "{{appsmith.theme.colors.primaryColor}}",
              "isVisibleFilters": true,
              "isVisible": true,
              "enableClientSideSearch": true,
              "version": 2,
              "totalRecordsCount": 0,
              "isLoading": false,
              "childStylesheet": {
                "button": {
                  "buttonColor": "{{appsmith.theme.colors.primaryColor}}",
                  "borderRadius": "{{appsmith.theme.borderRadius.appBorderRadius}}",
                  "boxShadow": "none"
                },
                "menuButton": {
                  "menuColor": "{{appsmith.theme.colors.primaryColor}}",
                  "borderRadius": "{{appsmith.theme.borderRadius.appBorderRadius}}",
                  "boxShadow": "none"
                },
                "iconButton": {
                  "buttonColor": "{{appsmith.theme.colors.primaryColor}}",
                  "borderRadius": "{{appsmith.theme.borderRadius.appBorderRadius}}",
                  "boxShadow": "none"
                },
                "editActions": {
                  "saveButtonColor": "{{appsmith.theme.colors.primaryColor}}",
                  "saveBorderRadius": "{{appsmith.theme.borderRadius.appBorderRadius}}",
                  "discardButtonColor": "{{appsmith.theme.colors.primaryColor}}",
                  "discardBorderRadius": "{{appsmith.theme.borderRadius.appBorderRadius}}"
                }
              },
              "borderRadius": "{{appsmith.theme.borderRadius.appBorderRadius}}",
              "columnUpdatedAt": 1686625982250,
              "defaultSelectedRowIndices": [
                0
              ],
              "mobileBottomRow": 42,
              "widgetName": "usersTable",
              "defaultPageSize": 0,
              "columnOrder": [
                "id",
                "gender",
                "latitude",
                "longitude",
                "dob",
                "phone",
                "email",
                "image",
                "country",
                "name"
              ],
              "dynamicPropertyPathList": [
                {
                  "key": "tableData"
                }
              ],
              "displayName": "Table",
              "bottomRow": 41,
              "columnWidthMap": {},
              "parentRowSpace": 10,
              "hideCard": false,
              "mobileRightColumn": 35,
              "parentColumnSpace": 20.078125,
              "dynamicTriggerPathList": [],
              "borderWidth": "1",
              "primaryColumns": {
                "id": {
                  "allowCellWrapping": false,
                  "allowSameOptionsInNewRow": true,
                  "index": 0,
                  "width": 150,
                  "originalId": "id",
                  "id": "id",
                  "alias": "id",
                  "horizontalAlignment": "LEFT",
                  "verticalAlignment": "CENTER",
                  "columnType": "number",
                  "textSize": "0.875rem",
                  "enableFilter": true,
                  "enableSort": true,
                  "isVisible": true,
                  "isDisabled": false,
                  "isCellEditable": false,
                  "isEditable": false,
                  "isCellVisible": true,
                  "isDerived": false,
                  "label": "id",
                  "isSaveVisible": true,
                  "isDiscardVisible": true,
                  "computedValue": "{{usersTable.processedTableData.map((currentRow, currentIndex) => ( currentRow[\"id\"]))}}",
                  "sticky": "",
                  "validation": {}
                },
                "gender": {
                  "allowCellWrapping": false,
                  "allowSameOptionsInNewRow": true,
                  "index": 1,
                  "width": 150,
                  "originalId": "gender",
                  "id": "gender",
                  "alias": "gender",
                  "horizontalAlignment": "LEFT",
                  "verticalAlignment": "CENTER",
                  "columnType": "text",
                  "textSize": "0.875rem",
                  "enableFilter": true,
                  "enableSort": true,
                  "isVisible": true,
                  "isDisabled": false,
                  "isCellEditable": false,
                  "isEditable": false,
                  "isCellVisible": true,
                  "isDerived": false,
                  "label": "gender",
                  "isSaveVisible": true,
                  "isDiscardVisible": true,
                  "computedValue": "{{usersTable.processedTableData.map((currentRow, currentIndex) => ( currentRow[\"gender\"]))}}",
                  "sticky": "",
                  "validation": {}
                },
                "latitude": {
                  "allowCellWrapping": false,
                  "allowSameOptionsInNewRow": true,
                  "index": 2,
                  "width": 150,
                  "originalId": "latitude",
                  "id": "latitude",
                  "alias": "latitude",
                  "horizontalAlignment": "LEFT",
                  "verticalAlignment": "CENTER",
                  "columnType": "text",
                  "textSize": "0.875rem",
                  "enableFilter": true,
                  "enableSort": true,
                  "isVisible": true,
                  "isDisabled": false,
                  "isCellEditable": false,
                  "isEditable": false,
                  "isCellVisible": true,
                  "isDerived": false,
                  "label": "latitude",
                  "isSaveVisible": true,
                  "isDiscardVisible": true,
                  "computedValue": "{{usersTable.processedTableData.map((currentRow, currentIndex) => ( currentRow[\"latitude\"]))}}",
                  "sticky": "",
                  "validation": {}
                },
                "longitude": {
                  "allowCellWrapping": false,
                  "allowSameOptionsInNewRow": true,
                  "index": 3,
                  "width": 150,
                  "originalId": "longitude",
                  "id": "longitude",
                  "alias": "longitude",
                  "horizontalAlignment": "LEFT",
                  "verticalAlignment": "CENTER",
                  "columnType": "text",
                  "textSize": "0.875rem",
                  "enableFilter": true,
                  "enableSort": true,
                  "isVisible": true,
                  "isDisabled": false,
                  "isCellEditable": false,
                  "isEditable": false,
                  "isCellVisible": true,
                  "isDerived": false,
                  "label": "longitude",
                  "isSaveVisible": true,
                  "isDiscardVisible": true,
                  "computedValue": "{{usersTable.processedTableData.map((currentRow, currentIndex) => ( currentRow[\"longitude\"]))}}",
                  "sticky": "",
                  "validation": {}
                },
                "dob": {
                  "allowCellWrapping": false,
                  "allowSameOptionsInNewRow": true,
                  "index": 4,
                  "width": 150,
                  "originalId": "dob",
                  "id": "dob",
                  "alias": "dob",
                  "horizontalAlignment": "LEFT",
                  "verticalAlignment": "CENTER",
                  "columnType": "date",
                  "textSize": "0.875rem",
                  "enableFilter": true,
                  "enableSort": true,
                  "isVisible": true,
                  "isDisabled": false,
                  "isCellEditable": false,
                  "isEditable": false,
                  "isCellVisible": true,
                  "isDerived": false,
                  "label": "dob",
                  "isSaveVisible": true,
                  "isDiscardVisible": true,
                  "computedValue": "{{usersTable.processedTableData.map((currentRow, currentIndex) => ( currentRow[\"dob\"]))}}",
                  "sticky": "",
                  "validation": {}
                },
                "phone": {
                  "allowCellWrapping": false,
                  "allowSameOptionsInNewRow": true,
                  "index": 5,
                  "width": 150,
                  "originalId": "phone",
                  "id": "phone",
                  "alias": "phone",
                  "horizontalAlignment": "LEFT",
                  "verticalAlignment": "CENTER",
                  "columnType": "text",
                  "textSize": "0.875rem",
                  "enableFilter": true,
                  "enableSort": true,
                  "isVisible": true,
                  "isDisabled": false,
                  "isCellEditable": false,
                  "isEditable": false,
                  "isCellVisible": true,
                  "isDerived": false,
                  "label": "phone",
                  "isSaveVisible": true,
                  "isDiscardVisible": true,
                  "computedValue": "{{usersTable.processedTableData.map((currentRow, currentIndex) => ( currentRow[\"phone\"]))}}",
                  "sticky": "",
                  "validation": {}
                },
                "email": {
                  "allowCellWrapping": false,
                  "allowSameOptionsInNewRow": true,
                  "index": 6,
                  "width": 150,
                  "originalId": "email",
                  "id": "email",
                  "alias": "email",
                  "horizontalAlignment": "LEFT",
                  "verticalAlignment": "CENTER",
                  "columnType": "text",
                  "textSize": "0.875rem",
                  "enableFilter": true,
                  "enableSort": true,
                  "isVisible": true,
                  "isDisabled": false,
                  "isCellEditable": false,
                  "isEditable": false,
                  "isCellVisible": true,
                  "isDerived": false,
                  "label": "email",
                  "isSaveVisible": true,
                  "isDiscardVisible": true,
                  "computedValue": "{{usersTable.processedTableData.map((currentRow, currentIndex) => ( currentRow[\"email\"]))}}",
                  "sticky": "",
                  "validation": {}
                },
                "image": {
                  "allowCellWrapping": false,
                  "allowSameOptionsInNewRow": true,
                  "index": 7,
                  "width": 150,
                  "originalId": "image",
                  "id": "image",
                  "alias": "image",
                  "horizontalAlignment": "LEFT",
                  "verticalAlignment": "CENTER",
                  "columnType": "text",
                  "textSize": "0.875rem",
                  "enableFilter": true,
                  "enableSort": true,
                  "isVisible": true,
                  "isDisabled": false,
                  "isCellEditable": false,
                  "isEditable": false,
                  "isCellVisible": true,
                  "isDerived": false,
                  "label": "image",
                  "isSaveVisible": true,
                  "isDiscardVisible": true,
                  "computedValue": "{{usersTable.processedTableData.map((currentRow, currentIndex) => ( currentRow[\"image\"]))}}",
                  "sticky": "",
                  "validation": {}
                },
                "country": {
                  "allowCellWrapping": false,
                  "allowSameOptionsInNewRow": true,
                  "index": 8,
                  "width": 150,
                  "originalId": "country",
                  "id": "country",
                  "alias": "country",
                  "horizontalAlignment": "LEFT",
                  "verticalAlignment": "CENTER",
                  "columnType": "text",
                  "textSize": "0.875rem",
                  "enableFilter": true,
                  "enableSort": true,
                  "isVisible": true,
                  "isDisabled": false,
                  "isCellEditable": false,
                  "isEditable": false,
                  "isCellVisible": true,
                  "isDerived": false,
                  "label": "country",
                  "isSaveVisible": true,
                  "isDiscardVisible": true,
                  "computedValue": "{{usersTable.processedTableData.map((currentRow, currentIndex) => ( currentRow[\"country\"]))}}",
                  "sticky": "",
                  "validation": {}
                },
                "name": {
                  "allowCellWrapping": false,
                  "allowSameOptionsInNewRow": true,
                  "index": 9,
                  "width": 150,
                  "originalId": "name",
                  "id": "name",
                  "alias": "name",
                  "horizontalAlignment": "LEFT",
                  "verticalAlignment": "CENTER",
                  "columnType": "text",
                  "textSize": "0.875rem",
                  "enableFilter": true,
                  "enableSort": true,
                  "isVisible": true,
                  "isDisabled": false,
                  "isCellEditable": false,
                  "isEditable": false,
                  "isCellVisible": true,
                  "isDerived": false,
                  "label": "name",
                  "isSaveVisible": true,
                  "isDiscardVisible": true,
                  "computedValue": "{{usersTable.processedTableData.map((currentRow, currentIndex) => ( currentRow[\"name\"]))}}",
                  "sticky": "",
                  "validation": {}
                }
              },
              "key": "mgilwkh0gw",
              "canFreezeColumn": true,
              "isDeprecated": false,
              "rightColumn": 40,
              "textSize": "0.875rem",
              "widgetId": "r794fybs0x",
              "minWidth": 450,
              "tableData": "{{getUsers.data}}",
              "label": "Data",
              "searchKey": "",
              "parentId": "0",
              "renderMode": "CANVAS",
              "mobileTopRow": 14,
              "horizontalAlignment": "LEFT",
              "isVisibleSearch": true,
              "responsiveBehavior": "fill",
              "mobileLeftColumn": 1,
              "isVisiblePagination": true,
              "verticalAlignment": "CENTER"
            },
            {
              "boxShadow": "{{appsmith.theme.boxShadow.appBoxShadow}}",
              "mobileBottomRow": 84,
              "borderColor": "#E0DEDE",
              "widgetName": "Form1",
              "isCanvas": true,
              "displayName": "Form",
              "iconSVG": "/static/media/icon.5d6d2ac5cb1aa68bcd9b14f11c56b44a.svg",
              "searchTags": [
                "group"
              ],
              "topRow": 0,
              "bottomRow": 41,
              "parentRowSpace": 10,
              "type": "FORM_WIDGET",
              "hideCard": false,
              "shouldScrollContents": true,
              "mobileRightColumn": 15,
              "animateLoading": true,
              "parentColumnSpace": 20.078125,
              "dynamicTriggerPathList": [],
              "leftColumn": 40,
              "dynamicBindingPathList": [
                {
                  "key": "borderRadius"
                },
                {
                  "key": "boxShadow"
                }
              ],
              "children": [
                {
                  "mobileBottomRow": 400,
                  "widgetName": "Canvas1",
                  "displayName": "Canvas",
                  "topRow": 0,
                  "bottomRow": 410,
                  "parentRowSpace": 1,
                  "type": "CANVAS_WIDGET",
                  "canExtend": false,
                  "hideCard": true,
                  "minHeight": 400,
                  "mobileRightColumn": 301.171875,
                  "parentColumnSpace": 1,
                  "leftColumn": 0,
                  "dynamicBindingPathList": [],
                  "children": [
                    {
                      "mobileBottomRow": 5,
                      "widgetName": "User_Details",
                      "displayName": "Text",
                      "iconSVG": "/static/media/icon.c3b6033f570046f8c6288d911333a827.svg",
                      "searchTags": [
                        "typography",
                        "paragraph",
                        "label"
                      ],
                      "topRow": 1,
                      "bottomRow": 5,
                      "type": "TEXT_WIDGET",
                      "hideCard": false,
                      "mobileRightColumn": 25.5,
                      "animateLoading": true,
                      "overflow": "NONE",
                      "fontFamily": "{{appsmith.theme.fontFamily.appFont}}",
                      "dynamicTriggerPathList": [],
                      "leftColumn": 2,
                      "dynamicBindingPathList": [
                        {
                          "key": "truncateButtonColor"
                        },
                        {
                          "key": "fontFamily"
                        },
                        {
                          "key": "borderRadius"
                        }
                      ],
                      "shouldTruncate": false,
                      "truncateButtonColor": "{{appsmith.theme.colors.primaryColor}}",
                      "text": "User Details",
                      "key": "3vv3iv68t3",
                      "isDeprecated": false,
                      "rightColumn": 51,
                      "textAlign": "LEFT",
                      "dynamicHeight": "AUTO_HEIGHT",
                      "widgetId": "diwghm803l",
                      "minWidth": 450,
                      "isVisible": true,
                      "fontStyle": "BOLD",
                      "textColor": "#231F20",
                      "version": 1,
                      "parentId": "o24hcxn6pj",
                      "renderMode": "CANVAS",
                      "isLoading": false,
                      "mobileTopRow": 1,
                      "responsiveBehavior": "fill",
                      "originalTopRow": 1,
                      "borderRadius": "{{appsmith.theme.borderRadius.appBorderRadius}}",
                      "mobileLeftColumn": 1.5,
                      "maxDynamicHeight": 9000,
                      "originalBottomRow": 7,
                      "fontSize": "1.25rem",
                      "minDynamicHeight": 4
                    },
                    {
                      "resetFormOnClick": true,
                      "boxShadow": "none",
                      "mobileBottomRow": 37,
                      "widgetName": "Button1",
                      "onClick": "{{updateUsers.run().then(() => {\n  getUsers.run();\n});}}",
                      "buttonColor": "{{appsmith.theme.colors.primaryColor}}",
                      "displayName": "Button",
                      "iconSVG": "/static/media/icon.7beb9123fb53027d9d6b778cdfe4caed.svg",
                      "searchTags": [
                        "click",
                        "submit"
                      ],
                      "topRow": 34,
                      "bottomRow": 38,
                      "type": "BUTTON_WIDGET",
                      "hideCard": false,
                      "mobileRightColumn": 62,
                      "animateLoading": true,
                      "dynamicTriggerPathList": [
                        {
                          "key": "onClick"
                        }
                      ],
                      "leftColumn": 46,
                      "dynamicBindingPathList": [
                        {
                          "key": "buttonColor"
                        },
                        {
                          "key": "borderRadius"
                        }
                      ],
                      "text": "Update",
                      "isDisabled": false,
                      "key": "yeo4o6xg9i",
                      "isDeprecated": false,
                      "rightColumn": 62,
                      "isDefaultClickDisabled": true,
                      "widgetId": "45bg5qhq38",
                      "minWidth": 120,
                      "isVisible": true,
                      "recaptchaType": "V3",
                      "version": 1,
                      "parentId": "o24hcxn6pj",
                      "renderMode": "CANVAS",
                      "isLoading": false,
                      "mobileTopRow": 33,
                      "responsiveBehavior": "hug",
                      "originalTopRow": 33,
                      "disabledWhenInvalid": true,
                      "borderRadius": "{{appsmith.theme.borderRadius.appBorderRadius}}",
                      "mobileLeftColumn": 46,
                      "originalBottomRow": 37,
                      "buttonVariant": "PRIMARY",
                      "placement": "CENTER"
                    },
                    {
                      "resetFormOnClick": true,
                      "boxShadow": "none",
                      "mobileBottomRow": 37,
                      "widgetName": "Button2",
                      "buttonColor": "{{appsmith.theme.colors.primaryColor}}",
                      "displayName": "Button",
                      "iconSVG": "/static/media/icon.7beb9123fb53027d9d6b778cdfe4caed.svg",
                      "searchTags": [
                        "click",
                        "submit"
                      ],
                      "topRow": 34,
                      "bottomRow": 38,
                      "type": "BUTTON_WIDGET",
                      "hideCard": false,
                      "mobileRightColumn": 46,
                      "animateLoading": true,
                      "leftColumn": 30,
                      "dynamicBindingPathList": [
                        {
                          "key": "buttonColor"
                        },
                        {
                          "key": "borderRadius"
                        }
                      ],
                      "text": "Reset",
                      "isDisabled": false,
                      "key": "yeo4o6xg9i",
                      "isDeprecated": false,
                      "rightColumn": 46,
                      "isDefaultClickDisabled": true,
                      "widgetId": "kcrrmjwvnn",
                      "minWidth": 120,
                      "isVisible": true,
                      "recaptchaType": "V3",
                      "version": 1,
                      "parentId": "o24hcxn6pj",
                      "renderMode": "CANVAS",
                      "isLoading": false,
                      "mobileTopRow": 33,
                      "responsiveBehavior": "hug",
                      "originalTopRow": 33,
                      "disabledWhenInvalid": false,
                      "borderRadius": "{{appsmith.theme.borderRadius.appBorderRadius}}",
                      "mobileLeftColumn": 30,
                      "originalBottomRow": 37,
                      "buttonVariant": "SECONDARY",
                      "placement": "CENTER"
                    },
                    {
                      "boxShadow": "none",
                      "iconSVG": "/static/media/icon.d0ce957b6c4640f8a7418ce846ee200e.svg",
                      "topRow": 6,
                      "labelWidth": 5,
                      "type": "INPUT_WIDGET_V2",
                      "animateLoading": true,
                      "resetOnSubmit": true,
                      "leftColumn": 31,
                      "dynamicBindingPathList": [
                        {
                          "key": "accentColor"
                        },
                        {
                          "key": "borderRadius"
                        },
                        {
                          "key": "defaultText"
                        }
                      ],
                      "labelStyle": "",
                      "inputType": "TEXT",
                      "isDisabled": false,
                      "isRequired": false,
                      "dynamicHeight": "FIXED",
                      "accentColor": "{{appsmith.theme.colors.primaryColor}}",
                      "showStepArrows": false,
                      "isVisible": true,
                      "version": 2,
                      "isLoading": false,
                      "borderRadius": "{{appsmith.theme.borderRadius.appBorderRadius}}",
                      "originalBottomRow": 16,
                      "mobileBottomRow": 14,
                      "widgetName": "nameInput",
                      "displayName": "Input",
                      "searchTags": [
                        "form",
                        "text input",
                        "number",
                        "textarea"
                      ],
                      "bottomRow": 13,
                      "parentRowSpace": 10,
                      "autoFocus": false,
                      "hideCard": false,
                      "mobileRightColumn": 21,
                      "parentColumnSpace": 4.393310546875,
                      "dynamicTriggerPathList": [],
                      "labelPosition": "Top",
                      "key": "tgyfzu6n1l",
                      "labelTextSize": "0.875rem",
                      "isDeprecated": false,
                      "rightColumn": 62,
                      "widgetId": "sdr846b7jt",
                      "minWidth": 450,
                      "label": "Name",
                      "parentId": "o24hcxn6pj",
                      "labelAlignment": "left",
                      "renderMode": "CANVAS",
                      "mobileTopRow": 7,
                      "responsiveBehavior": "fill",
                      "originalTopRow": 9,
                      "mobileLeftColumn": 1,
                      "maxDynamicHeight": 9000,
                      "iconAlign": "left",
                      "defaultText": "{{usersTable.selectedRow.name}}",
                      "minDynamicHeight": 4
                    },
                    {
                      "boxShadow": "none",
                      "iconSVG": "/static/media/icon.d0ce957b6c4640f8a7418ce846ee200e.svg",
                      "topRow": 14,
                      "labelWidth": 5,
                      "type": "INPUT_WIDGET_V2",
                      "animateLoading": true,
                      "resetOnSubmit": true,
                      "leftColumn": 31,
                      "dynamicBindingPathList": [
                        {
                          "key": "accentColor"
                        },
                        {
                          "key": "borderRadius"
                        },
                        {
                          "key": "defaultText"
                        }
                      ],
                      "labelStyle": "",
                      "inputType": "TEXT",
                      "isDisabled": false,
                      "isRequired": false,
                      "dynamicHeight": "FIXED",
                      "accentColor": "{{appsmith.theme.colors.primaryColor}}",
                      "showStepArrows": false,
                      "isVisible": true,
                      "version": 2,
                      "isLoading": false,
                      "borderRadius": "{{appsmith.theme.borderRadius.appBorderRadius}}",
                      "mobileBottomRow": 23,
                      "widgetName": "emailInput",
                      "displayName": "Input",
                      "searchTags": [
                        "form",
                        "text input",
                        "number",
                        "textarea"
                      ],
                      "bottomRow": 21,
                      "parentRowSpace": 10,
                      "autoFocus": false,
                      "hideCard": false,
                      "mobileRightColumn": 21,
                      "parentColumnSpace": 6.275634765625,
                      "dynamicTriggerPathList": [],
                      "labelPosition": "Top",
                      "key": "tgyfzu6n1l",
                      "labelTextSize": "0.875rem",
                      "isDeprecated": false,
                      "rightColumn": 62,
                      "widgetId": "jphv956ciz",
                      "minWidth": 450,
                      "label": "Email",
                      "parentId": "o24hcxn6pj",
                      "labelAlignment": "left",
                      "renderMode": "CANVAS",
                      "mobileTopRow": 16,
                      "responsiveBehavior": "fill",
                      "mobileLeftColumn": 1,
                      "maxDynamicHeight": 9000,
                      "iconAlign": "left",
                      "defaultText": "{{usersTable.selectedRow.email}}",
                      "minDynamicHeight": 4
                    },
                    {
                      "boxShadow": "none",
                      "dateFormat": "YYYY-MM-DD",
                      "iconSVG": "/static/media/icon.c8ac755fdc7a44c32deab2390f007005.svg",
                      "topRow": 23,
                      "labelWidth": 5,
                      "type": "DATE_PICKER_WIDGET2",
                      "animateLoading": true,
                      "leftColumn": 31,
                      "dynamicBindingPathList": [
                        {
                          "key": "accentColor"
                        },
                        {
                          "key": "defaultDate"
                        }
                      ],
                      "labelTooltip": "",
                      "labelStyle": "",
                      "isDisabled": false,
                      "isRequired": false,
                      "dynamicHeight": "FIXED",
                      "accentColor": "{{appsmith.theme.colors.primaryColor}}",
                      "isVisible": true,
                      "datePickerType": "DATE_PICKER",
                      "version": 2,
                      "isLoading": false,
                      "timePrecision": "minute",
                      "borderRadius": "0.375rem",
                      "closeOnSelection": true,
                      "mobileBottomRow": 30,
                      "widgetName": "dobInput",
                      "minDate": "1920-12-31T18:30:00.000Z",
                      "dynamicPropertyPathList": [
                        {
                          "key": "defaultDate"
                        }
                      ],
                      "displayName": "DatePicker",
                      "searchTags": [
                        "calendar"
                      ],
                      "bottomRow": 30,
                      "shortcuts": false,
                      "parentRowSpace": 10,
                      "hideCard": false,
                      "mobileRightColumn": 51,
                      "parentColumnSpace": 6.275634765625,
                      "dynamicTriggerPathList": [],
                      "labelPosition": "Top",
                      "key": "pzc6kbmb4u",
                      "labelTextSize": "0.875rem",
                      "defaultDate": "{{usersTable.selectedRow.dob}}",
                      "isDeprecated": false,
                      "rightColumn": 62,
                      "widgetId": "cy6nkizole",
                      "minWidth": 450,
                      "label": "DOB",
                      "parentId": "o24hcxn6pj",
                      "labelAlignment": "left",
                      "renderMode": "CANVAS",
                      "mobileTopRow": 23,
                      "responsiveBehavior": "fill",
                      "mobileLeftColumn": 31,
                      "maxDynamicHeight": 9000,
                      "firstDayOfWeek": 0,
                      "maxDate": "2121-12-31T18:29:00.000Z",
                      "minDynamicHeight": 4
                    },
                    {
                      "boxShadow": "none",
                      "mobileBottomRow": 20,
                      "widgetName": "Image1",
                      "displayName": "Image",
                      "iconSVG": "/static/media/icon.30c8cbd442cce232b01ba2d434c53a53.svg",
                      "topRow": 7,
                      "bottomRow": 23,
                      "parentRowSpace": 10,
                      "type": "IMAGE_WIDGET",
                      "hideCard": false,
                      "mobileRightColumn": 15,
                      "animateLoading": true,
                      "parentColumnSpace": 6.275634765625,
                      "dynamicTriggerPathList": [],
                      "imageShape": "RECTANGLE",
                      "leftColumn": 1,
                      "dynamicBindingPathList": [
                        {
                          "key": "borderRadius"
                        },
                        {
                          "key": "defaultImage"
                        }
                      ],
                      "defaultImage": "{{usersTable.selectedRow.image}}",
                      "key": "zrb0xm8g66",
                      "image": "",
                      "isDeprecated": false,
                      "rightColumn": 26,
                      "objectFit": "auto",
                      "widgetId": "wlpg41rhi9",
                      "isVisible": true,
                      "version": 1,
                      "parentId": "o24hcxn6pj",
                      "renderMode": "CANVAS",
                      "isLoading": false,
                      "mobileTopRow": 8,
                      "maxZoomLevel": 1,
                      "enableDownload": true,
                      "borderRadius": "{{appsmith.theme.borderRadius.appBorderRadius}}",
                      "mobileLeftColumn": 3,
                      "enableRotation": false
                    }
                  ],
                  "key": "vuyd30gmgn",
                  "isDeprecated": false,
                  "rightColumn": 301.171875,
                  "detachFromLayout": true,
                  "widgetId": "o24hcxn6pj",
                  "containerStyle": "none",
                  "minWidth": 450,
                  "isVisible": true,
                  "version": 1,
                  "parentId": "k12hmxb56j",
                  "renderMode": "CANVAS",
                  "isLoading": false,
                  "mobileTopRow": 0,
                  "responsiveBehavior": "fill",
                  "mobileLeftColumn": 0,
                  "flexLayers": []
                }
              ],
              "borderWidth": "1",
              "positioning": "fixed",
              "key": "u91o49eg3n",
              "backgroundColor": "#FFFFFF",
              "isDeprecated": false,
              "rightColumn": 64,
              "dynamicHeight": "FIXED",
              "widgetId": "k12hmxb56j",
              "minWidth": 450,
              "isVisible": true,
              "parentId": "0",
              "renderMode": "CANVAS",
              "isLoading": false,
              "mobileTopRow": 44,
              "responsiveBehavior": "fill",
              "borderRadius": "{{appsmith.theme.borderRadius.appBorderRadius}}",
              "mobileLeftColumn": 0,
              "maxDynamicHeight": 41,
              "minDynamicHeight": 10
            }
          ]
        },
        "layoutOnLoadActions": [
          [
            {
              "id": "User Information_getUsers",
              "name": "getUsers",
              "confirmBeforeExecute": false,
              "pluginType": "DB",
              "jsonPathKeys": [],
              "timeoutInMillisecond": 10000
            }
          ]
        ],
        "layoutOnLoadActionErrors": [],
        "validOnPageLoadActions": true,
        "id": "User Information",
        "deleted": false,
        "policies": [],
        "userPermissions": []
      }
    ],
    "userPermissions": [],
    "policies": [],
    "isHidden": false
  },
  "deleted": false,
  "gitSyncId": "6487dc0f839a275bd476b3e9_6487dc0f839a275bd476b3eb"
}