{
  "openapi": "3.0.3",
  "info": {
    "title": "Swagger Call LLM - OpenAPI 3.0",
    "description": "Swagger is a set of open-source tools used to document APIs. The Swagger tools leverage the OpenAPI Specification (formerly known as the Swagger Specification) to describe the structure and functionality of RESTful APIs in a standard, machine-readable format. This allows Swagger to automate much of the API documentation process, making it easier to generate, visualize, and maintain up-to-date documentation as the API evolves. <br /> <br /> For our goal, the documentation is not used to describe our service. On the contrary, starting from it, we need to impose the standard of your endpoint in order to make it responsive to the __GenAI Testing Suite__. Hence, imagine this documentation belongs to your service, and try to adapt your API Call to this standard. <br /> <br /> __N.B.__ If your endpoint is deployed in local or in VPN, the evaluation will not start as it will result unreachable. Hence, only if you are in dev environment, make sure your endpoint is exposed without any domain restriction. Alternatively, if you are allowed, evaluate to use a localhost tunnel for sharing.",
    "termsOfService": "http://swagger.io/terms/",
    "contact": {
      "email": "apiteam@swagger.io"
    },
    "license": {
      "name": "Apache 2.0",
      "url": "http://www.apache.org/licenses/LICENSE-2.0.html"
    },
    "version": "1.0.11"
  },
  "externalDocs": {
    "description": "Find out more about Swagger",
    "url": "http://swagger.io"
  },
  "tags": [
    {
      "name": "get_answer",
      "description": "This is the single route we need to retrieve the responses of your RAG solution."
    }
  ],
  "paths": {
    "/get_answer": {
      "post": {
        "tags": [
          "get_answer"
        ],
        "summary": "The name route is a placeholder, but remember to include it in the endpoint box of the form.",
        "description": "The GenAi Testing Suite in order to evaluate your endpoint will ask some questions, hence, we need to receive a response for each testing questions needed for the evaluation.",
        "operationId": "Ask question",
        "requestBody": {
          "description": "The schema of the payload contains only one single key.",
          "content": {
            "application/json": {
              "schema": {
                "$ref": "#/components/schemas/GetAnswer"
              }
            }
          },
          "required": true
        },
        "responses": {
          "200": {
            "description": "Successful operation. If you service receive correctly the payload, then we except to receive your reponse in  this format. If one of title, section or context is not expected to be returned by your endpoint, substitute it with \"None\" value.",
            "content": {
              "application/json": {
                "schema": {
                  "$ref": "#/components/schemas/Response"
                }
              }
            }
          },
          "400": {
            "description": "Invalid Request"
          },
          "404": {
            "description": "Page not found"
          },
          "422": {
            "description": "Validation exception"
          }
        }
      }
    }
  },
  "components": {
    "schemas": {
      "GetAnswer": {
        "type": "object",
        "properties": {
          "question": {
            "type": "string",
            "example": "tell me a joke"
          }
        }
      },
      "Response": {
        "type": "object",
        "properties": {
          "success": {
            "type": "boolean",
            "example": true
          },
          "response": {
            "type": "object",
            "properties": {
              "question": {
                "type": "string",
                "example": "Tell me a joke"
              },
              "answer": {
                "type": "string",
                "example": "Why did the tomato turn red? Because it saw the salad dressing!"
              },
              "title": {
                "type": "array",
                "items": {
                  "type": "string"
                },
                "example": [
                  "document-title1.pdf",
                  "document-title2.pdf"
                ]
              },
              "section": {
                "type": "array",
                "items": {
                  "type": "string"
                },
                "example": [
                  "document-paragraph1",
                  "document-paragraph1"
                ]
              },
              "context": {
                "type": "string",
                "example": "context extracted here"
              }
            }
          }
        }
      }
    }
  }
}