<?xml version="1.0" encoding="UTF-8" standalone="no"?>
<!-- Created with Inkscape (http://www.inkscape.org/) -->

<svg
   xmlns:dc="http://purl.org/dc/elements/1.1/"
   xmlns:cc="http://creativecommons.org/ns#"
   xmlns:rdf="http://www.w3.org/1999/02/22-rdf-syntax-ns#"
   xmlns:svg="http://www.w3.org/2000/svg"
   xmlns="http://www.w3.org/2000/svg"
   xmlns:sodipodi="http://sodipodi.sourceforge.net/DTD/sodipodi-0.dtd"
   xmlns:inkscape="http://www.inkscape.org/namespaces/inkscape"
   width="210mm"
   height="297mm"
   viewBox="0 0 210 297"
   version="1.1"
   id="svg823"
   inkscape:version="0.92.3 (2405546, 2018-03-11)"
   sodipodi:docname="add.svg"
   inkscape:export-filename="C:\Users\Nico\Documents\git\glk-angular\src\assets\icons\add_black.png"
   inkscape:export-xdpi="50"
   inkscape:export-ydpi="50">
  <defs
     id="defs817" />
  <sodipodi:namedview
     id="base"
     pagecolor="#ffffff"
     bordercolor="#666666"
     borderopacity="1.0"
     inkscape:pageopacity="0.0"
     inkscape:pageshadow="2"
     inkscape:zoom="0.7"
     inkscape:cx="24.758782"
     inkscape:cy="445.00291"
     inkscape:document-units="mm"
     inkscape:current-layer="layer1"
     showgrid="false"
     inkscape:window-width="1920"
     inkscape:window-height="1001"
     inkscape:window-x="-9"
     inkscape:window-y="-9"
     inkscape:window-maximized="1" />
  <metadata
     id="metadata820">
    <rdf:RDF>
      <cc:Work
         rdf:about="">
        <dc:format>image/svg+xml</dc:format>
        <dc:type
           rdf:resource="http://purl.org/dc/dcmitype/StillImage" />
        <dc:title></dc:title>
      </cc:Work>
    </rdf:RDF>
  </metadata>
  <g
     inkscape:label="Ebene 1"
     inkscape:groupmode="layer"
     id="layer1"
     style="opacity:0.96">
    <g
       id="g8458"
       transform="matrix(0.78279382,0,0,0.78279382,20.6169,33.429317)"
       inkscape:export-filename="C:\Users\Nico\Documents\git\glk-angular\src\assets\icons\add_black.png"
       inkscape:export-xdpi="30"
       inkscape:export-ydpi="30">
      <rect
         ry="13.957846"
         y="137.52132"
         x="9.1800413"
         height="27.915691"
         width="154.65018"
         id="rect815"
         style="opacity:1;fill:#000000;fill-opacity:1;stroke:none;stroke-width:5.01401472;stroke-linecap:round;stroke-linejoin:round;stroke-miterlimit:4;stroke-dasharray:none;stroke-opacity:1;paint-order:markers stroke fill" />
      <rect
         ry="13.957846"
         transform="rotate(89.732662)"
         style="opacity:1;fill:#000000;fill-opacity:1;stroke:none;stroke-width:5.01401472;stroke-linecap:round;stroke-linejoin:round;stroke-miterlimit:4;stroke-dasharray:none;stroke-opacity:1;paint-order:markers stroke fill"
         id="rect817"
         width="154.65018"
         height="27.915691"
         x="74.556053"
         y="-99.755241" />
    </g>
    <circle
       style="opacity:1;fill:none;fill-opacity:1;stroke:#000000;stroke-width:18.52083333;stroke-linecap:round;stroke-linejoin:round;stroke-miterlimit:4;stroke-dasharray:none;stroke-opacity:1;paint-order:markers stroke fill"
       id="path819"
       cx="88.332581"
       cy="152.00627"
       r="88.332573"
       inkscape:export-filename="C:\Users\Nico\Documents\git\glk-angular\src\assets\icons\add_black.png"
       inkscape:export-xdpi="30"
       inkscape:export-ydpi="30" />
  </g>
</svg>
