<?xml version="1.0" encoding="UTF-8" standalone="no"?>
<!-- Created with Inkscape (http://www.inkscape.org/) -->

<svg
   xmlns:dc="http://purl.org/dc/elements/1.1/"
   xmlns:cc="http://creativecommons.org/ns#"
   xmlns:rdf="http://www.w3.org/1999/02/22-rdf-syntax-ns#"
   xmlns:svg="http://www.w3.org/2000/svg"
   xmlns="http://www.w3.org/2000/svg"
   xmlns:sodipodi="http://sodipodi.sourceforge.net/DTD/sodipodi-0.dtd"
   xmlns:inkscape="http://www.inkscape.org/namespaces/inkscape"
   width="900"
   height="900"
   viewBox="0 0 238.12499 238.12501"
   version="1.1"
   id="svg8"
   sodipodi:docname="main-logo.svg"
   inkscape:version="0.92.3 (2405546, 2018-03-11)"
   inkscape:export-filename="C:\Users\Kaminzimmer\Documents\git\finance-pwa\fin-hog\src\assets\images\png\icon_logo.png"
   inkscape:export-xdpi="50"
   inkscape:export-ydpi="50">
  <defs
     id="defs2" />
  <sodipodi:namedview
     id="base"
     pagecolor="#ffffff"
     bordercolor="#666666"
     borderopacity="1.0"
     inkscape:pageopacity="0.0"
     inkscape:pageshadow="2"
     inkscape:zoom="0.1767767"
     inkscape:cx="-113.45147"
     inkscape:cy="388.28858"
     inkscape:document-units="mm"
     inkscape:current-layer="layer1"
     showgrid="false"
     inkscape:snap-bbox="false"
     inkscape:bbox-paths="true"
     inkscape:bbox-nodes="false"
     inkscape:snap-bbox-edge-midpoints="false"
     inkscape:snap-bbox-midpoints="false"
     inkscape:object-paths="true"
     inkscape:snap-intersection-paths="false"
     inkscape:snap-smooth-nodes="false"
     inkscape:snap-midpoints="false"
     inkscape:snap-object-midpoints="true"
     inkscape:snap-center="true"
     inkscape:snap-nodes="false"
     inkscape:object-nodes="false"
     inkscape:window-width="1920"
     inkscape:window-height="1017"
     inkscape:window-x="1272"
     inkscape:window-y="-8"
     inkscape:window-maximized="1"
     inkscape:snap-text-baseline="false"
     inkscape:snap-others="false"
     units="px" />
  <metadata
     id="metadata5">
    <rdf:RDF>
      <cc:Work
         rdf:about="">
        <dc:format>image/svg+xml</dc:format>
        <dc:type
           rdf:resource="http://purl.org/dc/dcmitype/StillImage" />
        <dc:title />
      </cc:Work>
    </rdf:RDF>
  </metadata>
  <g
     inkscape:label="Ebene 1"
     inkscape:groupmode="layer"
     id="layer1"
     transform="translate(0,-58.874983)">
    <circle
       style="opacity:1;fill:#673ab7;fill-opacity:1;stroke:none;stroke-width:1.3258251;stroke-linecap:round;stroke-linejoin:round;stroke-miterlimit:4;stroke-dasharray:none;stroke-opacity:1;paint-order:normal"
       id="path834"
       cx="119.21823"
       cy="178.36491"
       r="119.0625" />
    <g
       id="g893"
       transform="matrix(0.86900806,0,0,0.86900806,16.504202,24.980914)">
      <g
         style="fill:#4527a0;fill-opacity:1"
         transform="translate(3.586784,0.37417732)"
         id="g1106">
        <text
           transform="rotate(-15.83427)"
           id="text936"
           y="262.34967"
           x="121.12038"
           style="font-style:normal;font-weight:normal;font-size:74.19946289px;line-height:1.25;font-family:sans-serif;letter-spacing:0px;word-spacing:0px;fill:#4527a0;fill-opacity:1;stroke:none;stroke-width:1.85498643"
           xml:space="preserve"><tspan
             style="font-style:normal;font-variant:normal;font-weight:bold;font-stretch:normal;font-size:74.20110321px;font-family:'Berlin Sans FB Demi';-inkscape-font-specification:'Berlin Sans FB Demi, Bold';font-variant-ligatures:normal;font-variant-caps:normal;font-variant-numeric:normal;font-feature-settings:normal;text-align:start;writing-mode:lr-tb;text-anchor:start;fill:#4527a0;fill-opacity:1;stroke-width:1.85498643"
             y="262.34967"
             x="121.12038"
             id="tspan934"
             sodipodi:role="line">$</tspan></text>
        <path
           sodipodi:nodetypes="cccccccccccccccccc"
           inkscape:connector-curvature="0"
           id="path938"
           d="m 159.61091,128.82455 c -5.68447,3.41507 -11.08065,6.26122 -11.08065,6.26122 -35.89275,16.9675 -6.92228,78.45467 -35.08515,113.70225 -10.60288,2.67538 -4.39264,7.41885 -20.651618,14.49154 -2.221758,1.43302 -4.613426,2.6111 -7.11428,3.62549 l -5.82e-4,0.004 c 31.48804,1.70879 60.95906,-2.19274 89.11688,-6.34768 -1.76717,-11.92888 -14.42746,-3.38834 -17.23046,-5.49585 12.84566,-12.84391 6.10794,-25.35858 7.42226,-42.62807 16.77617,-2.7132 30.95777,-11.87358 34.22134,-27.86208 -9.20415,7.89484 -26.03515,14.05845 -34.0229,12.39159 -3.0908,-5.84896 -5.11366,-6.36585 -2.0743,-19.06783 14.81495,-2.15149 33.65479,-14.08936 39.68825,-26.09309 l -4.10703,-4.10703 -22.88107,-4.40027 c -11.57717,-3.66645 -13.06854,-9.22399 -16.19615,-14.47473 h -0.004 z"
           style="fill:#4527a0;fill-opacity:1;stroke:none;stroke-width:1.45201027;stroke-linecap:round;stroke-linejoin:round;stroke-miterlimit:4;stroke-dasharray:none;stroke-opacity:1;paint-order:normal" />
        <path
           sodipodi:nodetypes="ccccccccccccccccccccccccc"
           inkscape:connector-curvature="0"
           id="path940"
           d="m 148.53002,135.08551 c 0,0 12.00475,-6.32502 19.06776,-11.44067 12.15673,-5.92636 12.53993,-12.14968 17.01435,-18.77443 l -36.96216,13.20078 c 10.63783,-8.96806 8.66929,-20.639748 14.37417,-29.335045 L 130.3423,110.44407 C 122.58515,98.745318 111.37331,92.284421 107.46097,81.989085 l 1.17341,37.255495 C 95.163142,109.48287 83.337023,107.94674 71.378879,105.75046 l 13.787467,23.17469 c -12.125622,-0.39778 -24.142398,0.72831 -35.495394,11.14731 l 28.454985,17.01433 c -21.958203,-0.77095 -34.557687,4.20178 -51.042963,19.06776 l 33.14859,8.80051 c -17.672764,6.75963 -15.80542,12.028 -26.108182,19.94783 16.086906,-2.83266 20.41668,-1.01796 37.255497,-2.3468 -17.64638,4.63226 -29.939921,11.55858 -42.242454,18.48107 l 36.668797,2.34681 c -7.583521,5.64306 -15.498201,8.94815 -31.68184,13.78746 10.16948,3.63572 20.338959,2.65492 30.508438,0.88005 l -12.614065,22.88134 c 10.277545,-2.04318 19.98865,-4.65279 26.401533,-10.56063 l -9.093862,21.41458 c 8.314886,-2.09741 16.675604,-4.12607 23.468029,-8.50716 61.722765,-18.80255 23.828875,-110.46313 55.736565,-128.1941 z"
           style="fill:#4527a0;fill-opacity:1;stroke:none;stroke-width:1.45201027;stroke-linecap:butt;stroke-linejoin:round;stroke-miterlimit:4;stroke-dasharray:none;stroke-opacity:1" />
        <path
           style="opacity:1;fill:#4527a0;fill-opacity:1;stroke:#007800;stroke-width:1.45201027;stroke-linejoin:round;stroke-miterlimit:4;stroke-dasharray:none;stroke-opacity:0"
           d="m 163.79453,152.18723 a 5.2998373,5.2998373 0 0 1 -5.29984,5.29982 5.2998373,5.2998373 0 0 1 -5.29985,-5.29982 5.2998373,5.2998373 0 0 1 5.29985,-5.29985 5.2998373,5.2998373 0 0 1 5.29984,5.29985 z"
           id="path942"
           inkscape:connector-curvature="0" />
        <path
           style="opacity:1;fill:#4527a0;fill-opacity:1;stroke:#007800;stroke-width:1.45201027;stroke-linejoin:round;stroke-miterlimit:4;stroke-dasharray:none;stroke-opacity:0"
           d="m 160.45491,150.33591 a 1.3431094,1.3431094 0 0 1 -1.34311,1.3431 1.3431094,1.3431094 0 0 1 -1.34312,-1.3431 1.3431094,1.3431094 0 0 1 1.34312,-1.34311 1.3431094,1.3431094 0 0 1 1.34311,1.34311 z"
           id="path944"
           inkscape:connector-curvature="0" />
        <path
           style="opacity:1;fill:#4527a0;fill-opacity:1;stroke:#007800;stroke-width:1.45201027;stroke-linejoin:round;stroke-miterlimit:4;stroke-dasharray:none;stroke-opacity:0"
           d="m 209.52739,149.21031 a 5.8523402,5.8523402 0 0 1 -5.85233,5.85234 5.8523402,5.8523402 0 0 1 -5.85234,-5.85234 5.8523402,5.8523402 0 0 1 5.85234,-5.85233 5.8523402,5.8523402 0 0 1 5.85233,5.85233 z"
           id="path946"
           inkscape:connector-curvature="0" />
      </g>
      <g
         transform="translate(4.8643054)"
         id="g874">
        <g
           id="text860"
           style="font-style:normal;font-weight:normal;font-size:67.75125122px;line-height:1.25;font-family:sans-serif;letter-spacing:0px;word-spacing:0px;fill:#212121;fill-opacity:1;stroke:none;stroke-width:1.69378126"
           transform="matrix(1.0536183,-0.2988247,0.2988247,1.0536183,-16.105441,-16.566949)"
           aria-label="$">
          <path
             inkscape:connector-curvature="0"
             id="path1108"
             style="font-style:normal;font-variant:normal;font-weight:bold;font-stretch:normal;font-size:67.75275421px;font-family:'Berlin Sans FB Demi';-inkscape-font-specification:'Berlin Sans FB Demi, Bold';font-variant-ligatures:normal;font-variant-caps:normal;font-variant-numeric:normal;font-feature-settings:normal;text-align:start;writing-mode:lr-tb;text-anchor:start;fill:#212121;fill-opacity:1;stroke-width:1.69378126"
             d="m 139.5098,216.15749 q -0.0331,0 -3.0105,-1.42254 -2.97741,-1.42254 -4.86311,-1.42254 -3.70523,0 -3.70523,3.44057 0,1.95186 3.44057,4.06913 5.49168,3.34132 6.3849,4.10222 3.44057,3.0105 3.44057,7.21196 0,8.93225 -11.04952,11.90967 0.26466,5.2601 0.26466,5.8225 0,0.33082 -0.72781,0.39699 -0.49624,0.0662 -1.42254,0 -1.05864,-0.0992 -1.02556,-0.0992 -0.43007,0 -1.25713,0.0992 -0.82706,0.13233 -1.22405,0.13233 -0.26466,0 -0.49623,-0.0993 -0.1985,-0.29774 -0.1985,-1.62104 0,-1.05863 0.13233,-3.27516 -8.86608,0 -8.99841,-1.22404 -0.0331,-0.23158 0.0331,-0.62857 0.0331,-0.52932 0.0331,-0.66165 0,-1.32329 -0.23157,-3.17591 -0.0662,-0.5624 -0.49624,-2.08419 -0.39699,-1.38946 -0.39699,-2.08419 0,-0.69473 0.7609,-0.69473 0.82706,0 2.91125,0.49624 2.11727,0.46315 3.27516,0.46315 5.8225,0 5.8225,-3.60598 0,-1.8857 -3.34132,-4.23455 -5.4586,-3.80448 -6.25258,-4.59845 -3.34132,-3.17591 -3.34132,-7.11272 0,-4.39996 3.20899,-7.77436 3.04358,-3.209 7.47662,-4.06914 0,0.29774 -0.0992,-1.58795 -0.0662,-1.42255 0.0331,-2.21652 0.13233,-1.12481 0.62857,-1.12481 h 5.69017 q 0.39699,0 0.49623,0.99248 0.0993,0.72781 0.0331,2.01802 -0.0662,1.75337 -0.0662,1.52179 1.95186,0.13233 6.25258,1.48871 4.92927,1.55487 4.92927,2.67968 0,0.23157 -0.19849,0.86014 -0.46316,0.99247 -1.22405,3.04358 -0.23158,1.1248 -0.82706,3.30824 -0.23158,0.76089 -0.79398,0.76089 z" />
        </g>
        <path
           style="opacity:1;fill:#eeeeee;fill-opacity:1;stroke:none;stroke-width:2.64583325;stroke-linecap:round;stroke-linejoin:round;stroke-miterlimit:4;stroke-dasharray:none;stroke-opacity:1;paint-order:normal"
           d="m 146.14294,117.56856 c -5.68447,3.41507 -11.08065,6.26122 -11.08065,6.26122 -35.892752,16.9675 -6.92228,78.45467 -35.08516,113.70226 -10.602874,2.67538 -4.392636,7.41884 -20.651614,14.49153 -2.221758,1.43303 -4.613425,2.61111 -7.11428,3.62549 l -5.81e-4,0.004 c 31.488045,1.70879 60.959065,-2.19274 89.116885,-6.34767 -1.76718,-11.92889 -14.42746,-3.38834 -17.23046,-5.49585 12.84565,-12.84392 6.10794,-25.35859 7.42226,-42.62808 16.77617,-2.7132 30.95776,-11.87358 34.22134,-27.86208 -9.20416,7.89484 -26.03515,14.05845 -34.02291,12.3916 -3.0908,-5.84897 -5.11365,-6.36586 -2.07429,-19.06784 14.81494,-2.15149 33.65478,-14.08935 39.68824,-26.09308 l -4.10702,-4.10704 -22.88107,-4.40027 c -11.57717,-3.66645 -13.06855,-9.22399 -16.19616,-14.47472 h -0.004 z"
           id="path817"
           inkscape:connector-curvature="0"
           sodipodi:nodetypes="cccccccccccccccccc" />
        <path
           style="opacity:1;fill:#212121;fill-opacity:1;stroke:none;stroke-width:2.64583325;stroke-linecap:butt;stroke-linejoin:round;stroke-miterlimit:4;stroke-dasharray:none;stroke-opacity:1"
           d="m 135.06205,123.82952 c 0,0 12.00475,-6.32502 19.06776,-11.44067 12.15672,-5.92636 12.53992,-12.14968 17.01435,-18.774423 L 134.182,106.8152 c 10.63783,-8.968054 8.66928,-20.639744 14.37417,-29.335041 l -31.68184,21.70793 C 109.11717,87.489332 97.905334,81.028435 93.992997,70.733098 L 95.1664,107.98859 C 81.695167,98.226887 69.869048,96.690751 57.910904,94.494476 L 71.69837,117.66916 c -12.125622,-0.39778 -24.142398,0.72831 -35.495394,11.14731 l 28.454986,17.01433 c -21.958203,-0.77095 -34.557688,4.20178 -51.042964,19.06776 l 33.14859,8.80052 c -17.672764,6.75962 -15.80542,12.02799 -26.108181,19.94783 16.086906,-2.83266 20.41668,-1.01797 37.255497,-2.34681 -17.64638,4.63226 -29.939921,11.55858 -42.242454,18.48107 l 36.668797,2.34681 c -7.583521,5.64306 -15.498202,8.94816 -31.68184,13.78746 10.16948,3.63573 20.338959,2.65492 30.508438,0.88005 l -12.614066,22.88134 c 10.277546,-2.04318 19.98865,-4.65278 26.401533,-10.56062 l -9.093862,21.41457 c 8.314886,-2.0974 16.675605,-4.12607 23.468029,-8.50715 C 141.04824,233.22108 103.15435,141.5605 135.06205,123.82952 Z"
           id="path815"
           inkscape:connector-curvature="0"
           sodipodi:nodetypes="ccccccccccccccccccccccccc" />
        <g
           id="g864">
          <path
             style="opacity:1;fill:#212121;fill-opacity:1;stroke:#000000;stroke-width:5.28048325;stroke-linejoin:round;stroke-miterlimit:4;stroke-dasharray:none;stroke-opacity:0"
             d="m 151.06721,137.14488 a 7.5551949,7.5551949 0 0 1 -7.5552,7.55518 7.5551949,7.5551949 0 0 1 -7.55519,-7.55518 7.5551949,7.5551949 0 0 1 7.55519,-7.5552 7.5551949,7.5551949 0 0 1 7.5552,7.5552 z"
             id="path825"
             inkscape:connector-curvature="0" />
          <path
             style="opacity:1;fill:#ffffff;fill-opacity:0.98293511;stroke:#000000;stroke-width:7.25931978;stroke-linejoin:round;stroke-miterlimit:4;stroke-dasharray:none;stroke-opacity:0"
             d="m 148.01338,134.68454 a 2.6321874,2.6321874 0 0 1 -2.6322,2.63217 2.6321874,2.6321874 0 0 1 -2.6322,-2.63217 2.6321874,2.6321874 0 0 1 2.6322,-2.63221 2.6321874,2.6321874 0 0 1 2.6322,2.63221 z"
             id="path830"
             inkscape:connector-curvature="0" />
        </g>
        <path
           inkscape:connector-curvature="0"
           id="path832"
           d="m 196.05941,137.95433 a 5.8523402,5.8523402 0 0 1 -5.85233,5.85234 5.8523402,5.8523402 0 0 1 -5.85234,-5.85234 5.8523402,5.8523402 0 0 1 5.85234,-5.85233 5.8523402,5.8523402 0 0 1 5.85233,5.85233 z"
           style="opacity:1;fill:#212121;fill-opacity:1;stroke:#007800;stroke-width:0;stroke-linejoin:round;stroke-miterlimit:4;stroke-dasharray:none;stroke-opacity:0" />
      </g>
    </g>
  </g>
</svg>
