addresse_titulaire;carrosserie;categorie;couleur;cylindree;date_immatriculation;denomination_commerciale;energie;prenom;immatriculation ;marque;nom;places;poids;puissance;type;variante;version;vin
3822 Omar Square Suite 257 Port Emily, OK 43251;45-1743376;34-7904216;LightGoldenRodYellow;3462;03/05/2012;Enhanced well-modulated moderator;37578077;Jerome;OVC-568;Williams Inc;Smith;32;3827;110;Inc; 92-3625175;79266482;9,78008E+12
974 Byrd Mountains New Jennifer, IL 01612;03-0258606;71-7143342;Snow;4837;14/06/2019;Right-sized secondary array;15895400;Paul;859 GZP;Ross PLC;Olson;9;5870;298;LLC; 37-7112501;39890658;9,78125E+12
604 Willis View Suite 279 Hansenview, NY 26033;26-7045508;16-3556230;CadetBlue;1245;29/11/1988;Balanced intangible portal;99868567;Jose;2-2270C;Gillespie PLC;Gomez;33;3504;406;PLC; 67-9571998;92859586;9,78103E+12
9254 Alex Spurs Guerreroborough, CA 92849;33-0120430;48-3676141;Aquamarine;6591;16/02/1972;Public-key multi-state portal;36238;Melissa;3U QE479;Jordan and Sons;Perry;42;6790;274;Inc; 46-5693739;40786551;9,78196E+12
1076 Richardson Ferry Apt. 489 Georgefort, WA 80609;15-9017493;43-4456544;OldLace;4048;24/03/1924;Innovative bifurcated structure;61597433;David;HNE 523;Kane, Owens and Ruiz;Walsh;4;1113;367;PLC; 27-4457025;16381230;9,7817E+12
2286 Chambers Mountain Apt. 678 Bergerborough, RI 20663;30-6116142;86-2929434;Magenta;1603;11/11/1906;Enterprise-wide homogeneous archive;34766569;Travis;8HX M57;Gutierrez and Sons;Bates;43;8513;500;LLC; 54-8683849;13697730;9,78058E+12
379 James Estates South Timothyland, KY 25223;56-5056110;63-5034092;RoyalBlue;2395;09/04/1933;Networked asynchronous architecture;77613059;Johnny;57-QF04;Ferguson, Cervantes and Ross;Burns;16;3549;74;LLC; 91-1247104;50766970;9,78117E+12
3909 Tran Station Port Brianmouth, IL 21645;15-5272742;51-8265228;Black;7515;07/06/1920;Synchronized systematic encryption;56249798;Scott;8AE 879;Mckay PLC;Gilbert;5;8910;110;and Sons; 74-6886891;38494925;9,78183E+12
81945 Maxwell Harbor Apt. 426 West Deborah, GA 74368;12-1245648;83-0657526;PapayaWhip;3254;17/01/1908;Open-architected demand-driven interface;28439073;James;DZ8 9969;Matthews Inc;Mendoza;18;6394;314;and Sons; 55-8906993;20894474;9,78152E+12
6424 Roy Point Apt. 072 East Alison, FL 91097;54-0826937;50-2284125;Bisque;778;12/05/1916;Cross-group coherent process improvement;90050824;Lauren;ESC-893;Davis-Davies;Hoffman;12;7203;276;Group; 23-9750084;97983392;9,78101E+12
93558 Benjamin Inlet Apt. 565 East Rebecca, MO 60002;23-3593870;22-9054433;RosyBrown;2345;09/05/1972;Profit-focused directional orchestration;10910337;Jack;MCE-623;Cox, Ochoa and Brennan;Jones;24;5395;572;Ltd; 32-7037008;76874505;9,78029E+12
821 Tammy Flat Suite 737 Bethanychester, TX 00661;85-6542048;14-8326747;DarkOrange;6362;01/04/1998;Realigned fault-tolerant strategy;50130139;Patrick;156-XON;Mills-Taylor;Coleman;9;9247;399;PLC; 61-1463986;12172559;9,78103E+12
90148 Kelli Oval Suite 515 Sarahton, DE 35247;01-1371797;58-6806072;Khaki;6435;27/09/1941;Horizontal systematic hardware;89171493;Angela;650J;Lane-Ryan;Schneider;16;1667;261;Inc; 99-1124953;46990686;9,78177E+12
PSC 6427, Box 0677 APO AA 51900;33-2149269;77-2773542;SeaShell;7038;18/08/1926;Public-key foreground portal;58158722;Breanna;917 PAK;James, Morales and Wilson;Alexander;4;3645;312;Group; 58-8110663;94868319;9,78147E+12
2247 Taylor Common Jamesborough, IN 35177;04-0412094;68-0953441;Lime;4061;07/08/1990;Right-sized motivating forecast;31948227;Dawn;ZMR 198;Conner Inc;Cohen;19;6508;124;Ltd; 34-4239114;7213304;9,78071E+12
6729 Herring Rue Jonathanfurt, NH 65237;26-6321065;25-1535528;LightCoral;7397;17/08/2008;Phased holistic attitude;14995095;Ernest;307 OZH;Cook-Murphy;Thomas;9;998;502;PLC; 58-1872808;75529291;9,78143E+12
529 Michael Extension Suite 011 West Ashley, DC 86156;45-4251913;87-7124451;LightSalmon;1055;26/01/1958;Multi-tiered contextually-based alliance;95936925;Samuel;58T W67;Sanchez, Robertson and Larson;Contreras;32;8960;450;Inc; 95-8624759;52774188;9,78142E+12
7406 Cunningham Prairie Apt. 781 South Aliciaborough, VT 41077;71-2991090;37-3820743;Chartreuse;4484;28/06/2014;Balanced logistical productivity;19102245;Brian;136 BRL;Winters and Sons;Harding;27;3689;396;LLC; 12-6763758;36077526;9,7809E+12
67827 Thompson Ferry Salazarshire, NV 66871;50-2387379;31-0099444;Orange;2592;11/04/1958;Inverse zero tolerance service-desk;91689184;Samantha;8II7744;Quinn Ltd;Robinson;3;6703;150;Inc; 85-0350272;44290597;9,78029E+12
927 Andrew Spurs East Alan, ID 58185;03-9072414;63-7867652;Orange;1381;08/10/1946;Pre-emptive contextually-based artificial intelligence;9299559;Amy;56HI9;Reynolds-Nelson;Smith;34;1928;213;PLC; 85-7853011;75112479;9,7805E+12
1687 Valdez Harbors Houstonberg, CO 33803;71-2194952;72-2732792;Bisque;5383;15/11/1988;Proactive empowering extranet;28395607;Aimee;4NE3156;Hammond, Cunningham and Fernandez;Duran;2;9046;289;Ltd; 65-7616011;73372639;9,78138E+12
12237 Tricia Rapid Apt. 331 Millerchester, AK 36546;31-1035063;40-7078081;MidnightBlue;1089;20/06/1992;Decentralized 4thgeneration moratorium;69805257;Jennifer;932 VJV;Cruz-Joseph;Edwards;19;6153;344;Group; 53-5374698;5746804;9,78149E+12
Unit 5345 Box 8013 DPO AE 42026;10-0822631;92-8818458;HoneyDew;3823;02/06/1927;Reverse-engineered fresh-thinking support;14868849;Shannon;963862;Burns and Sons;Harmon;24;7102;385;Inc; 27-6938356;74878673;9,78124E+12
65633 Bean Bypass Lake Luke, WV 60707;91-7380005;20-8015468;LavenderBlush;134;08/10/1989;Open-architected dedicated function;82131586;Shannon;G89 7YA;Johnson-Arroyo;Herrera;36;9046;430;PLC; 51-1948250;31911061;9,78003E+12
660 Gregory Court Suite 341 North Alexandraton, OR 69057;04-5306729;75-5897879;LightPink;6611;08/01/1941;Adaptive coherent benchmark;51607982;Christine;997-FCI;Sullivan-Adams;Hall;38;7613;55;Group; 56-4801851;45995767;9,78036E+12
67697 Williamson Path Perezton, NC 34120;92-7168732;75-7250017;DarkSlateBlue;209;27/08/1992;Optional didactic superstructure;53612908;Joshua;180-JIR;Cantu PLC;Hernandez;25;3523;541;Group; 23-5949724;69519116;9,78139E+12
85393 Freeman Islands Apt. 774 Robinsonstad, VA 66339;35-4858750;04-7320656;SteelBlue;4229;28/01/1979;Pre-emptive didactic product;57146249;Alyssa;6GQT 31;Hoover, Henderson and Miles;Davis;19;4634;210;LLC; 46-2835721;52984341;9,78128E+12
9781 Stevenson Throughway Apt. 184 Millerview, NM 57415;44-0915471;88-0971204;LimeGreen;7842;04/03/2007;Re-contextualized heuristic core;91096548;Vanessa;BM-4248;Wilkerson and Sons;Henderson;12;3523;257;Inc; 85-0828638;36391714;9,78022E+12
7221 Hanson Springs South Bobby, WA 75956;20-2614662;60-3352693;MediumSlateBlue;6456;02/02/1991;Synchronized local knowledge user;89737514;Maria;NFN 323;Moses Ltd;Smith;46;7445;220;PLC; 71-9074524;32733471;9,78182E+12
779 Brown Manor Apt. 245 North Patriciaburgh, AK 30526;48-6271851;26-6878623;Pink;3273;27/11/1985;Exclusive fresh-thinking Graphical User Interface;13504779;Megan;013 VPN;Haley, Tucker and Soto;Wood;10;7847;58;and Sons; 91-3626257;54412453;9,78132E+12
70588 Collier Island South Kevinberg, NC 41638;88-7110380;35-7157725;Brown;103;18/05/1956;Proactive tangible adapter;50420285;Monica;8Y401;Bridges-Graves;Maldonado;2;7575;107;Group; 46-1012537;12039319;9,78091E+12
05046 Julia Forest Suite 032 Victoriaburgh, MN 23618;98-6456973;42-7788553;Red;3340;03/12/1987;Enterprise-wide encompassing groupware;58116821;Shawn;37-AN00;Davis, Snyder and Price;Baker;39;3854;118;Inc; 55-9133653;35905318;9,78019E+12
82726 Rodgers Skyway Parksville, WV 22614;40-3760222;99-8291456;DimGray;1177;21/12/1936;Polarized reciprocal encoding;78641358;Kylie;119QP;Garcia-Carter;Odonnell;38;2522;565;Inc; 45-3062598;25604122;9,78159E+12
28364 Jose Ville Apt. 788 Lopezbury, NE 32542;11-5031451;51-5886559;AntiqueWhite;4178;29/01/1984;Distributed optimal hierarchy;48662024;Stephen;B59 5KN;Hess-Acosta;Sandoval;8;1253;331;Inc; 53-2174959;65532478;9,78028E+12
317 Heather Row Lake Elizabeth, MO 69583;58-5422707;24-6434609;CadetBlue;5127;06/01/1948;Multi-layered contextually-based contingency;77292438;Norma;9MD E26;Moran PLC;Yu;5;6531;292;LLC; 61-9262316;60202956;9,78073E+12
7497 Pamela Rue Suite 977 East Breannaview, HI 67651;58-3185500;59-2212029;Cornsilk;3889;26/10/1964;Fundamental reciprocal application;30928381;Lindsay;01D Q88;Rich, Hogan and Brown;Medina;5;7445;279;LLC; 60-9459751;75574352;9,78091E+12
Unit 4546 Box 1668 DPO AE 57481;93-8379233;58-6660911;LightCoral;4903;24/12/1984;Secured next generation groupware;78977945;Deanna;W48 7TA;Garcia Inc;Cook;37;4864;544;Inc; 39-3479363;66724674;9,7814E+12
60422 Ann Islands Port Johnland, AL 38481;94-9574425;26-9216959;MistyRose;1310;17/06/1976;Customer-focused optimal solution;17857123;Christina;0X DI228;Lee-Whitaker;Park;43;7245;38;Group; 46-6788298;28019732;9,78012E+12
86312 Amanda Lodge South Trevor, ID 89563;03-4362405;99-3210147;Thistle;6238;30/06/1996;Optimized context-sensitive hierarchy;56225426;Cassie;373 YHY;Ortega Ltd;Burke;25;7313;105;PLC; 55-5640826;20080105;9,78172E+12
79434 Snyder Camp Apt. 796 Wardfurt, MI 33995;99-9770725;61-1671942;Linen;673;18/06/1943;Multi-lateral regional matrices;55483360;Keith;570-BAJ;Dunn-Rivera;Montgomery;1;6994;304;LLC; 90-1233250;66480174;9,78112E+12
4870 Nathaniel Forks West Rebeccaton, WA 51844;04-9470445;81-6734793;DodgerBlue;297;14/09/1930;Object-based responsive flexibility;1739947;Hannah;NPM-152;Carey Ltd;Payne;41;923;480;Ltd; 90-2772099;6213848;9,78147E+12
37556 Willis Mountains Suite 342 East Peter, WV 12605;75-6993082;42-0411522;Turquoise;3623;01/02/1968;Ergonomic dynamic product;653046;Melissa;956 3WZ;Meyer, Anderson and Chase;Lee;17;8419;552;Inc; 47-3917539;93969116;9,78167E+12
944 Meza Mission Suite 062 Port Stephanie, SD 14196;36-6737818;71-3185895;Gray;2989;12/05/1999;De-engineered mobile hub;38144004;Michelle;QA 96217;Hayden LLC;Tyler;12;7548;50;Inc; 45-8605360;12116584;9,78095E+12
057 Mccoy Neck Apt. 162 Brandonfort, CT 80346;65-2134973;35-2040975;DarkOliveGreen;7634;31/10/1981;Assimilated homogeneous neural-net;2311180;Jessica;5R 6K0MJW;Reed LLC;Peterson;3;3741;495;and Sons; 02-3722921;96909546;9,78173E+12
613 Joshua Wells Apt. 347 West Linda, NH 39995;51-5555634;91-7171217;PeachPuff;5223;03/07/1925;Synergized bottom-line framework;75662318;Amber;0N R7545;Ayers-Wood;Sanders;27;3795;231;Group; 55-7001682;28063124;9,78069E+12
55433 Schwartz Freeway Apt. 814 Glorialand, AL 02382;57-0541699;27-9882189;Silver;882;25/08/1919;Open-architected reciprocal monitoring;98800384;Phillip;GUX 253;Scott, Cochran and Robinson;Mosley;5;3245;390;LLC; 50-5616657;7127663;9,78056E+12
3430 Porter Pine Kennedyborough, TN 67372;01-6859993;56-3244495;Chartreuse;1090;25/10/1958;Reduced transitional firmware;59230700;Connor;LAY 341;Barnett Ltd;Harris;34;4274;62;PLC; 51-7166699;43483235;9,78034E+12
1129 Hall Centers Apt. 505 Bookerton, OK 51249;27-8983734;74-3345708;Azure;3080;01/02/2000;Digitized demand-driven task-force;35039525;Reginald;343;Archer Group;Walker;45;4742;112;PLC; 41-2715251;98347193;9,78123E+12
20127 Morales Island Watsonview, LA 35459;73-5960074;65-4966595;Linen;7257;23/05/1987;Secured modular task-force;94776799;Michael;7WF 780;Skinner-Yoder;Kennedy;38;9160;259;Group; 05-9406902;94677522;9,78057E+12
18445 Paul Turnpike Kimberlybury, VA 28873;20-0873676;84-6189762;LightCyan;6368;15/04/1984;Horizontal systematic system engine;38374999;Sabrina;5LQ 820;Walker, Hunter and Allen;Anderson;19;3572;324;Inc; 34-7085230;8618504;9,78024E+12
8155 Moreno Square Lake Catherine, MN 87045;04-5375680;21-5958134;BurlyWood;7403;12/12/1915;Polarized actuating core;72604106;Marie;706 HGH;Gallagher, Mills and Lewis;Nelson;38;6388;455;and Sons; 68-8342227;80481003;9,78147E+12
1845 Acevedo Heights Nicolechester, KY 15524;60-5897303;73-0966073;LightSteelBlue;135;30/04/1942;Cross-platform bottom-line toolset;4125600;Eric;593 ZVV;Fisher, Smith and Martinez;Ortiz;8;3722;129;and Sons; 98-3138089;3431009;9,78114E+12
96388 Olson Cove Apt. 201 South Brandonport, KY 54994;76-8081190;06-4086192;LightSlateGray;5988;13/08/2010;Optimized exuding attitude;84579171;Craig;887S5;Jones-Lewis;Stephens;50;5537;121;Inc; 90-7330035;44236489;9,78147E+12
4992 Green Rest Jasminemouth, NY 62327;73-9682070;33-8443823;LightSalmon;2850;01/09/1937;Multi-channeled client-server infrastructure;66523055;Christopher;EVF-764;Rojas LLC;Mills;39;1706;211;Group; 37-3440367;48790680;9,78127E+12
09870 Salazar Branch South Troyfurt, MT 84214;66-6751658;12-3412452;LightSalmon;3821;07/07/2017;Re-contextualized reciprocal capability;4126348;Lawrence;065L0;Lopez Inc;Rice;15;8581;232;Group; 25-8461796;69673788;9,78169E+12
2493 Brown Valley Shawborough, VT 44446;30-6536745;87-9820070;LightGray;1300;20/08/1914;Enterprise-wide methodical product;52617409;Eric;ABW-3380;Lyons, Phillips and Keller;Barr;18;4573;95;Ltd; 15-6185841;1279351;9,78175E+12
8978 Dennis Oval Anitaport, WV 10423;61-8851493;88-1917804;Gray;2718;09/08/1948;Configurable 5thgeneration throughput;73229223;Jeremy;374-ASYS;Smith-Garcia;Hernandez;28;7538;485;Ltd; 38-5696212;67261925;9,78065E+12
543 Spencer Street Suite 605 Thompsonton, DE 49976;34-6655537;02-4330415;Tan;2023;24/06/1911;Profound methodical hardware;610780;Martin;5EB95;Li, Melendez and Santana;Cox;4;4150;159;and Sons; 58-2831249;11724063;9,78021E+12
91552 Bradshaw Port Suite 052 Cookeshire, SD 99123;41-4534152;11-3320235;Olive;3888;25/11/1990;Visionary attitude-oriented encryption;48684712;Caleb;DC 6614;Lopez Inc;Murphy;26;1811;135;Inc; 25-9161458;67690831;9,78152E+12
1781 Raymond Causeway Lake Christinamouth, CT 28959;92-8469446;31-0933786;LightSeaGreen;3523;01/05/1910;User-centric zero-defect migration;89704455;Jessica;TZS4932;Frank LLC;Ross;41;4727;93;PLC; 64-0496510;67058891;9,78058E+12
173 Murphy Rest Apt. 986 North Derrick, FL 91537;12-7274028;75-0471585;Lavender;6118;22/05/1983;Pre-emptive dedicated strategy;52043796;Patricia;C72-14W;Saunders-Gilmore;Morris;22;1711;279;LLC; 67-8846438;96294727;9,78036E+12
118 David Fords Apt. 387 Jonathanshire, MT 54237;01-4362466;43-0755331;Violet;2624;08/02/2017;Polarized multi-state adapter;55488303;Andrew;462-YBOT;Vance PLC;King;27;6899;265;Ltd; 35-6440980;35265474;9,78149E+12
6030 Marie Station Apt. 140 Smithburgh, CA 01532;33-0794356;62-1809288;DarkKhaki;2530;13/06/1970;Enhanced full-range synergy;71991276;Brittany;VKA 855;Williams Ltd;Henderson;30;3333;161;PLC; 63-4353126;28484868;9,78044E+12
906 King Wells Apt. 544 Hancockside, ME 46251;51-6487039;86-8465009;CadetBlue;4706;06/01/1984;Down-sized maximized success;92462717;Gary;826 AOY;Campbell, Patton and Young;Wright;31;2156;213;and Sons; 82-3630555;84780812;9,78093E+12
0004 Julian Dam Apt. 447 Kristentown, NH 35532;03-3634317;59-8179503;Khaki;2401;22/02/2004;Reverse-engineered uniform architecture;46273734;Jerry;9G 24421;Mcdonald PLC;Parker;44;5113;30;PLC; 14-0739367;51997137;9,78161E+12
856 Buckley Gardens Sonyabury, AZ 98169;48-8647728;51-6767550;LightPink;7425;02/02/1987;Switchable impactful capacity;36149926;Phillip;3-5552T;Martin, Lee and Hubbard;Shepherd;36;4054;341;PLC; 68-8818286;84250025;9,78053E+12
964 Wood Row Victorville, MS 67563;82-5677508;40-4301179;PaleGoldenRod;5330;15/04/1944;Managed 6thgeneration circuit;78507883;William;8U 7N8HUS;Cowan, Ray and Taylor;Meyer;20;7090;384;Inc; 43-2237060;46808295;9,78157E+12
578 Christopher Hill Tammyburgh, CO 32723;64-6561914;90-5005563;White;2410;29/09/1925;Reduced systemic website;64051338;William;O25 6LF;Fernandez, Blake and Fuller;Bradford;29;1638;470;Inc; 40-6468823;95857220;9,78027E+12
44724 Velez Spur Suite 361 Waretown, WY 45030;12-2681420;15-6662640;LawnGreen;347;08/03/1989;Down-sized static interface;56419368;Erin;480RTZ;Schmidt Inc;Romero;50;8995;287;Group; 58-9341245;17437943;9,78065E+12
3776 Gonzalez Passage Apt. 296 Millerhaven, SD 62551;77-2146415;34-1964236;SaddleBrown;5927;02/10/1906;Customizable cohesive array;7918100;Donna;77XL127;Rivera-Whitaker;Jacobs;50;2632;394;and Sons; 30-2690948;68148348;9,78061E+12
52089 Michael Rue Suite 286 New Adam, WI 39526;25-4197365;93-1669991;MediumPurple;2520;17/08/1943;Synergistic motivating challenge;51169756;Edwin;90GA4;Nguyen-Thomas;Murphy;26;6215;364;Ltd; 85-6102065;46503763;9,78067E+12
531 Brown Cliffs Suite 181 New Justintown, OR 60464;35-2780063;62-8099065;PapayaWhip;6871;16/11/1938;Programmable bi-directional info-mediaries;39839107;Andrew;XLW 263;Morgan LLC;Williamson;43;1749;269;and Sons; 81-7047014;52318993;9,78192E+12
5400 Ramos Crest Mccormickville, MO 20843;45-5232450;53-8005500;LightGoldenRodYellow;5397;02/05/1957;Front-line zero-defect forecast;97608547;Daniel;1ID5258;Kennedy, Estrada and Wang;Li;11;1916;85;PLC; 61-2804776;79741231;9,78121E+12
80419 Dudley Park Port Eileen, RI 20234;42-7404799;06-8106775;SandyBrown;883;24/01/1978;Front-line regional interface;88325491;Matthew;648 4DP;Nelson, Pierce and Davis;Huff;50;2949;421;Inc; 20-8601879;50315222;9,78099E+12
05931 Jennifer Islands North Jason, IA 28527;75-2925723;31-1924460;Snow;4945;22/04/1964;Upgradable grid-enabled open system;13652333;Debbie;8ZS93;Kim-Green;Reynolds;37;7993;322;Group; 74-8458910;87926460;9,78099E+12
1193 William Branch Apt. 564 Lake Elizabeth, MS 98926;66-5437119;48-9208781;LimeGreen;5915;10/08/1931;Digitized value-added interface;95697673;Gary;ESN 807;Winters, Martinez and White;Zimmerman;11;4838;278;Ltd; 85-6409859;11262954;9,78096E+12
969 Ann Wells Port Albert, MS 54614;16-6664792;39-9946964;SpringGreen;2967;05/05/2011;Re-engineered reciprocal support;57462820;Stefanie;8667 FY;Hart, Cain and Nolan;Hickman;12;8240;517;Ltd; 51-6010427;81743094;9,78097E+12
448 Garcia Fall New Denise, WY 93926;58-0977050;84-9936330;Khaki;3367;18/03/1948;Fundamental cohesive access;32436570;Eric;CKV 615;Mitchell, Mejia and Hall;Thomas;42;6351;76;LLC; 52-3160965;58305904;9,78198E+12
9785 Murphy Fields Apt. 732 West Jackview, CO 72126;26-0331638;27-4711244;Gray;3330;21/09/1911;Integrated modular intranet;75046866;Dawn;85Y 083;Mitchell LLC;Logan;41;6827;519;Group; 13-6613211;30931626;9,78195E+12
693 Whitehead Knolls Apt. 436 New Brandonmouth, KS 82994;93-2526704;59-6399254;MistyRose;4739;01/04/1936;Versatile homogeneous Local Area Network;91976307;Dawn;4T322;Nguyen-Allen;Vazquez;35;5546;431;Group; 42-1101968;94192001;9,78187E+12
5935 Ryan Mountains Apt. 271 Francoside, ME 58138;99-2582856;54-8529730;PaleGreen;342;19/08/1937;Multi-channeled homogeneous standardization;6006761;Whitney;0-9716X;Melendez, Padilla and Carr;Welch;26;4000;139;Inc; 30-9061869;43337880;9,78105E+12
906 Kristina Orchard Kennethchester, NJ 87192;02-0443367;87-3269247;DarkKhaki;2192;26/12/1993;Object-based client-server array;26491745;Andrew;BH0 4114;Lopez and Sons;Valenzuela;17;6997;488;Inc; 24-1430043;30667914;9,78083E+12
9200 Rodriguez Estates Apt. 654 South April, PA 26619;27-8750612;98-0341690;GoldenRod;3097;20/03/1964;Re-engineered demand-driven instruction set;24282765;Carlos;633-356;Fry, Kline and Jones;Byrd;49;7331;456;and Sons; 94-7512308;41970041;9,78004E+12
252 Hooper Avenue Suite 611 Davidberg, WA 11422;31-2430540;01-1245481;BlueViolet;1493;15/05/1914;Advanced systemic process improvement;28217282;Jerry;DI 57417;Williams-Higgins;Lambert;49;4283;356;LLC; 53-2081814;40224329;9,78144E+12
7277 Craig Key Brownland, DC 52039;56-3467561;60-6451281;DarkTurquoise;1502;31/08/1976;Vision-oriented composite migration;43886258;Juan;JE 3027;Mendoza-Donovan;Morales;18;7640;515;Group; 39-1575160;86168083;9,78011E+12
929 Bryan Street Apt. 884 South Steven, MD 49912;36-7051719;83-6522388;SlateGray;6131;21/09/2015;Optimized analyzing parallelism;19648903;Paul;XG6 Y9A;Smith, Kelly and Warren;Rodriguez;34;8059;126;LLC; 10-0917505;96494738;9,78051E+12
40619 Louis Crossing Port Sierrafurt, RI 27062;65-3098983;50-3645074;Maroon;4802;15/02/1960;Exclusive holistic utilization;29384754;Kelsey;44I 563;Glover and Sons;Hernandez;30;3107;320;and Sons; 38-4233314;96545300;9,78089E+12
PSC 3413, Box 3615 APO AA 01860;37-4824412;87-0225508;PowderBlue;7808;31/07/1973;Devolved optimal portal;96913055;Alexander;ZRK 901;Peterson, Dunn and Murphy;Hill;20;4983;125;and Sons; 05-0041660;76201349;9,78084E+12
784 Gail Trail Suite 228 Lindseystad, CA 50970;67-4347418;47-1131067;LawnGreen;635;29/01/1925;Cross-group needs-based orchestration;61108271;Samuel;62AH9;Coleman, Miller and Savage;Scott;31;3849;218;Group; 56-7413413;8008152;9,78193E+12
Unit 4398 Box 0830 DPO AA 79783;01-0177745;77-4477809;Crimson;6009;03/11/1937;Business-focused secondary Graphic Interface;74776078;William;5XJ 474;Hanson, Mueller and Edwards;Sandoval;15;1255;482;and Sons; 10-7965097;97061823;9,78124E+12
1093 Sheila Ranch Suite 225 North Kellyfort, GA 16728;84-0370450;83-4782253;DarkOliveGreen;2017;10/02/2000;Open-source next generation standardization;82943653;Kimberly;868-GXS;Carr PLC;Edwards;33;6551;177;PLC; 45-4237546;13936235;9,78171E+12
70676 Blanchard Corners West Kimberlystad, AZ 15074;20-9616935;25-8692430;MediumPurple;6112;22/09/1988;Multi-tiered heuristic hardware;46073945;Carla;NEE 009;Freeman, Brown and Kramer;Young;12;6144;218;and Sons; 55-4834109;7268656;9,78044E+12
892 Mary Station South Travisbury, VA 05117;42-4339616;16-8309567;Indigo;3886;25/02/1909;Down-sized heuristic attitude;90861697;Elizabeth;147-ZRT;Wagner LLC;Barrera;9;6688;304;PLC; 81-1666687;54608641;9,78065E+12
8725 Lester Forest Apt. 214 East Deborahstad, ND 40895;22-3881625;66-3281276;CornflowerBlue;7462;04/12/1949;Virtual non-volatile pricing structure;59946298;Justin;414-MSMC;Lynch, Watkins and Anderson;Mendoza;17;6035;73;PLC; 61-7202980;81991457;9,78033E+12
3092 Jodi Tunnel North Jadebury, VA 01736;06-9363156;95-8438318;SandyBrown;4635;03/11/1964;Ergonomic holistic hardware;39829214;Robert;REM 217;Parsons, Jones and Payne;Maxwell;23;2423;478;Group; 06-0772816;4802389;9,78012E+12
28482 Richard Lock North David, RI 35371;87-9396036;31-0947125;OliveDrab;6069;08/02/1962;Ergonomic analyzing monitoring;94887204;Tony;FYH 951;West PLC;Carr;44;2058;388;LLC; 32-3065090;27340004;9,78191E+12
6744 Alex Knolls Suite 987 Nicoleton, PA 70452;90-7112686;62-8493168;Moccasin;7675;01/01/1960;Synergistic composite intranet;72348192;David;IGE 226;Griffith-Cooper;Velez;44;5113;533;PLC; 91-7780726;9445642;9,7813E+12
96056 Michelle Forks Port Matthewport, RI 60107;67-4072347;44-1513440;Maroon;1423;20/01/1906;Mandatory tertiary contingency;43154333;Martha;3-38720I;Anthony-French;Gonzalez;15;2507;493;Group; 66-1348533;96919224;9,78064E+12
67674 Samuel Island Apt. 355 East Danafurt, AK 18331;10-6958725;94-5686594;Chocolate;1901;11/04/1921;Multi-layered methodical benchmark;71655499;Jack;68-T195;Ramirez Ltd;Gates;1;1901;182;LLC; 25-5566174;5994267;9,78147E+12
21836 Christine Land Suite 168 Olsonport, HI 39815;11-0377323;05-1530815;Snow;111;09/11/1926;Inverse reciprocal interface;14087363;Jessica;279-JTG;Cooper LLC;Morton;20;7314;98;Group; 31-0359640;70755893;9,78145E+12
418 Olsen Ferry Suite 161 Donovantown, IL 17396;52-3775066;44-3808349;Chocolate;2310;02/10/1906;Programmable web-enabled emulation;19683195;Theresa;XMS 143;Rodriguez-Gibson;Long;49;4084;527;LLC; 01-0912107;58802519;9,7817E+12
5532 Lisa Mills Suite 141 Patricialand, DC 61487;92-0834817;27-1447003;DeepPink;4069;12/03/1928;Versatile zero administration benchmark;22277923;Amy;0WP5336;Smith-Jenkins;Johnson;12;8503;400;LLC; 32-8658715;35016847;9,78189E+12
218 James Branch Apt. 641 Christineton, TN 28502;77-0643829;68-9384199;DodgerBlue;3548;10/10/1909;Innovative tertiary framework;52504020;Adam;6Y 76950;Sanders-Reed;Martinez;43;1510;237;Inc; 02-7096581;23211803;9,78022E+12
37240 Wallace Valleys Ashleyland, KS 50958;95-9233476;05-5827591;BlanchedAlmond;6208;02/09/1978;Advanced dedicated array;50682126;Kimberly;450 DVU;Simmons, Hodge and Cooper;Miller;31;6665;110;and Sons; 95-6011485;2919539;9,78181E+12
USNS Riley FPO AP 63381;40-1455076;55-3301382;NavajoWhite;428;11/12/1916;Multi-lateral even-keeled software;10415832;Ashley;ZEB 054;Mccormick, Lynch and Wilson;Jacobson;35;9252;392;LLC; 02-5649673;54859296;9,78021E+12
17540 Clarence Shore Suite 509 New Sarahfort, NJ 38013;86-1948517;36-8398751;Black;2494;13/11/1926;Open-architected fault-tolerant monitoring;77139665;David;IWX-6865;Barnes Group;Thomas;33;2908;569;PLC; 54-2708999;83810800;9,78139E+12
00069 Robert Crossing Suite 940 New Ariel, UT 01713;77-3642630;60-7094766;DarkMagenta;7115;03/04/1962;Re-engineered cohesive installation;12090440;Julie;7-09000T;Phillips Group;Delacruz;25;6783;239;PLC; 74-4846385;43859115;9,78104E+12
993 Rebecca Estates Suite 207 Kristinside, CT 24093;35-0205520;63-8127894;PaleGreen;3527;17/02/1970;Down-sized eco-centric framework;85200579;John;18V•935;Hall-Pena;Sexton;27;929;283;PLC; 60-5379208;35491224;9,78062E+12
PSC 7869, Box 2266 APO AA 04014;42-3019987;41-7921764;SteelBlue;278;24/03/1939;Extended contextually-based projection;21282843;Lindsey;37-FM41;Ramos Ltd;Ramirez;42;6613;254;Group; 90-3186934;85006041;9,7815E+12
785 Jasmine Isle East Benjaminborough, UT 94563;63-6504170;43-7706953;ForestGreen;1990;28/02/1952;Versatile exuding ability;66156130;Robert;3 893 253;Johnson Inc;Sanchez;19;8281;298;and Sons; 23-4583802;54200876;9,78003E+12
909 Robert Station Suite 901 Robertland, MO 87053;24-1697303;46-2924964;Azure;5996;22/06/1947;Organized heuristic workforce;36066704;Jennifer;QFP Q91;Meyer, Bullock and Adams;Kim;26;3259;355;Inc; 31-4810162;65203491;9,7803E+12
9152 Montoya Prairie Apt. 056 Port Suzannemouth, MA 56988;16-8324224;63-3708469;Green;5288;20/10/1944;Streamlined responsive implementation;2295138;Adam;XPJ-944;Carlson Group;Edwards;17;6993;233;Group; 82-0754027;71822273;9,78047E+12
7457 Kirk Loop Kimton, NH 98786;02-8528910;51-1382655;LightGray;3876;28/10/1991;Ameliorated encompassing superstructure;75490898;Sierra;2684 GX;Anderson-Delgado;Merritt;11;4165;563;Inc; 92-1720995;91966278;9,78021E+12
68223 Tasha Circles Apt. 646 Aaronborough, SD 71200;33-1450045;53-5490662;MediumOrchid;5348;29/01/2003;Implemented logistical core;8059772;Kathryn;351MGF;Stanley-Hamilton;Neal;22;1063;42;Inc; 39-6596597;86170673;9,78195E+12
796 David Shoal South Natashashire, KS 20170;44-3646544;63-3298074;Gray;7228;19/06/1952;Configurable homogeneous infrastructure;83941313;David;855 BUU;Wilson, Smith and Butler;Rogers;48;4249;318;Ltd; 50-7630166;90830129;9,78139E+12
7843 Curry Plains Apt. 185 Mcbrideport, VT 37404;66-0874920;20-6096580;Magenta;2374;11/12/1984;Expanded tangible toolset;57423043;Sara;721Y;Tate-Bennett;Mullen;4;5620;84;Group; 45-6348186;28345572;9,78009E+12
67359 Michelle Wall New Nathanielview, HI 19498;91-6969427;88-4931947;Azure;7630;25/06/1964;Intuitive optimizing functionalities;86240420;Carolyn;RR 9610;Tran, York and Prince;Cortez;48;7654;419;Ltd; 88-2479830;69051340;9,78176E+12
8067 Kerry Stream Ryanshire, AK 55291;50-5019714;93-0101882;Magenta;5033;17/03/1942;Optimized maximized product;45397509;Thomas;497 CNB;Mitchell and Sons;Shaw;27;5969;571;and Sons; 72-2282464;30703193;9,78164E+12
69888 Paige Mountain South Joseph, MD 14804;72-2943359;25-3188759;Orchid;3853;14/08/1958;De-engineered exuding capacity;65752043;Robert;L31 3UK;Stark, Aguilar and Forbes;Cortez;41;1372;207;Group; 34-5766165;16956018;9,78045E+12
37045 Edwards Neck North Jameston, MD 65708;75-2322975;26-4291122;AliceBlue;7267;13/12/1942;Customizable non-volatile architecture;70319163;Christopher;LQM 059;Coleman, Sosa and Cooper;Smith;1;7468;423;and Sons; 73-2741167;94278491;9,78142E+12
20424 Margaret Valley Liland, NY 87465;67-6532310;88-0758286;DarkGray;4708;13/04/1905;Monitored empowering toolset;48249409;Brenda;161GIR;Porter-Mann;Pierce;25;3142;197;Inc; 12-2327329;82000837;9,78067E+12
69301 Curtis Isle West Kevinview, NC 15677;80-7851680;35-6139716;MintCream;6192;31/05/2009;Open-architected static customer loyalty;50873951;Jesse;PRR 822;Owens-Cunningham;Stone;36;8706;495;LLC; 81-9902311;89976906;9,78137E+12
02036 Pearson Crossroad Joshuaton, MO 95003;71-5802450;42-7006346;OliveDrab;401;02/11/1928;Reduced full-range analyzer;68799175;Michael;595-WRV;Walton-Peters;Coleman;45;8710;53;Ltd; 02-0738250;55983334;9,7813E+12
PSC 1239, Box 6575 APO AP 04007;37-1186900;55-0849917;DarkTurquoise;7778;27/08/1936;Persistent empowering definition;44216818;Sara;692UQL;Kelly, Gonzalez and Patton;Wilson;29;6856;534;Inc; 68-4107205;63281026;9,7814E+12
6353 Jennifer Dam Hamiltonfort, IL 52962;73-4456685;42-2045230;Ivory;3592;14/04/1950;Customizable intermediate circuit;94769425;Nicholas;15OA1;Pham-Mason;Cruz;35;7213;110;Group; 13-6299267;35209676;9,78079E+12
153 Michael Burgs Lake Christopher, UT 87512;64-9021903;95-1679457;Wheat;3979;04/11/1954;Expanded maximized process improvement;42111429;Peggy;858 TBN;Johnson Ltd;Allen;31;3530;30;and Sons; 22-7425943;49042825;9,78112E+12
948 Mullen Loop New Zachary, OK 96261;01-4202473;63-5041056;MediumTurquoise;2515;20/06/1970;Universal 5thgeneration moderator;77179616;James;QW 87562;White and Sons;Krause;15;7703;432;Ltd; 16-7936114;96309889;9,78061E+12
28642 Taylor Alley Suite 188 Lake Teresa, CA 71819;52-1383846;93-0935774;MediumSpringGreen;4448;13/11/1932;Cloned optimizing adapter;75499334;Pamela;DJ 8220;Villarreal, Turner and Burnett;Yoder;35;6580;419;LLC; 77-3810367;72671849;9,78128E+12
72661 Jonathan Freeway Suite 198 Shannonbury, MI 32239;82-4531290;88-8056002;LightSteelBlue;4685;22/03/1916;Reverse-engineered background definition;30631595;Christine;170-MVJ;Martin, Bailey and King;Lane;16;3119;208;Inc; 44-3025551;3271506;9,78161E+12
6905 Caroline Mission Kristystad, MI 58105;56-2477710;91-0852999;MediumSpringGreen;7352;30/11/1940;Optional non-volatile matrices;30790155;Robert;90-SH70;Lawrence-Stevens;Macdonald;30;5600;142;Inc; 48-0129406;50610716;9,78058E+12
75424 Paige Ferry Theresatown, NJ 91356;12-9138680;41-6595433;OldLace;1124;22/08/1955;Open-source didactic Internet solution;95591339;Robert;167 MLO;Bennett Inc;Garcia;6;2296;336;Inc; 80-2037076;21083334;9,78067E+12
3988 Stacy Pines Apt. 865 South Catherinebury, AZ 05805;46-4611785;27-7299508;Red;1242;04/01/1917;Grass-roots human-resource implementation;6650537;James;522 NZV;Hoover-Green;Weaver;14;9375;581;and Sons; 54-4924771;68606138;9,78087E+12
03191 Samantha Station Kathyfurt, CO 13282;93-1854515;22-1374404;White;4602;11/07/1976;Virtual well-modulated benchmark;10610466;Andrew;49H•198;Torres-Taylor;Lopez;31;1725;328;LLC; 67-9685805;14662492;9,78067E+12
261 Ortiz Manors Apt. 471 West Jocelyn, MA 55321;91-8231741;61-5034108;DarkRed;7717;06/05/1980;De-engineered eco-centric moratorium;48549837;Blake;GAX T41;Anderson, Young and Perkins;Warner;14;8797;103;Ltd; 26-6998310;86861991;9,7818E+12
861 Peters Throughway Suite 767 East Donnamouth, SC 51919;38-7989067;37-4058122;Purple;3734;03/09/1959;Seamless neutral core;92550421;Michael;681 0DK;Kelly-White;Doyle;37;4469;504;and Sons; 53-3503500;24925891;9,78183E+12
02642 Alexander Lodge Joseport, TN 70553;43-6306547;61-3475234;GoldenRod;7956;29/03/1995;Optimized non-volatile product;79599009;Natalie;FJU 788;Schmitt, Fernandez and Johnson;Jefferson;2;2776;336;Group; 45-5582485;17824194;9,78038E+12
8702 Sanchez Flats Cameronton, IA 81119;48-7426741;03-6601940;Moccasin;1672;05/03/1927;Right-sized homogeneous service-desk;88764955;Ashley;956 9MU;Smith LLC;Garza;34;6276;188;Inc; 63-9143748;809443;9,78142E+12
89507 Jennifer Street Apt. 035 Blakeberg, NE 69132;87-2599523;99-8982392;MediumAquaMarine;4922;07/11/1945;Versatile object-oriented standardization;51334369;Laura;197 RX2;Sanders-Gomez;Taylor;6;3019;537;Inc; 41-4749046;88295503;9,78116E+12
4345 Donaldson Bypass Port Seanland, HI 90147;71-1760713;99-6192728;Teal;6542;19/07/1968;Seamless even-keeled neural-net;69173189;Ronald;309 EUB;Flores, Evans and Landry;Gray;47;3493;212;Inc; 88-3374615;9479692;9,78085E+12
8820 Fields Harbor Wagnerstad, KY 48612;46-0731203;02-7735878;LightCoral;5022;14/07/1951;Advanced didactic toolset;12625826;Leah;C57 4HH;Miller PLC;Spencer;28;4211;108;Inc; 64-2729166;76251238;9,78073E+12
USNV Thornton FPO AP 50548;54-0554995;64-7593440;Brown;5593;11/06/1906;Business-focused actuating adapter;95378688;Glenn;4ED Y86;Frank-Gonzales;Williams;10;5400;168;Inc; 30-0179311;27334454;9,78128E+12
323 Payne Ferry Port James, KY 48265;34-5471250;61-7459331;DarkOliveGreen;736;28/12/1911;Reduced interactive algorithm;72622872;Timothy;HBC 666;Palmer-Myers;Lewis;43;4212;43;Inc; 27-8603231;31555968;9,78093E+12
7506 Tyler Extensions Suite 209 New Heather, MN 17380;10-4705404;50-4284967;Wheat;4789;01/10/2018;Enterprise-wide zero tolerance structure;88812526;Tony;XI-3804;Chavez-Marshall;Johnson;17;7919;161;PLC; 74-9904753;7811630;9,78183E+12
3027 Sosa Divide Suite 790 Smithbury, TX 40474;61-5895753;68-1002785;Plum;7390;02/02/1955;Triple-buffered encompassing process improvement;66261179;Suzanne;037-ILY;Barker Inc;Walker;34;1103;485;and Sons; 35-8122574;12525737;9,78172E+12
056 Rodriguez Knoll Suite 651 Port Robert, DC 55336;81-8528722;52-6027425;Purple;2749;22/01/1944;Switchable clear-thinking methodology;26338781;Kimberly;763ZBG;Martinez, Martinez and Morgan;Tran;7;5938;41;LLC; 11-5636354;38032318;9,78033E+12
5195 White Mountain East Rebekah, TN 90628;34-9906253;51-4177030;DarkTurquoise;2660;11/09/1999;Persistent context-sensitive capacity;19958;Garrett;1KCF 87;Chavez, Kennedy and Swanson;Mcbride;18;2213;599;Inc; 61-2037761;32699241;9,78122E+12
46226 Megan Orchard East Masonberg, MO 15300;46-7566844;03-8369918;LightCoral;1913;09/07/1964;Virtual optimal approach;29022670;David;4 375 580;Miller, Allison and Smith;Stephenson;13;6268;444;Ltd; 15-0944435;24131926;9,78033E+12
7494 Carlson Forks Apt. 306 Haileyfort, RI 22067;12-6118992;04-1045691;LavenderBlush;7120;21/12/1984;Customer-focused modular encryption;10741320;Mary;2MQ 039;Taylor-Gross;Sandoval;49;3583;445;LLC; 25-4001096;96536155;9,78167E+12
0946 Jeremy Plains Suite 669 Stephenstown, AK 77748;93-7534808;16-1259252;GoldenRod;3100;04/12/1927;Vision-oriented heuristic migration;2836157;Norman;NUE-892;Mitchell Inc;Myers;9;4141;148;PLC; 81-3482059;56112610;9,78002E+12
5406 Karen Vista Lake Brandon, NY 50054;99-6521379;46-3673343;Lavender;6499;14/02/1979;Right-sized multi-tasking hub;3428559;Elizabeth;RKG 262;Armstrong LLC;Thompson;1;6524;307;PLC; 59-3494867;78542143;9,78182E+12
962 Brandon Villages Apt. 224 Smithtown, RI 02328;71-3466395;98-0398439;FloralWhite;2484;26/07/1976;Profound user-facing info-mediaries;26409504;Mercedes;UKA5539;Chavez-Baker;Johnson;25;1252;313;LLC; 65-5850472;17539210;9,78157E+12
667 Troy Ports North Josephtown, OH 35907;31-3977211;92-6950890;LightSeaGreen;5279;08/08/2002;Centralized multi-tasking model;73546856;Jeremy;ZFZ 415;White-Walker;Reese;46;2067;99;and Sons; 83-0130032;31739511;9,78175E+12
1063 Garrett Highway Suite 134 New Laurieville, TX 18474;66-7278075;71-0289129;Cyan;1292;21/07/1982;Triple-buffered 6thgeneration firmware;75409296;John;81-41804;Anderson-Smith;Conley;35;9024;587;PLC; 54-1415861;7821899;9,78032E+12
381 Williams Knoll Alexandraview, VA 14899;50-3925841;88-7613943;SeaShell;3961;02/09/1923;Visionary encompassing customer loyalty;40957814;Alicia;ASM-0357;Harris-Stewart;Freeman;17;7634;546;Ltd; 85-0442984;9801905;9,78097E+12
45690 Jordan Roads Apt. 463 Nunezhaven, DC 01807;42-4828754;92-7485723;Green;2176;11/01/1988;Extended foreground secured line;11408512;Sharon;013 DVE;Brown, Chen and Avila;Mccarty;44;4076;526;LLC; 36-8656839;6448875;9,78127E+12
22973 Hancock Key Suite 257 Sandrashire, MN 16783;04-0265396;52-9702089;Azure;586;17/02/1970;Synergized foreground architecture;7640421;Mackenzie;KLT 356;Garcia Ltd;Hernandez;38;8386;254;Inc; 20-4881769;386302;9,78134E+12
42495 Sullivan Land Suite 851 Warrenbury, GA 37258;61-9685324;57-3292907;GhostWhite;5285;11/07/1908;Profound asynchronous application;81044825;Jason;75-3189M;Blackwell-Sheppard;Palmer;50;1272;490;PLC; 36-6387422;29842704;9,78184E+12
PSC 2963, Box 1608 APO AE 39490;44-9451684;51-8061512;DarkGreen;4912;04/07/1922;User-centric modular framework;27480779;Ryan;KYX 739;Booker and Sons;Mcbride;2;5824;475;PLC; 26-2114682;22432964;9,78093E+12
3380 Patel Junction Port Michael, CT 33253;13-0495262;48-0879555;LawnGreen;7179;04/10/1989;Automated real-time open architecture;49414837;Paul;IJV-391;Christian-Welch;Luna;3;975;381;Group; 40-6845381;68786717;9,78162E+12
72013 Jefferson Locks Vanessafurt, DC 81157;64-1370451;44-2700439;LightSalmon;1196;07/03/1927;Centralized actuating strategy;36288120;Randall;7QTD379;Chapman and Sons;Pena;19;9381;407;and Sons; 22-7609170;26066196;9,78156E+12
933 Aaron Ranch Apt. 622 Stonechester, MO 75727;54-6481911;43-3275418;Violet;7507;30/03/1964;Devolved background website;65048443;Richard;9-34893;Strickland Group;Davidson;33;8369;155;LLC; 81-4065339;6460440;9,78144E+12
88253 James Spur Apt. 539 Stevenland, MO 57091;27-3749014;95-4811056;Violet;1525;31/01/1937;Robust dynamic neural-net;77217288;Priscilla;05G H69;Terry Inc;Tucker;37;8495;585;Ltd; 12-2060216;84245182;9,78184E+12
74088 Rice Mountain Suite 120 Timothyland, KY 80808;55-8308570;50-0282161;NavajoWhite;6529;16/02/1949;Right-sized national moratorium;9209978;Jessica;3T 6O6QUS;Bennett-Brown;Park;15;2242;360;Ltd; 85-5701666;47108899;9,78161E+12
8939 Alexandra Track New Edwin, AZ 52659;14-8194970;03-6617902;Snow;2150;02/02/1929;Reduced transitional orchestration;75067465;Logan;8-8139G;Adams-Smith;Acosta;32;7723;163;LLC; 94-1589056;76954719;9,78133E+12
943 Knapp Junction Suite 553 Davidton, ND 39669;76-5603669;65-4381322;ForestGreen;1135;05/10/1962;Upgradable clear-thinking monitoring;70117622;Jason;65GJ768;Weeks-Ramirez;Bryant;23;7573;104;Inc; 30-0170469;86453271;9,78093E+12
PSC 3557, Box 2130 APO AP 25410;88-2318041;25-4938816;LimeGreen;1440;04/08/1981;De-engineered cohesive focus group;50161119;Julie;8B991;Collins, Mccall and Alexander;Lewis;40;2113;178;Ltd; 66-3821218;45897689;9,78176E+12
8748 Baldwin Shoals Hollandport, TN 26696;91-6719684;92-3313196;NavajoWhite;2441;06/03/1980;Profit-focused optimizing system engine;52976742;Sara;086-BSH;Jones-Garcia;Spencer;7;9499;449;LLC; 10-6350851;12842797;9,78164E+12
99260 Matthew Roads Escobarport, MO 49371;86-6078031;04-4301433;MediumTurquoise;6025;28/04/1907;Versatile user-facing workforce;67731152;Cindy;6-7227G;Alvarez-Navarro;Craig;11;3412;321;Inc; 47-1750507;40822389;9,78079E+12
9877 Jackson Ferry Apt. 283 Matthewhaven, UT 87572;68-3960602;63-7269791;Gold;4297;11/05/1976;Implemented non-volatile emulation;25378474;Craig;2 259 602;Phillips-Campbell;Gonzales;22;1512;71;PLC; 24-0825388;77634313;9,78064E+12
495 Brandon Station Suite 130 New Jeremiah, MN 90017;90-6364544;55-9110623;PaleGoldenRod;1047;18/09/1953;Exclusive uniform policy;12516216;Melissa;355 WSU;Clark, Lyons and Hill;Acosta;7;1933;549;PLC; 60-0357969;53815903;9,78157E+12
Unit 5738 Box 2473 DPO AE 04735;90-3557581;20-9043857;Magenta;3319;04/03/1908;Assimilated 24hour challenge;81710836;Mary;HQV 469;Reeves, Sampson and Murray;Rodriguez;31;1250;438;Group; 73-6302472;88524979;9,78122E+12
38717 Young River Jennaville, WA 59479;37-8275853;26-6752972;FloralWhite;6664;05/01/1968;Extended background frame;21933899;Anthony;FSH-4985;Buck-Maxwell;Branch;49;8001;401;LLC; 76-3563260;37338497;9,7805E+12
82044 Figueroa Ways Apt. 360 Port Joel, NV 01008;13-5326942;03-6163838;Lime;5185;20/09/2009;Automated bottom-line hardware;91943828;Deanna;FJK-1305;Obrien Inc;Bailey;18;2890;469;Ltd; 25-6051621;50455850;9,78139E+12
61698 Wilson Centers Apt. 602 New Kevinshire, AZ 21906;26-1924341;04-4272894;Peru;1542;23/04/2007;Triple-buffered stable productivity;26155197;Michael;ZXB-8956;Hansen, Middleton and Jones;Ferguson;9;1187;475;Group; 43-6262380;76054372;9,78144E+12
46826 Lisa Way Holmesfort, IN 93146;81-5196405;74-2268823;AntiqueWhite;5697;25/04/1956;Integrated bottom-line moderator;60303578;Tiffany;9AA 857;Decker Inc;Caldwell;41;1973;566;and Sons; 75-5106672;58019177;9,78153E+12
521 Carter Greens Suite 280 South Abigailtown, ME 08417;75-5386527;16-7285938;DimGray;406;29/01/1960;Decentralized mission-critical methodology;98805792;Patricia;DYF 277;Smith and Sons;Welch;8;5258;578;Ltd; 95-9166509;804042;9,78167E+12
842 Henry Meadows Apt. 714 Brittanyborough, OR 74403;88-4288924;46-9198888;Tan;2722;14/06/1962;Open-source incremental frame;35183358;Tanya;KYB 5576;Bryant-White;Mora;26;7113;594;Ltd; 90-8282201;94827330;9,7816E+12
0835 Kristin Vista Apt. 957 North Kristinshire, CA 51231;86-3946968;52-1613638;LightSalmon;3236;06/11/2000;Stand-alone heuristic interface;56293159;Sheena;849FYI;Sparks, Davis and Lopez;Pierce;36;1126;279;PLC; 65-0456963;85252196;9,78094E+12
USS Gregory FPO AP 88034;94-6586566;94-2553825;LightSlateGray;2111;02/12/1931;Balanced fresh-thinking matrix;39871275;Timothy;7UK R07;Williams Inc;Morgan;46;5668;494;Group; 62-2724025;47013148;9,78134E+12
10393 Elizabeth Mills Duncanchester, MA 06088;46-9870065;81-8487282;PaleVioletRed;6820;10/04/1917;Triple-buffered reciprocal conglomeration;71153452;Sarah;4AE 128;Diaz Group;Hunter;10;7303;485;PLC; 68-1868957;8247377;9,78197E+12
194 David Walk Apt. 631 New Stephanie, KS 15394;40-6608719;72-5686476;LightCyan;6419;27/10/1970;Multi-tiered cohesive algorithm;78288157;Cameron;XIU N24;Zimmerman, Stokes and Garrison;Francis;17;1363;318;LLC; 61-5639246;18010732;9,78093E+12
Unit 8333 Box 2862 DPO AA 52262;53-6557069;14-2567275;LightSteelBlue;7435;30/11/1951;User-friendly optimizing customer loyalty;50740079;Ashley;2Y781;Floyd and Sons;Wilson;37;5855;294;PLC; 60-4271369;4945420;9,78186E+12
61646 Christine Trace Suite 293 New Nicole, TX 76781;22-6419686;32-8633641;Salmon;7236;10/05/1962;Fully-configurable 24/7 policy;49454635;James;22X 084;West, Keller and Hatfield;Ortega;2;4388;103;PLC; 06-8223045;27775141;9,78122E+12
372 James Drives Suite 144 Jessicabury, AR 55014;32-4577386;40-8526842;SeaShell;7906;25/04/1974;Phased dynamic toolset;1902563;Lisa;3SI 851;Barnes, Benton and Mcdaniel;Brown;40;9484;201;PLC; 34-3057418;427814;9,78189E+12
9083 Preston Drives Suite 336 New Cassidychester, KY 64582;37-4858130;67-6633380;LightGoldenRodYellow;3686;02/07/1905;Organic motivating benchmark;67296187;Carrie;9HD98;Chung and Sons;Allen;18;3951;37;Inc; 63-5373552;61881310;9,78012E+12
9902 Carr Prairie Suite 294 Hernandezview, LA 94966;25-0225943;13-8238147;SeaShell;3758;16/11/2017;Up-sized multi-state info-mediaries;24449649;Joshua;ZVC 943;Lindsey, Vance and Young;Anderson;43;1263;389;and Sons; 54-4387239;13915230;9,78179E+12
83901 Mark Neck Carlsonton, NV 78870;44-0812625;94-6707768;Maroon;752;07/05/1904;Switchable didactic knowledge user;5964086;John;1IIS 05;Ward Inc;Brown;27;6674;344;Group; 90-4138534;52229039;9,78039E+12
USS Walters FPO AA 37668;20-0922432;06-2717381;Gainsboro;5783;28/06/1952;Exclusive client-driven policy;33754451;Sean;638-896;Shelton, Rojas and Dillon;Cooke;4;2004;409;Ltd; 99-9896320;79033565;9,78181E+12
036 Compton Plaza Wallsberg, DC 93528;01-5471434;33-0428777;MediumPurple;6248;12/02/1983;Universal optimal orchestration;81230136;Whitney;14CV6;Rogers Ltd;Arroyo;44;6722;208;PLC; 44-9898928;33029344;9,78037E+12
8824 Lynn Harbor Parkerview, OH 90715;55-0067770;01-1625425;Aqua;6644;14/11/1934;Exclusive foreground process improvement;3548370;Kristy;GJK 700;Grimes, Benton and Shields;Cooke;35;3106;484;Group; 75-4586978;83838576;9,78116E+12
1506 Bruce Gardens Suite 193 Greentown, OR 36803;61-7640077;94-1798660;MediumBlue;3256;02/11/1976;Advanced even-keeled parallelism;39702784;Christy;G26-ODL;Fernandez, Harris and Thomas;Robinson;20;6162;374;Inc; 77-8443094;52503856;9,78185E+12
185 Megan Brook Apt. 873 North Amanda, SD 36649;10-2754279;58-4805378;Turquoise;4669;25/11/1924;Multi-tiered real-time help-desk;96575406;Paul;10FR821;Smith, Rowe and Ferguson;Oliver;13;2120;104;Ltd; 33-8279801;79664844;9,78121E+12
80119 Daniel Garden Suite 962 Josephview, WY 43728;15-4805797;06-4124534;Ivory;5977;08/01/1942;Progressive real-time task-force;29230747;Jesse;7C AG124;Buchanan-Stewart;Calderon;25;3903;460;and Sons; 77-1422637;9256088;9,78095E+12
6124 Thomas Mountains Suite 929 Lake Tiffanyshire, AL 60794;65-3422370;73-6059706;LightGreen;5666;09/08/1983;Versatile hybrid info-mediaries;81404971;Ryan;IH6 1281;Gonzalez Group;Spencer;33;4043;39;Group; 22-5074909;70571639;9,7814E+12
4172 Veronica Lock Heatherborough, TX 19009;63-9060534;72-7140632;DarkOrchid;786;22/11/1957;Down-sized mission-critical array;43250721;Shelby;UHX 138;Jennings and Sons;Farley;23;8299;517;LLC; 38-2578928;31632812;9,78008E+12
4579 Ross Dam Suite 055 Port Franciscoland, IL 93887;52-4965148;51-4554368;Tomato;7055;02/08/2004;Compatible static product;71641218;Bill;2DYM997;Black, Rogers and Foley;King;7;7690;212;PLC; 56-0452200;84246165;9,78044E+12
8992 Sanders Prairie West Stevenchester, WI 60068;26-6817443;02-7679969;MediumSlateBlue;1566;09/12/1904;Diverse exuding architecture;1465600;Amanda;3-K2477;Daugherty Group;Taylor;48;6595;438;Ltd; 93-0132719;23366244;9,78075E+12
4023 Abigail Junctions Monicachester, ME 90970;48-1266643;39-9546124;MediumSlateBlue;3548;15/04/1907;Self-enabling mission-critical Graphic Interface;99733384;Michael;7HQ E95;Cisneros-Paul;Armstrong;16;4501;292;Ltd; 77-7965648;6354183;9,78109E+12
627 Jones Plaza Justintown, AR 10553;92-1185529;05-1726640;LightSkyBlue;6546;04/05/1948;Future-proofed bottom-line matrices;28684411;Derrick;MOS 825;Wallace, Sims and Orr;Cobb;38;3521;474;Group; 42-4784392;81011506;9,78057E+12
982 Sanders Rapid Apt. 814 Jameschester, CO 06705;88-8825014;27-6194173;Lavender;3344;30/05/1935;Proactive impactful paradigm;16591493;Diana;0-87577;Miller-Brown;Robles;44;6056;234;LLC; 62-3652072;275590;9,78124E+12
