%YAML 1.1
%TAG !u! tag:unity3d.com,2011:
--- !u!78 &1
TagManager:
  serializedVersion: 2
  tags: []
  layers:
  - Default
  - TransparentFX
  - Ignore Raycast
  - 
  - Water
  - UI
  - 
  - 
  - 
  - 
  - Ground
  - Movable Object
  - 
  - 
  - 
  - 
  - 
  - Invisible Wall
  - 
  - 
  - Player
  - Enemy
  - PlayerBullet
  - EnemyBullet
  - 
  - InstantKill
  - 
  - 
  - 
  - 
  - 
  - 
  m_SortingLayers:
  - name: Default
    uniqueID: 0
    locked: 0
  - name: Background
    uniqueID: 880143323
    locked: 0
  - name: Ground
    uniqueID: 2568255531
    locked: 0
  - name: Obstacles
    uniqueID: 3633833201
    locked: 0
  - name: Enemy
    uniqueID: 3827948401
    locked: 0
  - name: Bullet
    uniqueID: 789948397
    locked: 0
  - name: Player
    uniqueID: 1293374623
    locked: 0
  - name: Particles
    uniqueID: 3824902845
    locked: 0
