start_lockup,end_lockup
2022-03-04T14:33:00,2022-03-20T19:33:00
2022-03-29T21:33:00,2022-04-16T21:31:00
2022-04-22T17:45:00,2022-04-30T10:00:00
2022-05-05T23:10:00,2022-05-18T15:16:00
2022-05-28T23:16:00,2022-06-10T23:00:00
2022-06-30T20:00:00,2022-07-18T20:15:00
2022-08-01T18:00:00,2022-10-10T08:25:00
2022-10-17T13:00:00,2022-10-31T08:30:00
