Place,Name,Sex,Equipment,Division,BodyweightKg,WeightClassKg,Squat1Kg,Squat2Kg,Squat3Kg,Best3SquatKg,Bench1Kg,Bench2Kg,Bench3Kg,Best3BenchKg,Deadlift1Kg,Deadlift2Kg,Deadlift3Kg,Best3DeadliftKg,TotalKg,Event,BirthDate
1,Deedee Hu,F,Raw,FR-Jr,50.7,52,75,80,85,85,-45,52.5,-57.5,52.5,85,92.5,100,100,237.5,SBD,
1,Benedetta Lupattelli Gencarelli,F,Raw,FR-Jr,65.4,69,125,130,-135,130,-60,-65,67.5,67.5,145,152.5,157.5,157.5,355,SBD,
2,Caitlin Dominy-Lewis,F,Raw,FR-Jr,68.6,69,95,105,110,110,67.5,-72.5,72.5,72.5,100,112.5,120,120,302.5,SBD,
G,Louise Badger,F,Raw,FR-Jr,84.9,84+,-95,95,-105,95,-45,45,-47.5,45,110,115,120,120,260,SBD,
1,Nichola Bagguley,F,Raw,FR-M1,64.2,69,75,80,85,85,42.5,47.5,-52.5,47.5,105,110,117.5,117.5,250,SBD,
1,Kellie Sweeney,F,Raw,FR-M2,97.6,84+,-70,-70,75,75,42.5,45,-47.5,45,100,107.5,112.5,112.5,232.5,SBD,
1,Abbie Darby-Beddall,F,Raw,FR-O,56,57,-115,115,117.5,117.5,67.5,72.5,-75,72.5,140,150,-160,150,340,SBD,
2,Becca Kirkpatrick,F,Raw,FR-O,55.5,57,107.5,115,120,120,67.5,-72.5,-72.5,67.5,130,135,142.5,142.5,330,SBD,
3,Rachel Pawson,F,Raw,FR-O,53.8,57,87.5,92.5,97.5,97.5,55,60,65,65,110,115,120,120,282.5,SBD,
1,Sarah Henton,F,Raw,FR-O,67.9,69,90,-92.5,92.5,92.5,50,52.5,-55,52.5,120,122.5,125,125,270,SBD,
1,Laura Kutilkova,F,Raw,FR-O,74,76,125,-135,-137.5,125,65,67.5,-70,67.5,145,155,162.5,162.5,355,SBD,
1,Babongile Ndiweni,F,Raw,FR-O,82,84,95,-105,105,105,57.5,60,62.5,62.5,110,120,-127.5,120,287.5,SBD,
1,Sade Nashana Antonio-Patterson,F,Raw,FR-O,85.6,84+,120,125,130,130,75,80,85,85,150,160,167.5,167.5,382.5,SBD,
2,Daisy Curtis,F,Raw,FR-O,96.3,84+,95,110,120,120,55,60,-67.5,60,117.5,125,132.5,132.5,312.5,SBD,
1,Rhiannon Morris,F,Raw,FR-Sj,67.5,69,65,-72.5,72.5,72.5,32.5,40,-47.5,40,72.5,82.5,90,90,202.5,SBD,
1,Natalia Drozd,F,Raw,FR-Sj,97.4,84+,110,120,125,125,45,50,52.5,52.5,135,145,-150,145,322.5,SBD,
1,Lynda Kriston,F,Raw,FR-O,82.1,84,,,,,55,60,-65,60,,,,,60,B,
1,Dhanyaal Najabat,M,Raw,MR-Jr,65,66,150,160,-170,160,105,110,115,115,210,220,230,230,505,SBD,
1,Gabi Haver,M,Raw,MR-Jr,72,74,135,147.5,-160,147.5,85,90,-95,90,165,175,180,180,417.5,SBD,
2,Jacob Ellis,M,Raw,MR-Jr,70.8,74,120,132.5,145,145,80,90,-95,90,150,160,170,170,405,SBD,
3,Harvir Singh Cheema,M,Raw,MR-Jr,71.6,74,125,135,-145,135,62.5,67.5,72.5,72.5,130,140,145,145,352.5,SBD,
1,Joel-Bless Wilson,M,Raw,MR-Jr,83,83,185,200,212.5,212.5,115,120,127.5,127.5,230,245,260,260,600,SBD,
2,Adam Cronin,M,Raw,MR-Jr,82.2,83,177.5,190,200,200,112.5,117.5,122.5,122.5,225,240,252.5,252.5,575,SBD,
1,Edward Clarke,M,Raw,MR-Jr,91.5,93,190,200,-210,200,140,147.5,150,150,210,230,240,240,590,SBD,
1,James Head,M,Raw,MR-M3,138,120+,130,150,160,160,80,85,90,90,180,190,200,200,450,SBD,
1,Karl Barnett,M,Raw,MR-O,81.4,83,195,202.5,205,205,145,152.5,157.5,157.5,250,-260,-260,250,612.5,SBD,
2,Matthew Doyle,M,Raw,MR-O,81.2,83,180,190,-200,190,115,122.5,-127.5,122.5,210,220,225,225,537.5,SBD,
1,Ben Johnson #11,M,Raw,MR-O,92.1,93,205,215,222.5,222.5,140,145,-150,145,265,280,-300,280,647.5,SBD,
2,Tobias Rogers,M,Raw,MR-O,88.4,93,205,220,225,225,130,140,145,145,230,250,265,265,635,SBD,
3,Daniel Cronin,M,Raw,MR-O,86.9,93,172.5,182.5,190,190,125,130,-137.5,130,205,217.5,225,225,545,SBD,
DQ,Zachary Watson,M,Raw,MR-O,88.2,93,205,-215,-215,205,,,,,,,,,,SBD,
1,Peter Evans,M,Raw,MR-O,101.6,105,225,240,245,245,152.5,160,-165,160,270,285,300,300,705,SBD,
2,Ewan Williams,M,Raw,MR-O,101.4,105,217.5,230,240,240,162.5,170,-172.5,170,245,262.5,-275,262.5,672.5,SBD,
3,Jordaine Jones,M,Raw,MR-O,104,105,210,-222.5,222.5,222.5,165,-175,-175,165,262.5,282.5,-292.5,282.5,670,SBD,
4,Chris Smith #37,M,Raw,MR-O,100.3,105,185,192.5,-200,192.5,120,125,-130,125,240,250,255,255,572.5,SBD,
5,Aidan Rhodes,M,Raw,MR-O,96.2,105,150,157.5,162.5,162.5,110,115,120,120,210,217.5,227.5,227.5,510,SBD,
1,James Dabrowski,M,Raw,MR-O,114.6,120,227.5,232.5,240,240,125,130,-135,130,227.5,235,240,240,610,SBD,
2,Will Davy,M,Raw,MR-O,112.8,120,190,202.5,210,210,117.5,122.5,127.5,127.5,185,200,212.5,212.5,550,SBD,
1,Mohammed Zubair Hanif,M,Raw,MR-Sj,53,53,92.5,97.5,105,105,-57.5,62.5,65,65,135,150,160,160,330,SBD,
1,Alex James #2,M,Raw,MR-Sj,59,59,90,100,112.5,112.5,70,77.5,-80,77.5,100,120,130,130,320,SBD,
1,Sean Cadiz,M,Raw,MR-Sj,61.9,66,105,115,-122.5,115,67.5,72.5,-77.5,72.5,172.5,185,195,195,382.5,SBD,
1,Aidan Wells,M,Raw,MR-Sj,71.5,74,145,165,180,180,80,95,105,105,180,200,207.5,207.5,492.5,SBD,
2,Ben Townsend,M,Raw,MR-Sj,72.1,74,127.5,135,140,140,72.5,77.5,80,80,-132.5,140,145,145,365,SBD,
3,Anthony Dovaston,M,Raw,MR-Sj,72.7,74,95,105,112.5,112.5,60,67.5,-75,67.5,120,145,170,170,350,SBD,
1,Matthew Conley,M,Raw,MR-Sj,80.6,83,145,155,160,160,90,95,-100,95,185,195,200,200,455,SBD,
1,Callum Davis,M,Raw,MR-Sj,90.5,93,90,100,110,110,50,55,-57.5,55,120,127.5,135,135,300,SBD,
1,Hasan Amjad,M,Raw,MR-Sj,113.6,120,190,205,-220,205,-100,100,105,105,225,235,250,250,560,SBD,
2,Luke Jay Kendrick,M,Raw,MR-Sj,115.4,120,110,120,125,125,85,90,-100,90,130,140,155,155,370,SBD,
