Place,Name,Sex,Age,Equipment,Division,BodyweightKg,WeightClassKg,Squat1Kg,Squat2Kg,Squat3Kg,Best3SquatKg,Bench1Kg,Bench2Kg,Bench3Kg,Bench4Kg,Best3BenchKg,Deadlift1Kg,Deadlift2Kg,Deadlift3Kg,Deadlift4Kg,Best3DeadliftKg,TotalKg,Event,BirthDate
1,Darren Robertson,M,40,Wraps,M_MCR_1_ABPU,73.4,75,172.5,182.5,190.5,190.5,122.5,125,-127.5,,125,212.5,225,-235,,225,540.5,SBD,
1,Simon Morait,M,44,Wraps,M_MCR_1_ABPU,81.8,82.5,210,-225,225,225,120,125,130,,130,222.5,238,-245,,238,593,SBD,
1,Raivis Hofs,M,41,Wraps,M_MCR_1_ABPU,89.5,90,210,227.5,241,241,142.5,150,156,,156,220,240,-254,,240,637,SBD,
1,Jason Berrington,M,40,Wraps,M_MCR_1_ABPU,99.75,100,210,220,230,230,150,155,-157.5,,155,240,260,-265,,260,645,SBD,
2,Andrew Kearsey,M,41,Wraps,M_MCR_1_ABPU,92.9,100,175,180,187.5,187.5,110,117.5,122.5,,122.5,200,-215,-215,,200,510,SBD,
1,Chris Brown #2,M,40,Wraps,M_MCR_1_ABPU,109.3,110,-240,240,262.5,262.5,165,175,-182.5,,175,270,285,-295,,285,722.5,SBD,
2,Michael Blevins,M,43,Wraps,M_MCR_1_ABPU,105.65,110,235,250,,250,130,140,-145,,140,245,260,-265,,260,650,SBD,
3,Alex Brunskill,M,42,Wraps,M_MCR_1_ABPU,108.95,110,180,-210,210,210,120,130,-137.5,,130,220,235,-250,,235,575,SBD,
4,Ben Kovacs #2,M,41,Wraps,M_MCR_1_ABPU,109.3,110,170,180,190,190,90,100,-105,,100,200,210,220,,220,510,SBD,
1,Anthony Rees,M,43,Wraps,M_MCR_1_ABPU,121.1,125,255,265,-275,265,145,-155,-155,,145,270,285,-300,,285,695,SBD,
1,Martyn O'Connor,M,41,Wraps,M_MCR_1_ABPU,134,140,240,250,260,260,-120,130,,,130,260,270,280,,280,670,SBD,
1,Tom Warren #1,M,41,Wraps,M_MCR_1_ABPU,156.1,140+,295,-325,,295,200,207.5,-212.5,,207.5,285,295,300,,300,802.5,SBD,
DQ,Nicki Bush,M,45,Wraps,M_MCR_2_ABPU,108.5,110,-220,-240,-240,,,,,,,,,,,,,SBD,
1,Michael Burton #2,M,46,Wraps,M_MCR_2_ABPU,115.1,125,180,-200,200,200,115,125,130,,130,180,220,,,220,550,SBD,
DQ,Radoslaw Pakulski,M,48,Wraps,M_MCR_2_ABPU,166,140+,270,-300,,270,,,,,,,,,,,,SBD,
1,Colin Davies,M,50,Wraps,M_MCR_3_ABPU,108.6,110,185,192.5,200,200,110,115,120,,120,200,210,-217.5,,210,530,SBD,
1,Michael Burden,M,59,Wraps,M_MCR_4_ABPU,99.55,100,-170,-170,170,170,95,102.5,-107.5,,102.5,170,180,185,,185,457.5,SBD,
2,John Miller #1,M,58,Wraps,M_MCR_4_ABPU,95.8,100,155,165,-175,165,-85,85,-90,,85,170,185,-202.5,,185,435,SBD,
1,Mark Jones #2,M,59,Wraps,M_MCR_4_ABPU,108.8,110,185,197.5,205,205,125,130,-132.5,,130,180,200,205,,205,540,SBD,
1,Gary Mellor,M,66,Wraps,M_MCR_6_ABPU,64.05,67.5,-115,117.5,-127.5,117.5,50,55,62.5,,62.5,127.5,137.5,-142.5,,137.5,317.5,SBD,
1,John Dolan #2,M,68,Wraps,M_MCR_6_ABPU,97.95,100,135,145,152.5,152.5,-95,95,-102.5,,95,155,165,172.5,,172.5,420,SBD,
1,Neil Morgan #2,M,73,Wraps,M_MCR_7_ABPU,108.1,110,-110,-110,110,110,-85,95,-100,,95,150,-160,,,150,355,SBD,
1,Rob Todd,M,78,Wraps,M_MCR_8_ABPU,99.5,100,100,115,122.5,122.5,60,70,75,,75,140,150,160.5,,160.5,358,SBD,
1,Belchior Antonio,M,33,Wraps,M_OCR_ABPU,58.65,60,165,-175,175,175,100,105,-110,,105,195,215,220,,220,500,SBD,
1,Bradley Nortcliffe,M,28,Wraps,M_OCR_ABPU,67.15,67.5,180,200,-215,200,120,130,-135,,130,220,242.5,-250,,242.5,572.5,SBD,
1,Jordan Bowring,M,28,Wraps,M_OCR_ABPU,74.8,75,210,-222.5,222.5,222.5,110,115,,,115,230,250,-252.5,,250,587.5,SBD,
2,Darren Robertson,M,40,Wraps,M_OCR_ABPU,73.4,75,172.5,182.5,190.5,190.5,122.5,125,-127.5,,125,212.5,225,-235,,225,540.5,SBD,
3,Ismael Garzon,M,35,Wraps,M_OCR_ABPU,74.2,75,-170,175,182.5,182.5,107.5,-112.5,-112.5,,107.5,200,212.5,222.5,,222.5,512.5,SBD,
1,Kurtis Glenn,M,33,Wraps,M_OCR_ABPU,80.85,82.5,-255,255,-275,255,145,-150,-150,,145,262.5,272.5,282.5,,282.5,682.5,SBD,
2,Kamran Davies,M,25,Wraps,M_OCR_ABPU,78.1,82.5,210,220,-230,220,155,165,170,,170,270,280,-292.5,,280,670,SBD,
3,Mitchel White,M,34,Wraps,M_OCR_ABPU,81.8,82.5,220,230,245,245,135,145,-150,,145,215,230,240,,240,630,SBD,
4,Steve Dando,M,36,Wraps,M_OCR_ABPU,81.3,82.5,220,235,-240,235,125,-132.5,132.5,,132.5,225,235,240,,240,607.5,SBD,
5,Jake Allonby,M,26,Wraps,M_OCR_ABPU,80.5,82.5,-185,200,-210,200,110,115,120,,120,245,260,-265,,260,580,SBD,
6,Piotr Zietal,M,37,Wraps,M_OCR_ABPU,82.05,82.5,190,200,-205,200,-140,-140,140,,140,215,225,-230,,225,565,SBD,
7,Joshua Hawes,M,30,Wraps,M_OCR_ABPU,81,82.5,175,180,185,185,130,135,-140,,135,215,222.5,230,,230,550,SBD,
8,Alex Hulme,M,24,Wraps,M_OCR_ABPU,81.8,82.5,180,192.5,200,200,110,115,-122.5,,115,210,222.5,230,,230,545,SBD,
DQ,Marats Halilovs,M,34,Wraps,M_OCR_ABPU,81.35,82.5,200,-220,220,220,135,145,155,,155,-240,-250,-275,,,,SBD,
1,Paul Beattie,M,36,Wraps,M_OCR_ABPU,86.1,90,250,270,285,285,155,165,172.5,,172.5,270,290,305,,305,762.5,SBD,
2,Jake Cummings,M,31,Wraps,M_OCR_ABPU,88.25,90,240,260,275,275,170,185,-190,,185,260,280,-290,,280,740,SBD,
3,Subindra Shrestha,M,30,Wraps,M_OCR_ABPU,88.1,90,245,260,-275,260,160,-172.5,-172.5,,160,260,275,-290,,275,695,SBD,
4,Thomas Hughes,M,32,Wraps,M_OCR_ABPU,88.65,90,230,250,257.5,257.5,132.5,140,-142.5,,140,245,270,-275,,270,667.5,SBD,
5,Ashley Youle,M,28,Wraps,M_OCR_ABPU,89.2,90,235,250,-265,250,120,130,-135,,130,260,275,-290,,275,655,SBD,
6,Andre Sobol,M,24,Wraps,M_OCR_ABPU,86.55,90,200,210,220,220,130,140,-150,,140,210,230,240,,240,600,SBD,
7,Benji Parkinson,M,31,Wraps,M_OCR_ABPU,88.5,90,205,-215,-215,205,125,-130,-130,,125,230,-240,-240,,230,560,SBD,
1,Zac Wareing,M,25,Wraps,M_OCR_ABPU,92.5,100,250,265,275,275,162.5,170,175,,175,290,310,325,,325,775,SBD,
2,Phil Makurumure,M,28,Wraps,M_OCR_ABPU,99.15,100,265,275,280,280,160,165,167.5,,167.5,260,275,-277.5,,275,722.5,SBD,
3,Luther Nzinga,M,33,Wraps,M_OCR_ABPU,94.4,100,220,240,255,255,145,155,160,,160,260,280,-290,,280,695,SBD,
4,Ves Valchev,M,28,Wraps,M_OCR_ABPU,97.05,100,235,247.5,255,255,145,150,155,,155,255,270,280,,280,690,SBD,
5,Glenn Merry,M,31,Wraps,M_OCR_ABPU,98.6,100,225,245,260,260,150,155,160,,160,225,245,255,,255,675,SBD,
6,Ryan Cashmore,M,32,Wraps,M_OCR_ABPU,98.4,100,230,245,255,255,152.5,162.5,167.5,,167.5,225,245,-260,,245,667.5,SBD,
7,Adam Maddison,M,39,Wraps,M_OCR_ABPU,94.3,100,212.5,222.5,227.5,227.5,112.5,117.5,-120,,117.5,232.5,242.5,-250,,242.5,587.5,SBD,
8,William Golding,M,25,Wraps,M_OCR_ABPU,97.3,100,180,195,200,200,100,107.5,112.5,,112.5,185,200,210,,210,522.5,SBD,
1,Ben Thornes,M,37,Wraps,M_OCR_ABPU,105.2,110,265,282.5,-292.5,282.5,140,147.5,152.5,,152.5,280,-300,302.5,,302.5,737.5,SBD,
2,Josh Cranfield,M,26,Wraps,M_OCR_ABPU,108,110,260,275,-290,275,160,170,180,,180,240,260,272.5,,272.5,727.5,SBD,
3,Matthew Davey,M,36,Wraps,M_OCR_ABPU,109.6,110,235,250,260,260,147.5,152.5,157.5,,157.5,275,290,-302.5,,290,707.5,SBD,
4,Tom Wride,M,37,Wraps,M_OCR_ABPU,107.7,110,240,-255,255,255,155,165,172.5,,172.5,240,250,255,,255,682.5,SBD,
5,Adrian Golding,M,38,Wraps,M_OCR_ABPU,106.45,110,212.5,-230,232.5,232.5,145,155,162.5,,162.5,255,272.5,280,,280,675,SBD,
6,James Pearson #1,M,35,Wraps,M_OCR_ABPU,109.3,110,210,225,235,235,160,-167.5,167.5,,167.5,217.5,232.5,-240,,232.5,635,SBD,
1,John Marsden #1,M,39,Wraps,M_OCR_ABPU,116.1,125,285,305,315,315,175,-182.5,-182.5,,175,270,285,295,,295,785,SBD,
2,Julian Myles,M,34,Wraps,M_OCR_ABPU,124.1,125,290,305,320,320,140,147.5,152.5,,152.5,275,290,-300,,290,762.5,SBD,
3,Martin Shaw,M,38,Wraps,M_OCR_ABPU,124.05,125,-267.5,287.5,292.5,292.5,165,177.5,182.5,,182.5,265,277.5,285,,285,760,SBD,
4,Josh Golding,M,33,Wraps,M_OCR_ABPU,119.4,125,280,300,-310,300,165,-170,,,165,260,280,-287.5,,280,745,SBD,
5,Jamie Wicks,M,29,Wraps,M_OCR_ABPU,122.3,125,250,260,265,265,157.5,165,170,,170,250,270,282.5,,282.5,717.5,SBD,
1,Dominic Coman,M,28,Wraps,M_OCR_ABPU,134.2,140,290,305,320,320,177.5,185,190,,190,250,267.5,-280,,267.5,777.5,SBD,
2,Julian McKerrow,M,34,Wraps,M_OCR_ABPU,131.85,140,260,270,-280,270,180,-190,-190,,180,290,305,-327.5,,305,755,SBD,
3,Andrew Hall #1,M,37,Wraps,M_OCR_ABPU,137.5,140,245,-252.5,252.5,252.5,145,152.5,-160,,152.5,250,260,-272.5,,260,665,SBD,
1,Tom Warren #1,M,41,Wraps,M_OCR_ABPU,156.1,140+,295,-325,-330,295,200,207.5,-212.5,,207.5,285,295,300,,300,802.5,SBD,
2,Mokrane Chir,M,31,Wraps,M_OCR_ABPU,162.3,140+,245,265,275,275,167.5,177.5,182.5,,182.5,280,305,-322.5,,305,762.5,SBD,
1,Kerry Jones,F,37,Bare,F_OR_BPU,89.92,90,117.5,125,130,130,65,72.5,-77.5,,72.5,120,135,150,,150,352.5,SBD,
1,Emma Pearson #2,F,44,Wraps,F_MCR_1_BPU,72,75,160,170,-180,170,100,110,-112.5,,110,180,190,-195,,190,470,SBD,
2,Adele Davis,F,42,Wraps,F_MCR_1_BPU,72.7,75,170,180,-187.5,180,85,92.5,-95,,92.5,170,180,-185,,180,452.5,SBD,
1,Babs Milaszkiewicz,F,47,Wraps,F_MCR_2_BPU,66.1,67.5,127.5,140,-147.5,140,70,75,77.5,,77.5,155,170,-177.5,,170,387.5,SBD,
1,Natasha Gee,F,47,Wraps,F_MCR_2_BPU,81,82.5,135,145,155,155,70,75,80,,80,150,160,-170,,160,395,SBD,
1,Geraldine Goligher,F,51,Wraps,F_MCR_3_BPU,66,67.5,130,140,150.5,150.5,95,100,-102.5,,100,160,-165,165,,165,415.5,SBD,
1,Katie Edwards #1,F,50,Wraps,F_MCR_3_BPU,74.9,75,95,105,-115,105,62.5,65,-67.5,,65,160,170,-180,,170,340,SBD,
1,Karley Emery,F,33,Wraps,F_OCR_BPU,59.3,60,165,175,-180,175,67.5,72.5,-77.5,,72.5,167.5,180,185.5,,185.5,433,SBD,
1,Shelby Culff,F,26,Wraps,F_OCR_BPU,74.6,75,165,175,-185,175,85,92.5,-97.5,,92.5,165,177.5,187.5,,187.5,455,SBD,
2,Adele Davis,F,42,Wraps,F_OCR_BPU,72.7,75,170,180,-187.5,180,85,92.5,-95,,92.5,170,180,-185,,180,452.5,SBD,
1,Jazzmin Brooks,F,26,Wraps,F_OCR_BPU,97.8,100,165,177.5,185,185,117.5,125,130,,130,185,197.5,205,,205,520,SBD,
1,Charlie Dimmock,M,22,Wraps,M_JCR_BPU,67.5,67.5,215,222.5,-230,222.5,140,-145,-145,,140,255,-277.5,,,255,617.5,SBD,
1,Callum Hold,M,21,Wraps,M_JCR_BPU,99.95,100,260,-275,275,275,160,-170,-170,,160,260,272.5,,,272.5,707.5,SBD,
2,Nathan Lawson,M,23,Wraps,M_JCR_BPU,93.5,100,255,265,275,275,-140,140,150,,150,280,-290,,,280,705,SBD,
1,Alfie King,M,23,Wraps,M_JCR_BPU,104.45,110,285,305,320,320,185,192.5,200,,200,295,312.5,320,,320,840,SBD,
2,Adam Stone #1,M,20,Wraps,M_JCR_BPU,105.3,110,220,240,-255,240,145,152.5,-160,,152.5,250,265,,,265,657.5,SBD,
1,Josh Taylor #1,M,20,Wraps,M_JCR_ABPU,51.5,52,92.5,100,-105,100,62.5,67.5,72.5,,72.5,110,-120,-120,,110,282.5,SBD,
1,Niall Gaute,M,22,Wraps,M_JCR_ABPU,74.05,75,200,210,-220,210,125,132.5,-137.5,,132.5,240,250,255,,255,597.5,SBD,
2,Harry Payne,M,22,Wraps,M_JCR_ABPU,74.7,75,210,217.5,225,225,132.5,137.5,140,,140,-227.5,-230,230,,230,595,SBD,
3,Ben Phillips #1,M,23,Wraps,M_JCR_ABPU,74.85,75,-190,190,202.5,202.5,110,117.5,120,,120,235,250,-263,,250,572.5,SBD,
4,Alden Aldea,M,23,Wraps,M_JCR_ABPU,74.2,75,-220,-220,220,220,80,100,120,,120,215,-227.5,-227.5,,215,555,SBD,
5,Matthew Lavagna-Slater,M,21,Wraps,M_JCR_ABPU,73.6,75,170,-185,190,190,90,95,-100,,95,200,215,-230,,215,500,SBD,
DQ,Tom Kershaw,M,22,Wraps,M_JCR_ABPU,74.9,75,-195,200,205,205,-130,130,-137.5,,130,-240,-250,-250,,,,SBD,
1,Ryan King #8,M,23,Wraps,M_JCR_ABPU,81.95,82.5,-250,250,267.5,267.5,160,172.5,-178,,172.5,260,277.5,282.5,,282.5,722.5,SBD,
2,Memphis Lindley,M,20,Wraps,M_JCR_ABPU,80.75,82.5,210,-225,225,225,117.5,125,130,,130,-200,200,215,,215,570,SBD,
4,Nathan Lynch,M,21,Wraps,M_JCR_ABPU,77.65,82.5,195,-205,-205,195,110,-115,-115,,110,-180,180,200,,200,505,SBD,
3,Frazer Peppitt,M,23,Wraps,M_JCR_ABPU,80.85,82.5,180,195,-207.5,195,110,117.5,122.5,,122.5,215,225,232.5,,232.5,550,SBD,
1,Kieran Griffith,M,22,Wraps,M_JCR_ABPU,89.95,90,235,255,262.5,262.5,150,160,-165,,160,255,270,280,,280,702.5,SBD,
2,Jordan Thomas #8,M,22,Wraps,M_JCR_ABPU,89.5,90,250,275,290,290,145,152.5,160,,160,230,250,-262.5,,250,700,SBD,
3,Joshua Bullard,M,20,Wraps,M_JCR_ABPU,89.5,90,230,240,-245,240,150,155,-157.5,,155,240,252.5,-260,,252.5,647.5,SBD,
4,Leonardo Villalba Rocha,M,23,Wraps,M_JCR_ABPU,88.55,90,220,240,-255,240,120,130,-135,,130,220,240,250,,250,620,SBD,
5,Jack Bullivant,M,23,Wraps,M_JCR_ABPU,86.95,90,205,230,-245,230,125,135,-137.5,,135,245,-260,-282.5,,245,610,SBD,
6,Ethan Green #2,M,22,Wraps,M_JCR_ABPU,89.95,90,190,200,210,210,125,130,-137.5,,130,230,240,-250,,240,580,SBD,
7,Rhys Williamson,M,23,Wraps,M_JCR_ABPU,86.1,90,-190,-190,190,190,110,115,-122.5,,115,220,235,-240,,235,540,SBD,
8,Conner McCulloch,M,21,Wraps,M_JCR_ABPU,89.45,90,260,-280,-280,260,145,152.5,-155,,152.5,65,,,,65,477.5,SBD,
1,Isaac Flint,M,20,Wraps,M_JCR_ABPU,99.85,100,207.5,222.5,235,235,125,132.5,137.5,,137.5,225,245,255,,255,627.5,SBD,
2,Jake Comery,M,22,Wraps,M_JCR_ABPU,99.9,100,195,207.5,220,220,120,127.5,135,,135,207.5,220,232.5,,232.5,587.5,SBD,
1,Oliver Rowe,M,22,Wraps,M_JCR_ABPU,109.5,110,230,245,255,255,150,-160,160,,160,225,-240,240,,240,655,SBD,
2,Barnaby Spear,M,20,Wraps,M_JCR_ABPU,109.1,110,-235,235,-260,235,165,175,182.5,,182.5,-225,-225,225,,225,642.5,SBD,
3,Samuel Cary,M,22,Wraps,M_JCR_ABPU,108.6,110,215,230,245,245,115,125,-130,,125,225,250,265,,265,635,SBD,
4,Sol Kelly,M,20,Wraps,M_JCR_ABPU,106.55,110,210,232.5,-242.5,232.5,125,135,140,,140,230,260,-272.5,,260,632.5,SBD,
5,Jack Anderson #3,M,23,Wraps,M_JCR_ABPU,102.25,110,190,207.5,220,220,120,127.5,135,,135,242.5,262.5,-280,,262.5,617.5,SBD,
6,Jake Sherratt,M,23,Wraps,M_JCR_ABPU,109.75,110,225,-240,-240,225,115,-120,120,,120,245,260,-267.5,,260,605,SBD,
1,Ethan Edghill,M,21,Wraps,M_JCR_ABPU,121.35,125,225,240,250,250,155,160,165,,165,240,260,280,,280,695,SBD,
1,Gregorz Gibaszek,M,15,Wraps,M_TCR_1_ABPU,72.95,75,127.5,137.5,-147.5,137.5,80,-87.5,-90,,80,150,-160,162.5,,162.5,380,SBD,
1,Finnian McNicholas,M,15,Wraps,M_TCR_1_ABPU,80.55,82.5,140,155,165,165,70,-80,85,,85,125,155,172.5,,172.5,422.5,SBD,
1,Tommy Brown #2,M,15,Wraps,M_TCR_1_ABPU,90,90,117.5,125,140,140,70,80,-87.5,,80,160,185,-190,,185,405,SBD,
1,Steffan Edwards #2,M,16,Wraps,M_TCR_2_ABPU,58.05,60,147.5,-155,155,155,65,70,-75,,70,-160,165,-172.5,,165,390,SBD,
1,Josh Mugridge,M,17,Wraps,M_TCR_2_ABPU,67,67.5,145,-162.5,162.5,162.5,77.5,85,87.5,,87.5,175,185,200,,200,450,SBD,
1,Tom Warwick,M,16,Wraps,M_TCR_2_ABPU,74.25,75,165,175,-185,175,105,112.5,-115,,112.5,180,190,202.5,,202.5,490,SBD,
2,Finn Leahy,M,17,Wraps,M_TCR_2_ABPU,70.3,75,135,142.5,147.5,147.5,110,117.5,-122.5,,117.5,200,210,215,,215,480,SBD,
3,Indio Whitnell-Monk,M,17,Wraps,M_TCR_2_ABPU,74.05,75,152.5,165,172.5,172.5,90,100,-102.5,,100,192.5,205,-210,,205,477.5,SBD,
4,Archie Warren,M,17,Wraps,M_TCR_2_ABPU,71.5,75,145,155,162.5,162.5,90,97.5,102.5,,102.5,172.5,190,200,,200,465,SBD,
5,Joel Young #2,M,17,Wraps,M_TCR_2_ABPU,68.2,75,140,-150,150,150,-90,100,-105,,100,185,-195,,,185,435,SBD,
6,Elis Davies,M,17,Wraps,M_TCR_2_ABPU,72.8,75,160,-170,-170,160,100,107.5,-110,,107.5,155,165,-175,,165,432.5,SBD,
1,Jamie Parkhouse,M,17,Wraps,M_TCR_2_ABPU,82.2,82.5,162.5,170,-180,170,122.5,125,-130,,125,180,192.5,205,,205,500,SBD,
2,Sebastian Tomczyk,M,17,Wraps,M_TCR_2_ABPU,78.9,82.5,140,150,-160,150,105,112.5,-117.5,,112.5,180,190,-205,,190,452.5,SBD,
3,Jake Wallin,M,16,Wraps,M_TCR_2_ABPU,79.55,82.5,-160,-160,160,160,87.5,92.5,97.5,,97.5,185,195,-202.5,,195,452.5,SBD,
1,Tyler Peoples,M,17,Wraps,M_TCR_2_ABPU,89.1,90,165,180,195,195,90,95,-100,,95,200,220,240,,240,530,SBD,
1,Thomas Levy,M,17,Wraps,M_TCR_2_ABPU,96.85,100,165,175,-180,175,87.5,92.5,-95,,92.5,190,-200,200,,200,467.5,SBD,
1,Joe Orriss-Warne,M,17,Wraps,M_TCR_2_ABPU,109.1,110,207.5,217.5,-225,217.5,117.5,125,132.5,,132.5,215,232.5,-240,,232.5,582.5,SBD,
2,Elijah Crimmen,M,16,Wraps,M_TCR_2_ABPU,104.2,110,190,-205,-205,190,115,122.5,-132.5,,122.5,190,205,-212.5,,205,517.5,SBD,
1,Jacob Richards #3,M,19,Wraps,M_TCR_3_ABPU,67.05,67.5,-210,210,-220,210,102.5,-112.5,112.5,,112.5,205,220,-240,,220,542.5,SBD,
2,Marinis Lamkai,M,19,Wraps,M_TCR_3_ABPU,66.2,67.5,145,155,165,165,90,100,105,,105,177.5,190,-200,,190,460,SBD,
1,Michael Steytler,M,18,Wraps,M_TCR_3_ABPU,74.85,75,160,170,-175,170,115,117.5,-120,,117.5,230,-240,,,230,517.5,SBD,
2,Stefan Kondratiuk,M,19,Wraps,M_TCR_3_ABPU,74.25,75,160,167.5,-175,167.5,120,-127.5,130,,130,175,190,-200,,190,487.5,SBD,
3,Callum Cousins,M,19,Wraps,M_TCR_3_ABPU,72,75,145,152.5,-160,152.5,105,112.5,115,,115,170,185,200,,200,467.5,SBD,
1,Harry Southern,M,19,Wraps,M_TCR_3_ABPU,80.35,82.5,160,170,180,180,142.5,150,157.5,,157.5,200,210,-220,,210,547.5,SBD,
2,William Gwyer,M,19,Wraps,M_TCR_3_ABPU,81.1,82.5,170,185,187.5,187.5,95,-110,110,,110,210,225,-252.5,,225,522.5,SBD,
DQ,James Porritt,M,19,Wraps,M_TCR_3_ABPU,81.4,82.5,-205,-205,-205,,,,,,,,,,,,,SBD,
1,Liam Hawes,M,19,Wraps,M_TCR_3_ABPU,85,90,185,200,210,210,110,117.5,122.5,,122.5,210,220,230,,230,562.5,SBD,
2,Calum Aylett,M,18,Wraps,M_TCR_3_ABPU,89.2,90,190,200,-210,200,100,110,120,,120,210,220,230,,230,550,SBD,
3,Leo Hughes,M,18,Wraps,M_TCR_3_ABPU,88.9,90,-190,190,-220,190,90,100,-110,,100,180,200,210,,210,500,SBD,
1,Aaron Dixon #3,M,18,Sleeves,M_TCR_3_ABPU,97.95,100,240,-252.5,-252.5,240,140,150,157.5,,157.5,262.5,275,283,,283,680.5,SBD,
1,Aidan Mcnicholas,M,18,Wraps,M_TCR_3_ABPU,108.7,110,225,255,275.5,275.5,140,160,,,160,265,300,322.5,,322.5,758,SBD,
1,Kristofers Tiltnieks,M,19,Wraps,M_TCR_3_ABPU,124.15,125,250,270,277.5,277.5,140,152.5,-160,,152.5,245,255,260,,260,690,SBD,
1,Jack Swift,M,43,Wraps,M_MCR_1_BPU,88.7,90,220,-235,235,235,140,147.5,152.5,,152.5,260,272.5,282.5,,282.5,670,SBD,
2,David Wilde #2,M,43,Wraps,M_MCR_1_BPU,88.7,90,220,232.5,240,240,105,112.5,117.5,,117.5,225,242.5,252.5,,252.5,610,SBD,
3,Marin Tecuta,M,41,Wraps,M_MCR_1_BPU,88.1,90,185,200,210,210,105,112.5,120,,120,200,225,245,,245,575,SBD,
1,William Spencer #3,M,40,Wraps,M_MCR_1_BPU,109.6,110,265,280,290,290,165,175,-180,,175,260,275,285,,285,750,SBD,
2,Karl Manton,M,41,Wraps,M_MCR_1_BPU,108.5,110,210,230,240,240,155,-170,-170,,155,240,255,-272.5,,255,650,SBD,
1,Andrzej Roszkowski,M,43,Wraps,M_MCR_1_BPU,118.55,125,320,350,-380,350,220,235,-250,,235,272.5,302.5,-332.5,,302.5,887.5,SBD,
2,Rob Warburton,M,41,Wraps,M_MCR_1_BPU,122.8,125,125,,,125,90,,,,90,-170,170,,,170,385,SBD,
1,Robin Morley,M,40,Raw,M_MCR_1_BPU,136.55,140,285,305,317.5,317.5,182.5,192.5,200,,200,290,310,325,,325,842.5,SBD,
1,Paul Coates,M,45,Wraps,M_MCR_2_BPU,89.85,90,255,-275,275,275,165,175,-180,,175,275,-292.5,292.5,,292.5,742.5,SBD,
2,Lee Smith #9,M,47,Wraps,M_MCR_2_BPU,89.2,90,-197.5,210,220,220,132.5,142.5,-147.5,,142.5,-197.5,210,230,,230,592.5,SBD,
1,Paul Wain,M,49,Wraps,M_MCR_2_BPU,95.7,100,220,240,250,250,150,160,165,,165,260,287.5,-290,,287.5,702.5,SBD,
DQ,Marcin Kaleta,M,46,Wraps,M_MCR_2_BPU,98.2,100,-250,250,272.5,272.5,145,155,-167.5,,155,,,,,,,SBD,
1,Lester Kellaway,M,45,Wraps,M_MCR_2_BPU,109.1,110,220,-230,230,230,120,-130,-132.5,,120,260,-282.5,-282.5,,260,610,SBD,
1,David Knight #3,M,49,Wraps,M_MCR_2_BPU,120.6,125,280,-305,-305,280,190,200,210,,210,280,302.5,312.5,,312.5,802.5,SBD,
2,Zoltán Mihályi,M,46,Wraps,M_MCR_2_BPU,123.45,125,-250,250,-280,250,180,195,-200,,195,250,-275,,,250,695,SBD,
1,Paul Johnson #1,M,54,Wraps,M_MCR_3_BPU,98.4,100,220,-235,-250,220,-107.5,107.5,117.5,,117.5,210,225,235,,235,572.5,SBD,
1,Lloyd Strang,M,50,Wraps,M_MCR_3_BPU,134.55,140,260,272.5,,272.5,160,180,-195,,180,240,272.5,-300,,272.5,725,SBD,
1,Stephen Alsop,M,53,Wraps,M_MCR_3_BPU,143.9,140+,230,-250,-250,230,170,180,-185,,180,-220,220,240,,240,650,SBD,
1,Michael Hawkins #1,M,62,Wraps,M_MCR_5_BPU,95.15,100,190,-200,200,200,110,115,117.5,,117.5,190,200,207.5,,207.5,525,SBD,
1,Rob Barber,M,69,Wraps,M_MCR_6_BPU,86.75,90,190,205,210,210,160,-167.5,170,,170,200,220,225,,225,605,SBD,
1,Tom Wright #3,M,36,Wraps,M_OCR_BPU,73.05,75,200,215,225,225,125,135,145,,145,225,250,-275,,250,620,SBD,
1,Aodhan Phillips-Lees,M,31,Wraps,M_OCR_BPU,80.95,82.5,242.5,262.5,275,275,140,155,162.5,,162.5,237.5,-252.5,-252.5,,237.5,675,SBD,
1,Dexter Curtis,M,34,Wraps,M_OCR_BPU,89.35,90,255,265,272.5,272.5,145,152.5,160,,160,250,267.5,-285,,267.5,700,SBD,
2,Gabriel Singer,M,28,Wraps,M_OCR_BPU,88.35,90,240,260,267.5,267.5,145,152.5,157.5,,157.5,245,270,-285,,270,695,SBD,
3,Luke Nash,M,37,Wraps,M_OCR_BPU,88.15,90,240,255,-265,255,145,-160,160,,160,240,255,262.5,,262.5,677.5,SBD,
1,Declan O'Brian,M,24,Wraps,M_OCR_BPU,99.15,100,240,260,270,270,160,-170,-175,,160,260,275,285,,285,715,SBD,
2,Christopher Whitaker #2,M,34,Wraps,M_OCR_BPU,95.3,100,-250,250,-275,250,135,142.5,150,,150,-280,-280,300,,300,700,SBD,
1,Kyle Staunton,M,29,Wraps,M_OCR_BPU,108.5,110,290,310,317.5,317.5,150,157.5,160,,160,310,325,340,,340,817.5,SBD,
2,Daniel Purcell #2,M,35,Wraps,M_OCR_BPU,109.15,110,265,285,300,300,175,180,182.5,,182.5,-315,-335,335,,335,817.5,SBD,
3,Jakub Szanweber,M,29,Wraps,M_OCR_BPU,109.05,110,225,265,-295,265,175,182.5,190,,190,275,295,307.5,,307.5,762.5,SBD,
4,Matthew Lynch #6,M,27,Sleeves,M_OCR_BPU,107.55,110,260,270,280,280,160,170,-180,,170,305,-325,-325,,305,755,SBD,
5,Robert White,M,32,Wraps,M_OCR_BPU,109.05,110,250,265,272.5,272.5,150,157.5,-162.5,,157.5,275,290,-300,,290,720,SBD,
6,Harrison Fleetwood,M,34,Wraps,M_OCR_BPU,108.3,110,280,-305,,280,160,-170,175,,175,260,,,,260,715,SBD,
7,Andrew Wild,M,39,Wraps,M_OCR_BPU,103.25,110,220,230,-242.5,230,160,-175,-175,,160,260,285,-290,,285,675,SBD,
DQ,Marcus Thonner,M,28,Wraps,M_OCR_BPU,109.85,110,-270,-270,-300,,,,,,,,,,,,,SBD,
1,Andrzej Roszkowski,M,43,Wraps,M_OCR_BPU,118.55,125,320,350,-380,350,220,235,-250,,235,272.5,302.5,-332.5,,302.5,887.5,SBD,
2,Matt Pullen,M,37,Wraps,M_OCR_BPU,124.2,125,290,-310,,290,190,200,207.5,,207.5,300,317.5,330,,330,827.5,SBD,
3,Liam Wheeler,M,32,Wraps,M_OCR_BPU,123.45,125,310,-335,-335,310,172.5,182.5,190,,190,295,315,325,,325,825,SBD,
4,Christopher Park,M,27,Wraps,M_OCR_BPU,116.3,125,280,300,-310,300,160,167.5,-172.5,,167.5,305,325,-340,,325,792.5,SBD,
5,William Jones #1,M,27,Wraps,M_OCR_BPU,123.25,125,125,,,125,190,-200,-200,,190,75,,,,75,390,SBD,
6,Rob Warburton,M,41,Wraps,M_OCR_BPU,122.8,125,125,,,125,90,,,,90,-170,170,,,170,385,SBD,
1,Lewis Griffin,M,28,Wraps,M_OCR_BPU,135.95,140,320,340,,340,-180,180,200,,200,320,340,-350,,340,880,SBD,
2,William Newton #1,M,38,Wraps,M_OCR_BPU,125.55,140,280,307.5,322.5,322.5,170,182.5,195,,195,-320,335,-355,,335,852.5,SBD,
3,Daniel Pope #1,M,34,Wraps,M_OCR_BPU,125.75,140,320,332.5,340,340,192.5,202.5,207.5,,207.5,280,300,,,300,847.5,SBD,
4,Robin Morley,M,40,Raw,M_OCR_BPU,136.55,140,285,305,317.5,317.5,182.5,192.5,200,,200,290,310,325,,325,842.5,SBD,
5,Michael Mancz,M,37,Wraps,M_OCR_BPU,133.5,140,307.5,322.5,-330,322.5,170,180,187.5,,187.5,270,285,290,,290,800,SBD,
1,Dekwan Elfizgha,M,30,Wraps,M_OCR_BPU,163.55,140+,350,-375,375,375,195,205,-210,,205,305,330,-342.5,,330,910,SBD,
1,Lily Churchyard,F,21,Bare,F_JR_ABPU,44.35,48,-85,85,-90,85,50,52.5,-55,,52.5,110,-115,-115,,110,247.5,SBD,
1,Tia Needham,F,20,Bare,F_JR_ABPU,51.95,52,90,97.5,107.5,107.5,45,52.5,-60,,52.5,110,120,-130,,120,280,SBD,
1,Asia Grabowski,F,23,Bare,F_JR_ABPU,55.9,56,90,95,-97.5,95,72.5,76,77.5,-80,77.5,122.5,-132.5,132.5,,132.5,305,SBD,
2,Kerrie Wiggans,F,22,Bare,F_JR_ABPU,52.15,56,65,75,85,85,35,40,-47.5,,40,80,87.5,92.5,,92.5,217.5,SBD,
1,Eve Fife,F,20,Bare,F_JR_ABPU,58.5,60,100,105,107.5,107.5,65,70,-75,,70,120,130,135,,135,312.5,SBD,
1,Flossie Doak,F,23,Bare,F_JR_ABPU,65.15,67.5,97.5,102.5,107.5,107.5,50,52.5,55,,55,120,130,137.5,,137.5,300,SBD,
1,Milly Bakewell,F,23,Bare,F_JR_ABPU,81.8,82.5,110,120,-122.5,120,55,-60,-60,,55,145,-155,-155,,145,320,SBD,
1,Princess Iroghiendo,F,21,Bare,F_JR_ABPU,147.2,110+,170,180,187.5,187.5,85,90,-92.5,,90,165,178,182.5,187.5,182.5,460,SBD,
1,Emily Bullock,F,36,Bare,F_OR_ABPU,51.4,52,-95,102.5,107.5,107.5,50,55,-60,,55,120,130,137.5,,137.5,300,SBD,
2,Emily Hussey,F,33,Bare,F_OR_ABPU,50.8,52,85,90,-95,90,52.5,55,-60,,55,110,120,-125,,120,265,SBD,
1,Hannah Langton,F,28,Bare,F_OR_ABPU,54.6,56,115,120,-125,120,47.5,52.5,55,,55,145,-150,150,,150,325,SBD,
2,Sarah Ellis #2,F,29,Bare,F_OR_ABPU,54.25,56,102.5,110,115,115,47.5,50,-52.5,,50,132.5,140,-145,,140,305,SBD,
1,Louise Breen,F,38,Bare,F_OR_ABPU,58.55,60,125,135,140,140,70,75,-80,,75,132.5,142.5,150,,150,365,SBD,
2,Rachel Evans,F,27,Bare,F_OR_ABPU,59.65,60,112.5,120,-125,120,72.5,77.5,-82.5,,77.5,140,152.5,-170,,152.5,350,SBD,
3,Zoe Capindale,F,35,Bare,F_OR_ABPU,58.5,60,115,120,-125,120,67.5,70,-72.5,,70,125,135,142.5,,142.5,332.5,SBD,
4,Katarzyna Lapa,F,30,Bare,F_OR_ABPU,59.35,60,110,120,-125,120,-47.5,50,-52.5,,50,130,140,145,,145,315,SBD,
5,Elsbeth Coyle,F,28,Bare,F_OR_ABPU,59.9,60,110,-120,-120,110,70,75,-77.5,,75,120,130,-142.5,,130,315,SBD,
1,Chelsea Byrom,F,25,Bare,F_OR_ABPU,61.95,67.5,127.5,135,140,140,62.5,67.5,70,,70,145,152.5,157.5,,157.5,367.5,SBD,
2,Lisa Grant #1,F,35,Bare,F_OR_ABPU,67.35,67.5,120,125,127.5,127.5,82.5,87.5,-90,,87.5,-142.5,142.5,147.5,,147.5,362.5,SBD,
3,Charlotte Louise Clement,F,31,Bare,F_OR_ABPU,67.45,67.5,110,120,130,130,60,65,70,,70,130,145,152.5,,152.5,352.5,SBD,
4,Rachael Smith #2,F,32,Bare,F_OR_ABPU,64.55,67.5,105,112.5,117.5,117.5,60,65,70,,70,155,162.5,-170,,162.5,350,SBD,
5,Scarlett Padgett,F,33,Bare,F_OR_ABPU,65.9,67.5,125,-130,-130,125,60,62.5,-65,,62.5,155,162.5,-170,,162.5,350,SBD,
6,Nicola Smith,F,33,Bare,F_OR_ABPU,65.25,67.5,105,110,112.5,112.5,55,57.5,60,,60,142.5,-152.5,157.5,,157.5,330,SBD,
7,Clarissa Docksey,F,28,Bare,F_OR_ABPU,65.45,67.5,85,105,112.5,112.5,55,60,62.5,,62.5,135,145,152.5,,152.5,327.5,SBD,
8,Ines Huc,F,25,Bare,F_OR_ABPU,66.2,67.5,110,120,-122.5,120,62.5,-72.5,-72.5,,62.5,122.5,-137.5,137.5,,137.5,320,SBD,
1,Michaela Owen-Clark,F,38,Bare,F_OR_ABPU,73.5,75,140,147.5,155,155,82.5,87.5,-92.5,,87.5,157.5,-165,172.5,,172.5,415,SBD,
2,Samantha Vickers,F,38,Bare,F_OR_ABPU,74,75,130,135,140,140,72.5,75,-80,,75,155,165,175,,175,390,SBD,
3,Emma Wilding,F,28,Bare,F_OR_ABPU,71.3,75,107.5,115,120,120,60,-65,-65,,60,160,-167.5,-167.5,,160,340,SBD,
4,Hannah Phipps,F,26,Bare,F_OR_ABPU,74.95,75,115,125,130,130,60,65,-70,,65,130,142.5,-147.5,,142.5,337.5,SBD,
1,Bringsty Edwards,F,34,Bare,F_OR_ABPU,80.5,82.5,145,-155,155,155,90,95,100,,100,180,190,195,,195,450,SBD,
2,Georgina Watts,F,31,Bare,F_OR_ABPU,81.4,82.5,125,132.5,137.5,137.5,80,82.5,-87.5,,82.5,130,140,145,,145,365,SBD,
3,Babongile Ndiweni,F,32,Bare,F_OR_ABPU,80.5,82.5,127.5,132.5,-137.5,132.5,72.5,75,-77.5,,75,147.5,152.5,-155,,152.5,360,SBD,
4,Ashleigh Hartnell,F,28,Bare,F_OR_ABPU,80.55,82.5,125,135,-137.5,135,62.5,-65,65,,65,150,157.5,-162.5,,157.5,357.5,SBD,
5,Claire Scattergood,F,33,Bare,F_OR_ABPU,81.95,82.5,110,117.5,120,120,65,70,,,70,150,165,-172.5,,165,355,SBD,
1,Hannah Newberry,F,32,Bare,F_OR_ABPU,85.95,90,135,145,150,150,72.5,80,-85,,80,162.5,172.5,-177.5,,172.5,402.5,SBD,
1,Nicola Bird,F,39,Bare,F_OR_ABPU,97,100,110,117.5,122.5,122.5,60,65,67.5,,67.5,142.5,152.5,-162.5,,152.5,342.5,SBD,
1,Stacey Isherwood,F,32,Bare,F_OR_ABPU,106.65,110,130,140,150,150,60,65,70,,70,190,200,-207.5,,200,420,SBD,
1,India Teague,F,15,Bare,F_TR_1_ABPU,76.65,82.5,145,150,-155,150,75,77.5,80,,80,135,-145,145,,145,375,SBD,
1,Olivia Eddy,F,17,Bare,F_TR_2_ABPU,73.8,75,75,82.5,87.5,87.5,45,50,52.5,,52.5,130,140,145,,145,285,SBD,
1,Gabrielle Stuffins,F,17,Bare,F_TR_2_ABPU,82.05,82.5,105,112.5,117.5,117.5,75,80,83,,83,145,157.5,163,170,163,363.5,SBD,
1,Isabelle Simper,F,18,Bare,F_TR_3_ABPU,51.35,52,105,110,-115,110,65,67.5,70.5,,70.5,155,160,-165,,160,340.5,SBD,
1,Claudia Kennell,F,18,Bare,F_TR_3_ABPU,54.5,56,85,92.5,-100,92.5,45,50,-52.5,,50,110,120,-130,,120,262.5,SBD,
1,Bethan Shenton,F,18,Bare,F_TR_3_ABPU,59.05,60,100,107.5,110,110,62.5,-67.5,-67.5,,62.5,110,-120,-120,,110,282.5,SBD,
1,Jennifer Childerhouse,F,23,Wraps,F_JCR_ABPU,59.85,60,130,137.5,145,145,60,-65,65,,65,140,145,152.5,,152.5,362.5,SBD,
2,Libby Pender,F,20,Wraps,F_JCR_ABPU,58.25,60,130,137.5,142.5,142.5,70,-75,-75,,70,140,-145,-150,,140,352.5,SBD,
3,Aimee Antonius,F,23,Wraps,F_JCR_ABPU,57.9,60,112.5,120,122.5,122.5,52.5,57.5,60,,60,120,127.5,135,,135,317.5,SBD,
4,Keeley Holloran Brown,F,23,Wraps,F_JCR_ABPU,58.25,60,95,102.5,110,110,62.5,-67.5,-67.5,,62.5,95,102.5,-107.5,,102.5,275,SBD,
5,Kayleigh Jezzard,F,20,Wraps,F_JCR_ABPU,59.2,60,105,110,-115,110,45,50,52.5,,52.5,97.5,102.5,107.5,,107.5,270,SBD,
1,Juliette Appleby,F,23,Wraps,F_JCR_ABPU,64.75,67.5,95,-105,-105,95,47.5,52.5,-57.5,,52.5,115,125,135,,135,282.5,SBD,
1,Erica Bridgewater,F,22,Wraps,F_JCR_ABPU,72.7,75,125,135,140,140,47.5,52.5,55,,55,135,147.5,155,,155,350,SBD,
1,Bethany Kinsella,F,23,Wraps,F_JCR_ABPU,77.75,82.5,120,130,135,135,52.5,55,57.5,,57.5,130,140,-147.5,,140,332.5,SBD,
2,Tamzin Ord,F,20,Wraps,F_JCR_ABPU,89.15,90,102.5,112.5,120,120,67.5,72.5,80,,80,110,125,-130,,125,325,SBD,
1,Jessica Van Der Knaap,F,23,Wraps,F_JCR_ABPU,89.6,90,130,140,145,145,70,75,80,,80,180,190,200,,200,425,SBD,
1,Chloe Holdsworth,F,17,Wraps,F_TCR_2_ABPU,56.8,60,90,97.5,102.5,102.5,60,65,70,,70,105,112.5,120,,120,292.5,SBD,
1,Serenity Schaeffer,F,17,Wraps,F_TCR_2_ABPU,73.95,75,110,112.5,115,115,57.5,62.5,-67.5,,62.5,130,-140,,,130,307.5,SBD,
1,Malva Jammo,F,19,Wraps,F_TCR_3_ABPU,58.8,60,122.5,130,135,135,55,60,-63,,60,105,115,125,,125,320,SBD,
2,Ilana Steventon,F,19,Wraps,F_TCR_3_ABPU,57.95,60,110,115,122.5,122.5,50,55,-60,,55,120,130,135,,135,312.5,SBD,
DQ,Blaise White,F,18,Wraps,F_TCR_3_ABPU,67.5,67.5,-95,,,,,,,,,,,,,,,SBD,
1,Joanna Kusznerko,F,19,Wraps,F_TCR_3_ABPU,82.35,82.5,147.5,157.5,-165,157.5,70,75,-82.5,,75,160,170,-172.5,,170,402.5,SBD,
2,Gweneth Fisher,F,18,Wraps,F_TCR_3_ABPU,80.75,82.5,125,132.5,142.5,142.5,67.5,72.5,75,75.5,75,125,135,-140,,135,352.5,SBD,
1,Amira Mohamed,F,18,Wraps,F_TCR_3_ABPU,104.25,110,90,102.5,107.5,107.5,37.5,42.5,45,,45,115,127.5,132.5,,132.5,285,SBD,
1,Matthew Glaister,M,23,Bare,M_JR_BPU,89.05,90,190,200,-205,200,130,135,-140,,135,240,260,-265,,260,595,SBD,
1,Sam Cameron #2,M,23,Bare,M_JR_BPU,99.15,100,240,-255,-255,240,190,200,,,200,250,260,265,,265,705,SBD,
1,Joseph O'Brien #4,M,22,Bare,M_JR_ABPU,73.55,75,165,180,-187.5,180,100,107.5,-112.5,,107.5,170,185,200,,200,487.5,SBD,
1,Daniel Deakin,M,22,Bare,M_JR_ABPU,82.5,82.5,175,-185,185,185,102.5,107.5,-112.5,,107.5,220,230,-240,,230,522.5,SBD,
1,Joe Heasman,M,22,Bare,M_JR_ABPU,86.75,90,185,192.5,200,200,140,145,150,,150,230,240,-252.5,,240,590,SBD,2001-11-18
1,Jonny Langford,M,21,Bare,M_JR_ABPU,97.45,100,200,-210,210,210,115,122.5,127.5,,127.5,220,-235,240,,240,577.5,SBD,
1,Gareth James,M,44,Bare,M_MR_1_BPU,93,100,185,200,210,210,120,127.5,-130,,127.5,250,262.5,,,262.5,600,SBD,
1,Chun-Kit Kan,M,46,Bare,M_MR_2_ABPU,89.25,90,180,187.5,192.5,192.5,112.5,-117.5,-117.5,,112.5,230,237.5,-245,,237.5,542.5,SBD,
1,Keir Harding,M,47,Bare,M_MR_2_ABPU,99.9,100,230,252.5,-260.5,252.5,120,130,-135,,130,220,242.5,-267.5,,242.5,625,SBD,
1,Aaron Caseley,M,53,Bare,M_MR_3_BPU,97.35,100,165,175,185,185,120,122.5,127.5,,127.5,230,240,250,,250,562.5,SBD,
1,Stephen Coleman #2,M,50,Bare,M_MR_3_ABPU,73.7,75,165,175,180,180,-90,90,-95,,90,235,250,260,,260,530,SBD,
1,Lee Hetherington,M,53,Bare,M_MR_3_ABPU,80.95,82.5,140,-150,-150,140,80,90,-95,,90,185,195,202.5,,202.5,432.5,SBD,
1,Brian Whitehead,M,53,Bare,M_MR_3_ABPU,97.88,100,150,-165,-165,150,100,-112.5,-112.5,,100,-185,185,-200,,185,435,SBD,
1,Steven Middleton-Lowes,M,53,Bare,M_MR_3_ABPU,107.2,110,235,250,267.5,267.5,150,160,-170,,160,275,-302.5,,,275,702.5,SBD,
1,Mike Musson,M,61,Bare,M_MR_5_ABPU,81.3,82.5,140,145,150,150,90,95,-100,,95,190,200,205,,205,450,SBD,
1,Richard Kemp,M,64,Bare,M_MR_5_ABPU,93.8,100,130,140,150,150,85,95,-100,,95,185,205,-220,,205,450,SBD,
1,Ali Hasanzade,M,33,Bare,M_OR_BPU,88.4,90,200,215,225,225,130,145,152.5,,152.5,235,260,-270,,260,637.5,SBD,
1,Gareth James,M,44,Bare,M_OR_BPU,93,100,185,200,210,210,120,127.5,-130,,127.5,250,262.5,,,262.5,600,SBD,
1,Nathan Feltham,M,30,Bare,M_OR_BPU,104.7,110,265,285,-305,285,190,210,-222.5,,210,265,285,295,,295,790,SBD,
1,Marc England,M,31,Bare,M_OR_BPU,119.05,125,280,310,320,320,180,195,200,,200,280,310,320,,320,840,SBD,
2,Stephen Fraher,M,38,Bare,M_OR_BPU,120,125,280,295,-300,295,165,170,175,,175,270,277.5,282.5,,282.5,752.5,SBD,
3,Craig Marshall,M,34,Bare,M_OR_BPU,125,125,-275,-275,275,275,170,187.5,200,,200,-220,220,-235,,220,695,SBD,
1,Ed Griffiths,M,32,Bare,M_OR_ABPU,66.5,67.5,170,182.5,-192.5,182.5,120,125,130,,130,200,215,-225,,215,527.5,SBD,
1,Tom Humphreys,M,28,Bare,M_OR_ABPU,74.5,75,165,175,185,185,135,145,152.5,,152.5,240,250,260,,260,597.5,SBD,
1,Carn Wharmby,M,33,Bare,M_OR_ABPU,82,82.5,240,250,260,260,115,122.5,130,,130,280,300,-310,,300,690,SBD,
2,Kavan Donaghy,M,28,Bare,M_OR_ABPU,81.85,82.5,205,215,220,220,170,180,-182.5,,180,265,285,-295,,285,685,SBD,
3,Martin Wilson #1,M,35,Bare,M_OR_ABPU,81.35,82.5,190,200,210,210,120,127.5,-130,,127.5,240,260,-280,,260,597.5,SBD,
4,Eddie Mignon,M,32,Bare,M_OR_ABPU,81.7,82.5,190,202.5,210,210,110,117.5,-122.5,,117.5,205,-220,-220,,205,532.5,SBD,
1,Jake Lonsdale,M,29,Bare,M_OR_ABPU,88.75,90,235,245,-255,245,140,155,157.5,,157.5,220,245,,,245,647.5,SBD,
3,Connor Broxton,M,30,Bare,M_OR_ABPU,88.95,90,155,165,-172.5,165,100,110,115,,115,185,195,205,,205,485,SBD,
2,Sebastian Adamatzky,M,24,Bare,M_OR_ABPU,89.5,90,180,190,-200,190,112.5,120,-125,,120,225,250,-257.5,,250,560,SBD,
1,George Westman,M,26,Bare,M_OR_ABPU,99.45,100,195,210,217.5,217.5,112.5,120,-127.5,,120,250,280,297.5,,297.5,635,SBD,
2,Calum Sawford,M,33,Bare,M_OR_ABPU,99.5,100,192.5,202.5,210,210,142.5,152.5,-160,,152.5,255,265,272.5,,272.5,635,SBD,
1,Robert Hunt #1,M,32,Bare,M_OR_ABPU,108.15,110,265,280,290,290,160,167.5,172.5,,172.5,260,275,-285,,275,737.5,SBD,
2,Steven Middleton-Lowes,M,53,Bare,M_OR_ABPU,107.2,110,235,250,267.5,267.5,150,160,-170,,160,275,-302.5,,,275,702.5,SBD,
3,Adam Feavearyear,M,38,Bare,M_OR_ABPU,106,110,230,-240,240,240,140,145,150,,150,265,-270,-270,,265,655,SBD,
4,Thomas Manktelow,M,27,Bare,M_OR_ABPU,104.4,110,210,-225,-225,210,140,150,-160,,150,250,,,,250,610,SBD,
5,Marcus Sawyers,M,24,Bare,M_OR_ABPU,109.1,110,165,-175,175,175,102.5,-107.5,-107.5,,102.5,205,217.5,-222.5,,217.5,495,SBD,
1,Ashleigh Dutton,M,34,Bare,M_OR_ABPU,120.66,125,260,280,-300,280,190,-200,-200,,190,280,300,320,,320,790,SBD,
2,Isi Ejele,M,31,Bare,M_OR_ABPU,123.5,125,220,240,250,250,160,170,180,,180,-290,315,330,,330,760,SBD,
1,Paul Brown-Hampson,M,26,Bare,M_OR_ABPU,137.15,140,290,300,310,310,175,180,187.5,,187.5,290,302.5,310,,310,807.5,SBD,
1,Frankie Kemp,M,31,Bare,M_OR_ABPU,149.1,140+,275,295,300.5,300.5,195,208,212.5,,212.5,275,287.5,295,-300.5,295,808,SBD,
1,Jack Banks,M,15,Bare,M_TR_1_ABPU,68.8,75,155,165,172.5,172.5,95,100,-107.5,,100,-170,182.5,195,,195,467.5,SBD,
1,Bailey Shore,M,17,Bare,M_TR_2_ABPU,74.05,75,160,170,-175,170,95,102.5,-107.5,,102.5,170,185,-192.5,,185,457.5,SBD,
1,Kathryn Greaves,F,41,Bare,F_MR_1_ABPU,47.55,48,75,80,85,85,45,-47.5,-47.5,,45,110,120,-125,,120,250,SBD,
1,Beckie Hebson,F,40,Bare,F_MR_1_ABPU,59.6,60,105,110,115,115,65,67.5,-68,,67.5,148.5,155,-157.5,,155,337.5,SBD,
1,Colette Brodrick,F,41,Bare,F_MR_1_ABPU,73.75,75,110,117.5,125,125,-65,70,-75,,70,130,-137.5,142.5,,142.5,337.5,SBD,
2,Stephanie Coe,F,42,Bare,F_MR_1_ABPU,67.9,75,122.5,127.5,132.5,132.5,47.5,50,52.5,,52.5,137.5,145,-152.5,,145,330,SBD,
3,Gemma Jones,F,41,Bare,F_MR_1_ABPU,73.7,75,105,-112.5,-112.5,105,62.5,-67.5,-67.5,,62.5,145,-152.5,-152.5,,145,312.5,SBD,
DQ,Natalie Parker #1,F,40,Bare,F_MR_1_ABPU,74.7,75,-110,110,-120,110,60,-65,-65,,60,-142.5,-142.5,-142.5,,,,SBD,
1,Adella Bryan,F,42,Bare,F_MR_1_ABPU,81.1,82.5,127.5,135,140,140,75,80,82.5,,82.5,162.5,170,172.5,,172.5,395,SBD,
2,Rachel Snell,F,40,Bare,F_MR_1_ABPU,81.95,82.5,135,140,-145,140,70,-76,76,,76,150,155,-161,,155,371,SBD,
3,Candice Westaway,F,42,Bare,F_MR_1_ABPU,76.25,82.5,97.5,105,-107.5,105,67.5,-72.5,-72.5,,67.5,132.5,142.5,-145,,142.5,315,SBD,
1,Marie Hume,F,43,Bare,F_MR_1_ABPU,101.5,110,130,-142.5,142.5,142.5,80,85,90,,90,145,155,-162.5,,155,387.5,SBD,
1,Michelle Geraghty-Corns,F,45,Bare,F_MR_2_ABPU,50.35,52,80,-82.5,82.5,82.5,45,47.5,-50,,47.5,115,120,125,,125,255,SBD,
1,Jitka Hall,F,46,Bare,F_MR_2_ABPU,59.95,60,77.5,-87.5,90,90,60,62.5,-65,,62.5,120,132.5,140,,140,292.5,SBD,
DQ,Diane Romano-Woodward,F,69,Bare,F_MR_6_ABPU,74.9,75,-60,,,,,,,,,,,,,,,SBD,
1,Charlie Hooson-Sykes,F,45,Bare,F_MR_2_ABPU,129.4,110+,125,132.5,137.5,137.5,67.5,72.5,-75,,72.5,135,142.5,145,,145,355,SBD,
1,Louise Flatters,F,51,Bare,F_MR_3_ABPU,54.75,56,80,85,90,90,-45,45,50,,50,110,117.5,125,,125,265,SBD,
1,Claire Hand,F,51,Bare,F_MR_3_ABPU,57.35,60,90,95,-97.5,95,52.5,-57.5,-57.5,,52.5,-95,95,100,,100,247.5,SBD,
1,Julie Green #1,F,56,Bare,F_MR_4_ABPU,107.75,110,100,110,120,120,65,67.5,70,,70,120,135,145.5,,145.5,335.5,SBD,
1,Martine Barons,F,63,Bare,F_MR_5_ABPU,86.4,90,80,90,100,100,50,55,-57.5,,55,120,140,145,,145,300,SBD,
1,Catherine Duffy #1,F,65,Bare,F_MR_6_ABPU,58.9,60,82.5,-85,85,85,50,-52.5,52.5,,52.5,105,112.5,-120,,112.5,250,SBD,
1,Michelle Vettese,F,42,Wraps,F_MCR_1_ABPU,58.85,60,120,127.5,-130,127.5,62.5,67.5,-70,,67.5,135,142.5,-147.5,,142.5,337.5,SBD,
1,Amanda Gisby,F,42,Wraps,F_MCR_1_ABPU,64.05,67.5,155,165,-170,165,60,65,-70,,65,155,162.5,-170.5,,162.5,392.5,SBD,
2,Claire Cartlidge,F,40,Wraps,F_MCR_1_ABPU,66.6,67.5,105,115,120,120,55,60,-62.5,,60,130,142.5,150,,150,330,SBD,
3,Laura Morgan,F,41,Wraps,F_MCR_1_ABPU,63.7,67.5,110,115,120,120,55,60,65,,65,120,132.5,-142.5,,132.5,317.5,SBD,
1,Nicola Burroughs,F,41,Wraps,F_MCR_1_ABPU,72.5,75,135,-145,150,150,75,80,82.5,,82.5,145,155,162.5,,162.5,395,SBD,
2,Victoria Woof,F,42,Wraps,F_MCR_1_ABPU,71.45,75,110,120,127.5,127.5,62.5,70,75,,75,140,150,155,,155,357.5,SBD,
3,Fiona Black,F,42,Wraps,F_MCR_1_ABPU,68.5,75,120,-130,130,130,62.5,67.5,-70,,67.5,135,-145,-145,,135,332.5,SBD,
1,Helen Redhead,F,44,Wraps,F_MCR_1_ABPU,85.45,90,127.5,135,141,141,52.5,57.5,60,,60,152.5,160,162.5,,162.5,363.5,SBD,
2,Amy Dixon,F,43,Wraps,F_MCR_1_ABPU,86.35,90,112.5,115,117.5,117.5,67.5,70,-72.5,,70,145,150,-155,,150,337.5,SBD,
1,Clare Nolan,F,42,Wraps,F_MCR_1_ABPU,99.25,100,155,170,-177.5,170,65,-70,-70,,65,150,160,-165,,160,395,SBD,
1,Ashleigh Smailes,F,41,Wraps,F_MCR_1_ABPU,118.25,110+,140,150,155,155,72.5,80,-82.5,,80,150,160,170,,170,405,SBD,
1,Emma Burt,F,48,Wraps,F_MCR_2_ABPU,59.45,60,-90,90,95,95,-47.5,47.5,50,,50,105,-112.5,-112.5,,105,250,SBD,
1,Rebecca Allen #1,F,45,Sleeves,F_MCR_2_ABPU,65.5,67.5,140,147.5,152.5,152.5,65,67.5,70,,70,140,150,155,,155,377.5,SBD,
2,Sheenagh McManus,F,47,Wraps,F_MCR_2_ABPU,66.55,67.5,100,107.5,112.5,112.5,52.5,55,57.5,,57.5,125,130,135,,135,305,SBD,
1,Claire Knight,F,48,Wraps,F_MCR_2_ABPU,74,75,115,117.5,120,120,-62.5,62.5,67.5,,67.5,145,150,155,,155,342.5,SBD,
2,Leah Morgan,F,46,Wraps,F_MCR_2_ABPU,72.65,75,115,122.5,130,130,57.5,62.5,65,,65,127.5,135,142.5,,142.5,337.5,SBD,
3,Nicky Payne,F,49,Wraps,F_MCR_2_ABPU,74.3,75,120,130,132.5,132.5,50,55,-57.5,,55,130,135,-140,,135,322.5,SBD,
1,Donna Bradbury,F,50,Wraps,F_MCR_3_ABPU,59.85,60,125,130,135,135,65,70,72.5,,72.5,137.5,140,145,,145,352.5,SBD,
2,Aneela Rose,F,52,Wraps,F_MCR_3_ABPU,58.75,60,80,90,-95,90,50,52.5,55,,55,100,105,115,,115,260,SBD,
1,Angie Stevens,F,50,Wraps,F_MCR_3_ABPU,66.35,67.5,105,-112.5,112.5,112.5,60,65,67.5,,67.5,122.5,130,135,,135,315,SBD,
1,Kerry Howells,F,53,Wraps,F_MCR_3_ABPU,99.95,100,135,142.5,147.5,147.5,82.5,-86,-86,,82.5,157.5,165,170,,170,400,SBD,
1,Sarah Hulin,F,53,Wraps,F_MCR_3_ABPU,100.55,110,140,147.5,155,155,70,77.5,-83,,77.5,150,157.5,165,,165,397.5,SBD,
1,Annmarie Botha-Jones,F,56,Wraps,F_MCR_4_ABPU,66.9,67.5,135,140,142.5,142.5,62.5,65.5,-67.5,,65.5,120,130,137.5,,137.5,345.5,SBD,
2,Louise Clark #3,F,58,Wraps,F_MCR_4_ABPU,62.05,67.5,115,122.5,127.5,127.5,60,65,67.5,,67.5,125,132.5,142.5,,142.5,337.5,SBD,
3,Sandy Pandya,F,57,Wraps,F_MCR_4_ABPU,63.55,67.5,110,117.5,122.5,122.5,55,60,62.5,,62.5,135,145.5,152.5,,152.5,337.5,SBD,
1,Bev Johnson,F,59,Wraps,F_MCR_4_ABPU,74.05,75,85,92.5,-100,92.5,50,52.5,-55,,52.5,100,110,-115,,110,255,SBD,
1,Louise Wicks,F,55,Wraps,F_MCR_4_ABPU,98.25,100,140,150,155,155,65,70,-75,,70,170,-180,180,,180,405,SBD,
1,Linda Hicks,F,62,Wraps,F_MCR_5_ABPU,73.55,75,95,105,110,110,65,-70,72.5,,72.5,127.5,140,150,,150,332.5,SBD,
1,Jayne West,F,51,Sleeves,F_MCR_3_ABPU,77.55,82.5,100,107.5,117.5,117.5,55,-60,60,,60,122.5,132.5,-137.5,,132.5,310,SBD,
10,Laura Morgan,F,41,Wraps,F_OCR_ABPU,63.7,67.5,110,115,120,120,55,60,65,,65,120,132.5,-142.5,,132.5,317.5,SBD,
1,Hannah Mouland,F,22,Single-ply,F_JES_ABPU,123.4,110+,175,187.5,,187.5,75,85,90,,90,135,145,,,145,422.5,SBD,
1,Amanda Riman,F,37,Single-ply,F_OES_ABPU,73.55,75,195,210,217.5,217.5,97.5,102.5,-107.5,,102.5,142.5,155,162.5,,162.5,482.5,SBD,
2,Katie Lane,F,35,Single-ply,F_OES_ABPU,73.1,75,142.5,155,165,165,85,90,92.5,,92.5,157.5,173,185,,185,442.5,SBD,
1,Gemma Wright,F,31,Single-ply,F_OES_ABPU,95.1,100,240,260,,260,-122.5,122.5,-140,,122.5,175,182.5,-190,,182.5,565,SBD,
1,Elaine Rollo,F,41,Multi-ply,F_MEM_1_BPU,87.05,90,207.5,-217.5,217.5,217.5,135,142.5,147.5,,147.5,-180,180,195,,195,560,SBD,
1,Melanie Clifford,F,45,Multi-ply,F_MEM_2_ABPU,118.45,110+,200,215,218,218,110,117.5,-125,,117.5,120,140,-163,,140,475.5,SBD,
1,Tiana Scott,F,35,Multi-ply,F_OEM_BPU,74.8,75,167.5,177.5,-185,177.5,110,120,127.5,,127.5,150,165,175,,175,480,SBD,
1,Lamorna Bardwell,F,28,Multi-ply,F_OEM_ABPU,51.1,52,140,-150,150,150,82.5,87.5,92.5,,92.5,150,157.5,165,,165,407.5,SBD,
1,Jodie Dyble,F,27,Multi-ply,F_OEM_ABPU,63.9,67.5,170,185,201,201,85,90,-92.5,,90,165,182.5,-187.5,,182.5,473.5,SBD,
1,George Purchase,M,22,Single-ply,M_JES_BPU,119,125,335,350,-365,350,202.5,220,,,220,260,-280,280,,280,850,SBD,
1,Julian Collinson,M,44,Single-ply,M_MES_1_BPU,109.15,110,-280,280,-300,280,210,-217.5,-217.5,,210,255,-270,-270,,255,745,SBD,
1,Richard Curtis,M,41,Single-ply,M_MES_1_ABPU,87.8,90,225,235,-245,235,135,140,-145,,140,-225,225,235,,235,610,SBD,
1,Richard Caine,M,40,Single-ply,M_MES_1_ABPU,124.7,125,250,260,-272.5,260,170,-180,-180,,170,200,220,-240,,220,650,SBD,
1,Scott Chafer,M,50,Single-ply,M_MES_3_BPU,108.5,110,285,302.5,,302.5,175,-185,185,,185,245,-265,-270,,245,732.5,SBD,
1,Tony Chilcott,M,57,Single-ply,M_MES_4_BPU,80.95,82.5,255,275,285,285,165,175,182.5,,182.5,200,220,-232.5,,220,687.5,SBD,
1,John Walsh #1,M,28,Single-ply,M_OES_BPU,97.05,100,305,325,-337.5,325,215,227.5,-235,,227.5,275,-305,-305,,275,827.5,SBD,
1,Scott Chafer,M,50,Single-ply,M_OES_BPU,108.5,110,285,302.5,,302.5,175,-185,185,,185,245,-265,-270,,245,732.5,SBD,
1,George Purchase,M,22,Single-ply,M_OES_BPU,119,125,335,350,-365,350,202.5,220,,,220,260,-280,280,,280,850,SBD,
1,Damien Chaney,M,39,Single-ply,M_OES_ABPU,88.15,90,210,225,235,235,130,140,-150,,140,210,230,242.5,,242.5,617.5,SBD,
1,Kieran Peters,M,35,Single-ply,M_OES_ABPU,99,100,285,302.5,307.5,307.5,185,195,200,,200,280,305,,,305,812.5,SBD,
1,Marcus Stoker,M,28,Single-ply,M_OES_ABPU,131.15,140,315,330,-350,330,170,185,-195,,185,275,295,-305,,295,810,SBD,
2,John Strange,M,39,Single-ply,M_OES_ABPU,137.5,140,-262.5,265,275,275,165,-172.5,-172.5,,165,-275,275,,,275,715,SBD,
1,Mark Townend,M,49,Multi-ply,M_MEM_2_BPU,133.1,140,270,-285,285,285,-255,255,-270,,255,270,285,300,,300,840,SBD,
1,Mark Moss,M,61,Multi-ply,M_MEM_5_ABPU,101.15,110,80,,,80,80,,,,80,100,,,,100,260,SBD,
1,Aaron Fillery,M,36,Multi-ply,M_OEM_BPU,94.4,100,250,275,282.5,282.5,160,,,,160,-250,265,,,265,707.5,SBD,
DQ,Mark Dawson #2,M,27,Multi-ply,M_OEM_ABPU,87.75,90,-255,255,272.5,272.5,-180,,-180,,,,,,,,,SBD,
1,Rhys Lippiatt,M,30,Multi-ply,M_OEM_ABPU,108.1,110,250,260,-272.5,260,120,130,-155,,130,230,242.5,-250,,242.5,632.5,SBD,
DQ,Charlie Roberts,M,19,Multi-ply,M_TEM_3_ABPU,98.2,100,,,,,-150,,,,,,,,,,,B,
1,Jordan Nolan #2,F,33,Wraps,F_OCR_ABPU,51.65,52,92.5,95,97.5,97.5,52.5,55,-60,,55,105,110,120,,120,272.5,SBD,
2,Vikki Brideson,F,36,Wraps,F_OCR_ABPU,50.95,52,-92.5,92.5,-100,92.5,50,-52.5,52.5,,52.5,120,-125,-125,,120,265,SBD,
1,Nicola Brown,F,26,Wraps,F_OCR_ABPU,55.8,56,137.5,147.5,155,155,60,65,-67.5,,65,137.5,150,,,150,370,SBD,
2,Krystal Winter,F,31,Wraps,F_OCR_ABPU,55.25,56,115,125,130,130,57.5,62.5,-65,,62.5,140,150,160,,160,352.5,SBD,
3,Megan Huggins,F,27,Wraps,F_OCR_ABPU,55.45,56,110,122.5,130,130,57.5,65,-67.5,,65,145,155,-160,,155,350,SBD,
4,Phoebe Callison,F,30,Wraps,F_OCR_ABPU,55.9,56,120,127.5,130,130,60,62.5,-65,,62.5,120,125,127.5,,127.5,320,SBD,
5,Natalia Studzinska,F,32,Wraps,F_OCR_ABPU,55.2,56,95,102.5,105,105,45,47.5,-50,,47.5,142.5,152.5,-155,,152.5,305,SBD,
6,Sylwia Pandzierska,F,30,Wraps,F_OCR_ABPU,55.95,56,100,107.5,-115,107.5,50,-55,-55,,50,140,-150,-150,,140,297.5,SBD,
1,Siobhan Read,F,34,Wraps,F_OCR_ABPU,59.95,60,130,140,145,145,82.5,90,-92.5,,90,162.5,175,182.5,,182.5,417.5,SBD,
2,Katie Higham,F,25,Wraps,F_OCR_ABPU,57.7,60,125,130,-132.5,130,65,67.5,70,,70,170,180,182.5,,182.5,382.5,SBD,
3,Pru Mowbray,F,30,Wraps,F_OCR_ABPU,58.9,60,112.5,120,125,125,72.5,77.5,-82.5,,77.5,142.5,150,157.5,,157.5,360,SBD,
4,Rachel Hookway,F,25,Wraps,F_OCR_ABPU,59.45,60,120,130,-135,130,55,60,-62.5,,60,145,162.5,-170,,162.5,352.5,SBD,
5,Abby Collier,F,31,Wraps,F_OCR_ABPU,58.8,60,115,125,130,130,60,65,70,,70,130,-140,142.5,,142.5,342.5,SBD,
6,Zoe Donahue,F,33,Wraps,F_OCR_ABPU,58,60,112.5,120,-125,120,70,72.5,75,,75,135,142.5,-150,,142.5,337.5,SBD,
7,Natasha Perryman,F,30,Wraps,F_OCR_ABPU,59.95,60,107.5,115,122.5,122.5,55,60,62.5,,62.5,130,137.5,-145,,137.5,322.5,SBD,
8,Tiffany Lawrence,F,27,Wraps,F_OCR_ABPU,59.1,60,105,110,-115,110,50,55,-57.5,,55,115,122.5,-127.5,,122.5,287.5,SBD,
1,Lauren Beet,F,34,Wraps,F_OCR_ABPU,66.25,67.5,150,160,165,165,90,95,-100,,95,165,172.5,177.5,,177.5,437.5,SBD,
2,Elizabeth Pipe,F,28,Wraps,F_OCR_ABPU,65.45,67.5,147.5,155,,155,82.5,87.5,-90,,87.5,167.5,177.5,180,,180,422.5,SBD,
3,Katie Rourke,F,29,Wraps,F_OCR_ABPU,67.15,67.5,165,170,175,175,72.5,77.5,80,,80,157.5,167.5,-172.5,,167.5,422.5,SBD,
4,Isabella Cesareo,F,27,Wraps,F_OCR_ABPU,66.65,67.5,145,155,-165,155,70,75,-77.5,,75,170,-183,183,,183,413,SBD,
5,Amy Bolton,F,31,Wraps,F_OCR_ABPU,66.4,67.5,150,160,165,165,62.5,65,67.5,,67.5,140,155,162.5,,162.5,395,SBD,
6,Carly Richardson,F,36,Wraps,F_OCR_ABPU,67,67.5,132.5,142.5,150,150,60,67.5,-72.5,,67.5,150,160,-167.5,,160,377.5,SBD,
7,Kelly Adams #2,F,34,Wraps,F_OCR_ABPU,66.25,67.5,132.5,-142.5,142.5,142.5,60,62.5,65,,65,140,150,152.5,,152.5,360,SBD,
8,Tara McCully,F,31,Wraps,F_OCR_ABPU,66.2,67.5,120,-127.5,-127.5,120,65,67.5,-70,,67.5,140,150,-160,,150,337.5,SBD,
9,Charlotte Hope,F,31,Wraps,F_OCR_ABPU,66.7,67.5,120,127.5,132.5,132.5,52.5,55,-60,,55,130,140,150,,150,337.5,SBD,
11,Blaise White,F,19,Wraps,F_OCR_ABPU,66.55,67.5,95,-100,-100,95,60,62.5,65,,65,140,-145,-145,,140,300,SBD,
1,Katie Bickle,F,25,Wraps,F_OCR_ABPU,74.7,75,160,172.5,180,180,75,80,82.5,,82.5,150,160,-167.5,,160,422.5,SBD,
2,Annie Hodges,F,31,Wraps,F_OCR_ABPU,71.1,75,160,-170,-170,160,70,77.5,85,,85,155,-170,-170,,155,400,SBD,
3,Bryony Fearnley,F,34,Wraps,F_OCR_ABPU,73.85,75,130,137.5,145,145,65,-70,70,,70,145,155,-160,,155,370,SBD,
4,Annemarie Bryan,F,47,Wraps,F_OCR_ABPU,74.4,75,115,125,135,135,65,-72.5,-72.5,,65,170,-185,-185,,170,370,SBD,
5,Verity Page,F,34,Wraps,F_OCR_ABPU,74.65,75,130,132.5,137.5,137.5,65,70,-72.5,,70,145,155,160,,160,367.5,SBD,
6,Clara Sandelind,F,37,Wraps,F_OCR_ABPU,71.7,75,107.5,112.5,117.5,117.5,67.5,-72.5,72.5,,72.5,142.5,152.5,162.5,,162.5,352.5,SBD,
7,Sarah Notman,F,30,Wraps,F_OCR_ABPU,70.25,75,120,-127.5,-127.5,120,75,80,82.5,,82.5,140,-147.5,-147.5,,140,342.5,SBD,
1,Kerry Gallagher,F,34,Wraps,F_OCR_ABPU,82.1,82.5,172.5,182.5,-190,182.5,75,80,82.5,,82.5,165,177.5,182.5,,182.5,447.5,SBD,
2,Cassandra Stonehouse,F,33,Wraps,F_OCR_ABPU,81.45,82.5,140,155,167.5,167.5,45,55,62.5,,62.5,150,167.5,-182.5,,167.5,397.5,SBD,
3,Kelly Adlam,F,31,Wraps,F_OCR_ABPU,81.2,82.5,150,165,-170,165,55,60,-62.5,,60,147.5,160,167.5,,167.5,392.5,SBD,
1,Paige Hurst,F,24,Wraps,F_OCR_ABPU,88.75,90,157.5,170,177.5,177.5,80,85,90,,90,175,190,-195,,190,457.5,SBD,
2,Katie Edwards #3,F,36,Wraps,F_OCR_ABPU,88.6,90,-170,-172.5,172.5,172.5,92.5,97.5,100,,100,170,182.5,-190.5,,182.5,455,SBD,
3,Chloe Brown #4,F,25,Wraps,F_OCR_ABPU,87.8,90,170,180,185,185,85,90,-92.5,,90,150,160,170,,170,445,SBD,
1,Bridget-Jean Lynn,F,24,Wraps,F_OCR_ABPU,99.95,100,130,140,-150,140,60,65,-67.5,,65,160,170,-185,,170,375,SBD,
2,Sophie Lynch,F,28,Wraps,F_OCR_ABPU,95.55,100,127.5,140,145,145,65,72.5,-75,,72.5,125,-132.5,-132.5,,125,342.5,SBD,
1,Hannah Norton,F,37,Wraps,F_OCR_ABPU,132.65,110+,185,205,217.5,217.5,75,80,85,,85,145,160,175,,175,477.5,SBD,
2,Phoebe Wing,F,25,Wraps,F_OCR_ABPU,118.95,110+,190,207.5,-212.5,207.5,70,80,-87.5,,80,155,172.5,-190,,172.5,460,SBD,
