Place,Name,BirthDate,Sex,BirthYear,Age,Country,State,Equipment,Division,Tested,BodyweightKg,WeightClassKg,Squat1Kg,Squat2Kg,Squat3Kg,Best3SquatKg,Squat4Kg,Bench1Kg,Bench2Kg,Bench3Kg,Best3BenchKg,Bench4Kg,Deadlift1Kg,Deadlift2Kg,Deadlift3Kg,Best3DeadliftKg,Deadlift4Kg,TotalKg,Event
1,Kimber Roy,,F,2010,14,,SC,Raw,J13-15,Yes,75.8,82.5,-52.5,52.5,-60,52.5,,35,-40,-50,35,,75,-80,80,80,,167.5,SBD
1,Tabitha Thomas,,F,1976,48,,SC,Raw,M45-49,Yes,81,82.5,85,-100,105,105,,47.5,52.5,-70,52.5,,100,115,132.5,132.5,,290,SBD
1,Lara Ortiz Hernandez,2001-06-26,F,2001,22,,NC,Raw,Open,Yes,81.8,82.5,120,135,142.5,142.5,,55,60,62.5,62.5,,127.5,145,152.5,152.5,,357.5,SBD
2,Briana Del Vecchio,,F,1994,29,,NC,Raw,Open,Yes,80.9,82.5,112.5,120,-130,120,,50,55,-60,55,,122.5,140,147.5,147.5,,322.5,SBD
3,Tabitha Thomas,,F,1976,48,,SC,Raw,Open,Yes,81,82.5,85,-100,105,105,,47.5,52.5,-70,52.5,,100,115,132.5,132.5,,290,SBD
4,Michelle Ravan,,F,1990,34,,SC,Raw,Open,Yes,76,82.5,65,70,-77.5,70,,40,42.5,-47.5,42.5,,82.5,87.5,95,95,,207.5,SBD
1,Kimberly Roundtree,,F,1989,34,,SC,Raw,Open,Yes,87,90,100,110,-120,110,,55,60,62.5,62.5,,120,130,140,140,,312.5,SBD
1,Jess Schaper,,F,1995,29,,SC,Raw,Open,Yes,98.7,100,-110,110,-115,110,,47.5,52.5,-57.5,52.5,,110,117.5,125,125,,287.5,SBD
1,Katherine Pasibe,,F,2005,18,,SC,Raw,J18-19,No,70.9,75,105,115,125,125,,72.5,77.5,82.5,82.5,,133,142.5,152.5,152.5,,360,SBD
1,Megan McCaw,,F,1987,36,,SC,Raw,Open,No,83.2,90,95,105,-115,105,,55,-62.5,-62.5,55,,120,137.5,-145,137.5,,297.5,SBD
1,Tiffany Kuchta,,F,1981,42,,NC,Raw,M40-44,Yes,82.4,82.5,,,,,,67.5,75,77.5,77.5,,,,,,,77.5,B
1,Tiffany Kuchta,,F,1981,42,,NC,Raw,M40-44,Yes,82.4,82.5,,,,,,67.5,75,77.5,77.5,,142.5,155,162.5,162.5,,240,BD
1,Tiffany Kuchta,,F,1981,42,,NC,Raw,Open,Yes,82.4,82.5,,,,,,67.5,75,77.5,77.5,,142.5,155,162.5,162.5,,240,BD
1,Tiffany Kuchta,,F,1981,42,,NC,Raw,M40-44,Yes,82.4,82.5,,,,,,,,,,,142.5,155,162.5,162.5,,162.5,D
1,Tiffany Kuchta,,F,1981,42,,NC,Raw,Open,Yes,82.4,82.5,,,,,,,,,,,142.5,155,162.5,162.5,,162.5,D
1,Christian Carlson,,M,2005,19,,SC,Raw,J18-19,Yes,82.1,82.5,-180,192.5,200,200,,-122.5,130,-135,130,,185,197.5,215,215,,545,SBD
1,Juan Alejandro,,M,2000,23,,SC,Raw,J20-23,Yes,66.1,67.5,120,135,147.5,147.5,,112.5,120,-125,120,,157.5,170,185,185,,452.5,SBD
1,Fernando Ledbetter,,M,2001,22,,SC,Raw,J20-23,Yes,80.3,82.5,187.5,197.5,212.5,212.5,,122.5,130,135,135,,190,-202.5,-210,190,,537.5,SBD
1,Ryan Murphy #5,,M,2001,22,,PA,Raw,J20-23,Yes,88.4,90,167.5,177.5,190,190,,102.5,110,115,115,,200,217.5,232.5,232.5,,537.5,SBD
1,Seth Thomas,,M,2002,22,,SC,Raw,J20-23,Yes,119.6,125,255,267.5,272.5,272.5,,175,190,-197.5,190,,255,272.5,282.5,282.5,,745,SBD
1,Andrew Shenk,,M,1999,24,,PA,Raw,Open,Yes,86.4,90,152.5,160,165,165,,90,95,97.5,97.5,,200,215,227.5,227.5,,490,SBD
1,French Smith,,M,2000,24,,SC,Raw,Open,Yes,124.5,125,-270,290,305,305,,195,207.5,-212.5,207.5,,292.5,312.5,330,330,,842.5,SBD
2,Seth Thomas,,M,2002,22,,SC,Raw,Open,Yes,119.6,125,255,267.5,272.5,272.5,,175,190,-197.5,190,,255,272.5,282.5,282.5,,745,SBD
1,Jacob Shontz,,M,1997,27,,NC,Raw,Open,No,88.4,90,130,160,175,175,,97.5,112.5,-117.5,112.5,,182.5,205,-220,205,,492.5,SBD
1,Richard Simmons,,M,1995,28,,SC,Raw,Open,No,94.1,100,220,237.5,242.5,242.5,,130,142.5,-150,142.5,,260,277.5,285,285,,670,SBD
1,Carlos Luis Alvarez Poveda,,M,2000,24,,NC,Raw,Open,No,111.1,125,192.5,215,237.5,237.5,,142.5,157.5,167.5,167.5,,220,235,-250,235,,640,SBD
2,William McCaw,,M,1979,45,,SC,Raw,Open,No,122.7,125,205,-220,-230,205,,150,160,170,170,,240,250,265,265,,640,SBD
1,Owen Snyder,,M,1998,25,,NC,Raw,Open,No,136.8,140,185,200,215,215,,130,142.5,-147.5,142.5,,220,-235,-235,220,,577.5,SBD
1,Stephen Lawrence,,M,1988,36,,NC,Raw,S35-39,No,133.3,140,192.5,205,-222.5,205,,142.5,145,-150,145,,235,250,272.5,272.5,,622.5,SBD
1,Dartaniel Morgan,,M,1994,30,,NC,Wraps,Open,Yes,96.7,100,205,227.5,247.5,247.5,,145,160,-162.5,160,,237.5,257.5,-265,257.5,,665,SBD
1,Shane Belcher,,M,1996,28,,TN,Wraps,Open,No,108.5,110,240,-270,,240,,-165,-180,180,180,,232.5,-260,-260,232.5,,652.5,SBD
