Division,WeightClassKg,Place,Name,Team,BodyweightKg,Best3SquatKg,Best3BenchKg,Best3DeadliftKg,TotalKg,Equipment,Event,Sex,BirthDate
Boys,51.71,1,Cesar Vazquez,Nixon Smiley,51.26,161.03,92.99,142.88,396.89,Unlimited,SBD,M,
Boys,51.71,2,Marcos Sanchéz #2,San Antonio East Central,50.8,131.54,81.65,138.35,351.53,Unlimited,SBD,M,
Boys,51.71,3,Jesse Segura,Center Point,49.44,142.88,65.77,120.2,328.85,Unlimited,SBD,M,
Boys,51.71,4,Zeke Orosco,Carrizo Springs,46.27,88.45,74.84,122.47,285.76,Unlimited,SBD,M,
Boys,51.71,5,Jakob Mendoza,Del Rio,44.91,90.72,49.9,86.18,226.8,Unlimited,SBD,M,
Boys,51.71,DQ,Andrew Meza,Nixon Smiley,51.71,,,,,Unlimited,SBD,M,
Boys,51.71,DQ,Mark Garcia,Pearsall,51.71,,,,,Unlimited,SBD,M,
Boys,51.71,DQ,Ricky Medina,Somerset,51.26,161.03,,,,Unlimited,SBD,M,
Boys,55.79,1,Joshua Ramirez,Somerset,55.34,183.7,90.72,174.63,449.06,Unlimited,SBD,M,
Boys,55.79,2,Tadeo Talavera,Del Rio,54.88,172.37,102.06,156.49,430.91,Unlimited,SBD,M,
Boys,55.79,3,Anthony Mata,Somerset,54.88,163.29,90.72,131.54,385.55,Unlimited,SBD,M,
Boys,55.79,4,Alejandro Briseno,Pearsall,54.43,149.69,86.18,145.15,381.02,Unlimited,SBD,M,
Boys,55.79,5,Khali Jantes,Nixon Smiley,54.88,145.15,88.45,142.88,376.48,Unlimited,SBD,M,
Boys,55.79,6,Eduardo Betancourt,Nixon Smiley,55.79,142.88,77.11,151.95,371.95,Unlimited,SBD,M,
Boys,55.79,7,Albert Palcios,Blanco,54.43,117.93,86.18,127.01,331.12,Unlimited,SBD,M,
Boys,55.79,8,Oami Gutierrez,Uvalde,54.88,115.67,65.77,124.74,306.17,Unlimited,SBD,M,
Boys,55.79,9,Derek Rodriquez,Pearsall,55.79,117.93,74.84,111.13,303.91,Unlimited,SBD,M,
Boys,55.79,10,Zachary Goodin,Bandera,55.79,115.67,61.23,120.2,297.1,Unlimited,SBD,M,
Boys,55.79,DQ,Aidan Ayala,San Antonio Cole,54.43,129.27,63.5,,,Unlimited,SBD,M,
Boys,59.87,1,Erik Mendoza,San Antonio Cole,58.06,174.63,113.4,201.85,489.88,Unlimited,SBD,M,
Boys,59.87,2,Reymundo Falcon,Carrizo Springs,57.61,142.88,108.86,147.42,399.16,Unlimited,SBD,M,
Boys,59.87,3,Jayden Segura,Center Point,58.51,161.03,102.06,136.08,399.16,Unlimited,SBD,M,
Boys,59.87,4,Vincent Privitera,San Antonio Cole,59.87,145.15,74.84,165.56,385.55,Unlimited,SBD,M,
Boys,59.87,5,Gage Perez,Uvalde,58.06,149.69,79.38,151.95,381.02,Unlimited,SBD,M,
Boys,59.87,6,Pete De Leon,San Antonio Cole,58.97,127.01,70.31,154.22,351.53,Unlimited,SBD,M,
Boys,59.87,7,Carlos Perez,Blanco,57.61,111.13,81.65,147.42,340.19,Unlimited,SBD,M,
Boys,59.87,8,Gabriel Aguirre,Center Point,59.87,136.08,68.04,131.54,335.66,Unlimited,SBD,M,
Boys,59.87,9,Reynaldo Solla Villegas,San Antonio Cole,58.51,124.74,63.5,142.88,331.12,Unlimited,SBD,M,
Boys,59.87,10,Logan Sendejo,Uvalde,58.51,129.27,63.5,133.81,326.59,Unlimited,SBD,M,
Boys,59.87,11,Marcus DeLeon,Center Point,57.61,129.27,65.77,124.74,319.78,Unlimited,SBD,M,
Boys,59.87,12,Ryan Tobiason,San Antonio Cole,59.87,106.59,74.84,106.59,288.03,Unlimited,SBD,M,
Boys,59.87,13,Rocky Aguirre,Carrizo Springs,58.97,58.97,34.02,99.79,192.78,Unlimited,SBD,M,
Boys,59.87,DQ,Robbie Jimenez,Blanco,59.87,,,,,Unlimited,SBD,M,
Boys,59.87,DQ,Jesse Cardenas,San Antonio East Central,59.87,,,,,Unlimited,SBD,M,
Boys,67.13,1,Mauricio Gallegos,Center Point,66.68,226.8,147.42,224.53,598.74,Unlimited,SBD,M,
Boys,67.13,2,Andre Aguirre,Uvalde,65.32,217.72,117.93,197.31,532.97,Unlimited,SBD,M,
Boys,67.13,3,Blake Frye,Somerset,63.96,215.46,102.06,204.12,521.63,Unlimited,SBD,M,
Boys,67.13,4,Frankie Guzman,Del Rio,63.5,176.9,131.54,190.51,498.95,Unlimited,SBD,M,
Boys,67.13,5,Israel Chavez,San Antonio Cole,64.41,183.7,90.72,210.92,485.34,Unlimited,SBD,M,
Boys,67.13,6,Brian Perez,Blanco,64.41,174.63,102.06,174.63,451.32,Unlimited,SBD,M,
Boys,67.13,7,Eric Rodriquez,Nixon Smiley,65.32,156.49,120.2,165.56,442.25,Unlimited,SBD,M,
Boys,67.13,8,John Garza,Nixon Smiley,64.86,165.56,92.99,158.76,417.3,Unlimited,SBD,M,
Boys,67.13,9,Coleton Ledesma,Blanco,64.41,133.81,92.99,145.15,371.95,Unlimited,SBD,M,
Boys,67.13,10,Benjamin Martinez,Center Point,66.68,142.88,61.23,149.69,353.8,Unlimited,SBD,M,
Boys,67.13,11,Hunter Knight,Somerset,63.96,142.88,90.72,117.93,351.53,Unlimited,SBD,M,
Boys,67.13,12,Dylan Del Toro Ortiz,Pearsall,66.22,129.27,74.84,136.08,340.19,Unlimited,SBD,M,
Boys,67.13,13,Pedro Perez,Somerset,66.68,124.74,70.31,124.74,319.78,Unlimited,SBD,M,
Boys,67.13,14,Michael Clinton,San Antonio Cole,64.41,113.4,70.31,113.4,297.1,Unlimited,SBD,M,
Boys,67.13,15,Tony Olvera,Somerset,63.96,102.06,61.23,102.06,265.35,Unlimited,SBD,M,
Boys,67.13,DQ,Kaeden Jorell Parker,San Antonio Cole,67.13,,,,,Unlimited,SBD,M,
Boys,67.13,DQ,Juan Garcia,Center Point,67.13,,,,,Unlimited,SBD,M,
Boys,67.13,DQ,Rj Caraballo,Center Point,67.13,,,,,Unlimited,SBD,M,
Boys,67.13,DQ,Michael Titsworth,Carrizo Springs,67.13,,,,,Unlimited,SBD,M,
Boys,67.13,DQ,Alejandro Bustamante,Carrizo Springs,67.13,,,,,Unlimited,SBD,M,
Boys,74.84,1,Josiah Lugo,Somerset,74.39,317.51,190.51,238.14,746.16,Unlimited,SBD,M,
Boys,74.84,2,Jorge Herrera,Del Rio,72.12,254.01,142.88,215.46,612.35,Unlimited,SBD,M,
Boys,74.84,3,Tristan Coronado,Del Rio,70.76,215.46,120.2,206.38,542.04,Unlimited,SBD,M,
Boys,74.84,4,Marcus Vela,San Antonio East Central,74.39,208.65,122.47,204.12,535.24,Unlimited,SBD,M,
Boys,74.84,5,Carlos Salazar,Carrizo Springs,73.94,206.38,115.67,206.38,528.44,Unlimited,SBD,M,
Boys,74.84,6,Matthew Chavez,Bandera,74.39,201.85,127.01,199.58,528.44,Unlimited,SBD,M,
Boys,74.84,7,Adolfo Vazquez #2,Nixon Smiley,73.94,206.38,108.86,197.31,512.56,Unlimited,SBD,M,
Boys,74.84,8,Justin Burgess,Somerset,74.39,190.51,108.86,197.31,496.68,Unlimited,SBD,M,
Boys,74.84,9,Miguel Valerio,Nixon Smiley,73.94,183.7,133.81,172.37,489.88,Unlimited,SBD,M,
Boys,74.84,10,Ian Gest,Carrizo Springs,73.03,163.29,117.93,161.03,442.25,Unlimited,SBD,M,
Boys,74.84,11,Goliath Gonzalez,Pearsall,71.67,163.29,108.86,167.83,439.98,Unlimited,SBD,M,
Boys,74.84,12,John Alvarez,Somerset,74.39,174.63,97.52,145.15,417.3,Unlimited,SBD,M,
Boys,74.84,13,Martin Rosales,Pearsall,72.12,165.56,95.25,151.95,412.77,Unlimited,SBD,M,
Boys,74.84,14,Adrian Sandoval,Somerset,73.94,79.38,58.97,120.2,258.55,Unlimited,SBD,M,
Boys,74.84,DQ,Ashton Robinson,Bandera,74.84,,,,,Unlimited,SBD,M,
Boys,74.84,DQ,Santos Soto,San Antonio East Central,74.84,,,,,Unlimited,SBD,M,
Boys,74.84,DQ,Casey Vincent,Center Point,74.84,,,,,Unlimited,SBD,M,
Boys,74.84,DQ,Ryder Moorman,Blanco,74.84,,,,,Unlimited,SBD,M,
Boys,82.1,1,Moses Fernandez,Del Rio,80.74,231.33,127.01,247.21,605.55,Unlimited,SBD,M,
Boys,82.1,2,Luis Rodriguez,Del Rio,79.38,226.8,149.69,226.8,603.28,Unlimited,SBD,M,
Boys,82.1,3,Michael Reyes,Carrizo Springs,77.11,195.04,151.95,208.65,555.65,Unlimited,SBD,M,
Boys,82.1,4,Daniel Bustamante,San Antonio East Central,82.1,183.7,120.2,195.04,498.95,Unlimited,SBD,M,
Boys,82.1,5,Christian Cobb,San Antonio Cole,79.38,142.88,88.45,165.56,396.89,Unlimited,SBD,M,
Boys,82.1,6,Rodrigo Urequieta,San Antonio Cole,77.56,145.15,77.11,147.42,369.68,Unlimited,SBD,M,
Boys,82.1,7,Gavin Garcia,Nixon Smiley,80.29,131.54,86.18,145.15,362.87,Unlimited,SBD,M,
Boys,82.1,8,Jayden Juarez,Carrizo Springs,79.83,90.72,63.5,140.61,294.84,Unlimited,SBD,M,
Boys,82.1,9,Ryan Ramirez,Pearsall,81.19,90.72,61.23,120.2,272.16,Unlimited,SBD,M,
Boys,82.1,DQ,Jorge Riojas,Pearsall,82.1,,,,,Unlimited,SBD,M,
Boys,82.1,DQ,Logan Schwarzlose,Blanco,82.1,,,,,Unlimited,SBD,M,
Boys,82.1,DQ,Trey Atchley,Blanco,82.1,,,,,Unlimited,SBD,M,
Boys,89.81,1,Chuy Vasquez,Uvalde,86.18,249.48,174.63,247.21,671.32,Unlimited,SBD,M,
Boys,89.81,2,Jesus Espino,Nixon Smiley,89.81,256.28,176.9,231.33,664.51,Unlimited,SBD,M,
Boys,89.81,3,Domingo Sanchez,Del Rio,84.82,256.28,158.76,222.26,637.3,Unlimited,SBD,M,
Boys,89.81,4,Ryan Baron,Uvalde,89.36,229.06,165.56,183.7,578.33,Unlimited,SBD,M,
Boys,89.81,5,Samuel Lopez,San Antonio Cole,85.28,217.72,136.08,222.26,576.06,Unlimited,SBD,M,
Boys,89.81,6,Omar Campos,Somerset,89.36,235.87,113.4,208.65,557.92,Unlimited,SBD,M,
Boys,89.81,7,Luis Garcia,Blanco,84.37,172.37,190.51,183.7,546.58,Unlimited,SBD,M,
Boys,89.81,8,Robert Rosas,San Antonio East Central,89.36,199.58,106.59,201.85,508.02,Unlimited,SBD,M,
Boys,89.81,9,Alex Flowers,San Antonio Cole,89.36,183.7,102.06,217.72,503.49,Unlimited,SBD,M,
Boys,89.81,10,Alan Espino,Nixon Smiley,88,188.24,113.4,183.7,485.34,Unlimited,SBD,M,
Boys,89.81,11,Jaylun Rodriguez,Nixon Smiley,86.18,188.24,106.59,183.7,478.54,Unlimited,SBD,M,
Boys,89.81,12,Slade Newcomb,Center Point,85.73,183.7,102.06,170.1,455.86,Unlimited,SBD,M,
Boys,89.81,13,Jakob Vallado,Somerset,86.64,179.17,92.99,165.56,437.72,Unlimited,SBD,M,
Boys,89.81,14,Emanual Thomas,San Antonio Cole,86.18,102.06,34.02,136.08,272.16,Unlimited,SBD,M,
Boys,89.81,DQ,Matt Hernandez,Somerset,89.81,,,,,Unlimited,SBD,M,
Boys,89.81,DQ,Ethan Boyd,Bandera,89.81,,,,,Unlimited,SBD,M,
Boys,89.81,DQ,Chandler Moore,Bandera,89.81,,,,,Unlimited,SBD,M,
Boys,99.79,1,Caleb Rodriguez,Del Rio,98.43,283.5,185.97,219.99,689.46,Unlimited,SBD,M,
Boys,99.79,2,Malakai Lara,Uvalde,94.8,240.4,190.51,226.8,657.71,Unlimited,SBD,M,
Boys,99.79,3,Miguel Silva,Carrizo Springs,96.62,238.14,170.1,240.4,648.64,Unlimited,SBD,M,
Boys,99.79,4,Donovan Hector,Blanco,96.16,249.48,158.76,217.72,625.96,Unlimited,SBD,M,
Boys,99.79,5,Julio Jimenez,Carrizo Springs,99.79,229.06,142.88,226.8,598.74,Unlimited,SBD,M,
Boys,99.79,6,Jesse Cordova,Carrizo Springs,96.62,210.92,154.22,206.38,571.53,Unlimited,SBD,M,
Boys,99.79,7,Chase Howell,San Antonio Cole,91.63,208.65,131.54,226.8,566.99,Unlimited,SBD,M,
Boys,99.79,8,Matthew Gutierrez,Carrizo Springs,98.88,192.78,154.22,174.63,521.63,Unlimited,SBD,M,
Boys,99.79,9,Jp Peralta,Center Point,98.43,210.92,120.2,183.7,514.83,Unlimited,SBD,M,
Boys,99.79,10,Tyson Toscano,San Antonio East Central,95.71,208.65,115.67,181.44,505.76,Unlimited,SBD,M,
Boys,99.79,11,Trent Smith,Blanco,97.52,185.97,127.01,185.97,498.95,Unlimited,SBD,M,
Boys,99.79,12,Jordan Trujillo,Carrizo Springs,97.52,172.37,142.88,181.44,496.68,Unlimited,SBD,M,
Boys,99.79,13,Robert Vidales,San Antonio East Central,97.07,199.58,102.06,183.7,485.34,Unlimited,SBD,M,
Boys,99.79,14,Dominick Nava,Somerset,93.44,179.17,102.06,188.24,469.47,Unlimited,SBD,M,
Boys,99.79,15,Wyatt Reed,Center Point,92.08,163.29,95.25,163.29,421.84,Unlimited,SBD,M,
Boys,99.79,16,Rylan Diaz,Uvalde,95.25,244.94,133.81,,378.75,Unlimited,SB,M,
Boys,99.79,17,Ryan Aaron Rios,San Antonio Cole,94.35,136.08,86.18,124.74,347,Unlimited,SBD,M,
Boys,99.79,DQ,Mark Williams,San Antonio Cole,99.79,,,,,Unlimited,SBD,M,
Boys,99.79,DQ,Dominick Rodriquez,Center Point,99.79,,,,,Unlimited,SBD,M,
Boys,99.79,DQ,Gracen Martin,Nixon Smiley,99.79,,,,,Unlimited,SBD,M,
Boys,99.79,DQ,Isaac Cervantes,Center Point,99.79,,,,,Unlimited,SBD,M,
Boys,99.79,DQ,Jaden Fuentes,Somerset,95.71,226.8,,,,Unlimited,SBD,M,
Boys,109.77,1,Marcus Serda,San Antonio East Central,107.05,256.28,192.78,249.48,698.53,Unlimited,SBD,M,
Boys,109.77,2,George Avalos,Del Rio,108.41,278.96,156.49,258.55,694,Unlimited,SBD,M,
Boys,109.77,3,Kaden Elrod,Blanco,104.33,278.96,161.03,224.53,664.51,Unlimited,SBD,M,
Boys,109.77,4,Jd Spurlock,Somerset,109.32,265.35,156.49,201.85,623.69,Unlimited,SBD,M,
Boys,109.77,5,Manuel Gutierrez,Carrizo Springs,107.05,210.92,149.69,183.7,544.31,Unlimited,SBD,M,
Boys,109.77,6,Jeremiah Torres,Pearsall,101.6,174.63,83.91,156.49,415.04,Unlimited,SBD,M,
Boys,109.77,7,Skylar Woodward,San Antonio East Central,106.59,158.76,104.33,136.08,399.16,Unlimited,SBD,M,
Boys,109.77,DQ,Marcos Garcia,Carrizo Springs,109.77,,,,,Unlimited,SBD,M,
Boys,109.77,DQ,Andrew Torres,Carrizo Springs,109.77,,,,,Unlimited,SBD,M,
Boys,124.74,1,Aaron Graves,Uvalde,115.67,267.62,201.85,217.72,687.19,Unlimited,SBD,M,
Boys,124.74,2,Eladio Valdez,Center Point,117.48,260.82,149.69,226.8,637.3,Unlimited,SBD,M,
Boys,124.74,3,Alejandro Sanchez,San Antonio East Central,120.2,247.21,113.4,226.8,587.4,Unlimited,SBD,M,
Boys,124.74,4,Hunter Gonzalez,Pearsall,122.02,233.6,142.88,183.7,560.19,Unlimited,SBD,M,
Boys,124.74,5,Jaden Mirelez,Uvalde,117.03,215.46,113.4,174.63,503.49,Unlimited,SBD,M,
Boys,124.74,6,Keath Taylor,Carrizo Springs,122.02,174.63,111.13,195.04,480.81,Unlimited,SBD,M,
Boys,124.74,7,Rey Lopez,Carrizo Springs,116.12,179.17,102.06,172.37,453.59,Unlimited,SBD,M,
Boys,124.74,8,Nate Evans,Bandera,120.66,179.17,83.91,142.88,405.97,Unlimited,SBD,M,
Boys,124.74,9,Ayden Valdaez,Somerset,124.74,154.22,88.45,151.95,394.63,Unlimited,SBD,M,
Boys,124.74,10,Isaiah Garcia,Somerset,116.12,83.91,43.09,83.91,210.92,Unlimited,SBD,M,
Boys,124.74,DQ,Roger McCrobie,Bandera,124.74,,,,,Unlimited,SBD,M,
Boys,124.74,DQ,Ayden Pantoja,Somerset,115.67,183.7,,,,Unlimited,SBD,M,
Boys,139.71,1,Joaquinn Fuentes,Del Rio,125.19,288.03,167.83,265.35,721.21,Unlimited,SBD,M,
Boys,139.71,2,Tacori Cook,Somerset,139.25,249.48,158.76,217.72,625.96,Unlimited,SBD,M,
Boys,139.71,3,Ponciano Alvarez,San Antonio East Central,130.18,235.87,158.76,215.46,610.08,Unlimited,SBD,M,
Boys,139.71,4,Adam Barbosa,Uvalde,125.65,231.33,151.95,213.19,596.47,Unlimited,SBD,M,
Boys,139.71,5,Fermin Barbosa,Uvalde,126.55,215.46,131.54,213.19,560.19,Unlimited,SBD,M,
Boys,139.71,6,Jesus Silva,Carrizo Springs,127.91,185.97,102.06,183.7,471.74,Unlimited,SBD,M,
Boys,139.71,7,Kaleb Cruz,Carrizo Springs,126.55,172.37,106.59,183.7,462.66,Unlimited,SBD,M,
Boys,139.71+,1,Jakob Perez,Somerset,152.86,265.35,179.17,204.12,648.64,Unlimited,SBD,M,
Boys,139.71+,2,Joe Meza,Del Rio,140.16,231.33,188.24,217.72,637.3,Unlimited,SBD,M,
Boys,139.71+,3,Lyndell Cook,Somerset,141.97,172.37,172.37,217.72,562.45,Unlimited,SBD,M,
Boys,139.71+,4,Javier Santos,Carrizo Springs,146.51,195.04,81.65,174.63,451.32,Unlimited,SBD,M,
Boys,139.71+,5,Jeremiah Trevino,Uvalde,153.77,170.1,104.33,154.22,428.64,Unlimited,SBD,M,
Boys,139.71+,DQ,Adriel Gonzalez,Uvalde,144.24,,,,,Unlimited,SBD,M,
Boys,139.71+,DQ,Jerry Rodriguez,Carrizo Springs,140.61,,,,,Unlimited,SBD,M,
