Division,WeightClassKg,Place,Name,Team,BodyweightKg,Best3SquatKg,Best3BenchKg,Best3DeadliftKg,TotalKg,Equipment,Event,Sex
Girls,44.23,1,Amber Gallegos,San Diego,41.37,79.38,54.43,99.79,233.6,Single-ply,SBD,F
Girls,44.23,2,Madelyn Rendon,Kingsville King,44.18,83.91,38.56,102.06,224.53,Single-ply,SBD,F
Girls,44.23,DQ,Cailin Lopez,Gregory-Portland,44.18,72.57,54.43,,,Single-ply,SBD,F
Girls,47.85,1,Reina de la Paz,Santa Gertrudis Academy,47.63,113.4,63.5,133.81,310.71,Single-ply,SBD,F
Girls,47.85,2,Leanna Rodriguez,Alice,47.54,97.52,40.82,102.06,240.4,Single-ply,SBD,F
Girls,47.85,3,Ananda Lopez,Robstown,46.72,97.52,38.56,99.79,235.87,Single-ply,SBD,F
Girls,47.85,4,Myndi Garcia,Corpus Christi Tuloso-Midway,47.17,102.06,45.36,88.45,235.87,Single-ply,SBD,F
Girls,47.85,5,Isabella Adams,Sinton,45.63,88.45,43.09,92.99,224.53,Single-ply,SBD,F
Girls,47.85,6,Miranda Ortiz,Alice,44.36,88.45,36.29,77.11,201.85,Single-ply,SBD,F
Girls,47.85,DQ,Reiann Longoria,Corpus Christi John Paul II High School,44.36,,,,,Single-ply,SBD,F
Girls,51.94,1,Mia Reyes,Corpus Christi Tuloso-Midway,50.8,127.01,65.77,138.35,331.12,Single-ply,SBD,F
Girls,51.94,2,Rose Bustos,Gregory-Portland,50.35,120.2,49.9,117.93,288.03,Single-ply,SBD,F
Girls,51.94,3,Juliana Vasquez,Corpus Christi Tuloso-Midway,51.26,99.79,58.97,102.06,260.82,Single-ply,SBD,F
Girls,51.94,4,Hannah Saegert,Rockport-Fulton,50.71,111.13,40.82,106.59,258.55,Single-ply,SBD,F
Girls,51.94,5,Joslyn Lopez,Gregory-Portland,48.81,72.57,38.56,95.25,206.38,Single-ply,SBD,F
Girls,51.94,DQ,Abby Saegert,Rockport-Fulton,48.63,,,,,Single-ply,SBD,F
Girls,56.02,1,Haley Svadlenak,Gregory-Portland,54.88,145.15,65.77,127.01,337.93,Single-ply,SBD,F
Girls,56.02,2,Emily Allen,Corpus Christi Tuloso-Midway,54.88,111.13,49.9,117.93,278.96,Single-ply,SBD,F
Girls,56.02,3,Maddie Johnson,Corpus Christi Tuloso-Midway,55.34,106.59,54.43,102.06,263.08,Single-ply,SBD,F
Girls,56.02,4,Iliana Garza,Santa Gertrudis Academy,55.16,102.06,38.56,104.33,244.94,Single-ply,SBD,F
Girls,56.02,5,Melina Vela,Alice,55.25,83.91,47.63,113.4,244.94,Single-ply,SBD,F
Girls,56.02,6,ReAnna Olvera,San Diego,55.79,92.99,49.9,97.52,240.4,Single-ply,SBD,F
Girls,56.02,7,Lindzee Garza,Robstown,55.97,86.18,40.82,106.59,233.6,Single-ply,SBD,F
Girls,56.02,8,Hailey Figueroa,Alice,54.79,88.45,43.09,88.45,219.99,Single-ply,SBD,F
Girls,56.02,9,McKenzie Estrada,Gregory-Portland,52.16,99.79,31.75,86.18,217.72,Single-ply,SBD,F
Girls,56.02,DQ,Valeria Ramirez,Rockport-Fulton,55.97,92.99,,,,Single-ply,SBD,F
Girls,56.02,DQ,Illiana Cortinas,Robstown,54.34,,,,,Single-ply,SBD,F
Girls,60.1,1,Julianna Perez,Corpus Christi Tuloso-Midway,58.97,165.56,81.65,138.35,385.55,Single-ply,SBD,F
Girls,60.1,2,Isabella Gonzales,Kingsville King,58.88,138.35,63.5,142.88,344.73,Single-ply,SBD,F
Girls,60.1,3,Mikayla Martinez,Beeville Jones,58.6,104.33,72.57,115.67,292.57,Single-ply,SBD,F
Girls,60.1,4,Camille Yeltatzie,Gregory-Portland,59.78,111.13,54.43,122.47,288.03,Single-ply,SBD,F
Girls,60.1,5,Emma Brice,Orange Grove,56.52,115.67,52.16,104.33,272.16,Single-ply,SBD,F
Girls,60.1,6,Adrianna Cruz,Corpus Christi Tuloso-Midway,59.87,97.52,52.16,117.93,267.62,Single-ply,SBD,F
Girls,60.1,7,LaShandra Hallett,Kingsville King,59.15,95.25,49.9,115.67,260.82,Single-ply,SBD,F
Girls,60.1,8,Bianca Guzman,Corpus Christi Tuloso-Midway,58.97,104.33,45.36,106.59,256.28,Single-ply,SBD,F
Girls,60.1,9,Samantha Pacheco,Robstown,60.06,99.79,45.36,102.06,247.21,Single-ply,SBD,F
Girls,60.1,10,Lourdes Rodriguez,Robstown,59.6,79.38,43.09,97.52,219.99,Single-ply,SBD,F
Girls,60.1,11,Jasmin Canizales,Sinton,59.96,79.38,43.09,92.99,215.46,Single-ply,SBD,F
Girls,60.1,12,Jackie McClendon,Corpus Christi Calallen,58.6,77.11,36.29,90.72,204.12,Single-ply,SBD,F
Girls,60.1,13,Victoria Garcia,Rockport-Fulton,58.97,70.31,34.02,86.18,190.51,Single-ply,SBD,F
Girls,60.1,14,Clarissa Martinez,Robstown,59.6,63.5,29.48,92.99,185.97,Single-ply,SBD,F
Girls,60.1,DQ,Morgan Candela,Corpus Christi Tuloso-Midway,59.42,136.08,,,,Single-ply,SBD,F
Girls,60.1,DQ,Gabriella Ramos,Robstown,60.06,90.72,,,,Single-ply,SBD,F
Girls,60.1,DQ,Jaz Garza,Corpus Christi John Paul II High School,59.6,,,,,Single-ply,SBD,F
Girls,67.36,1,Ellie Carrillo,San Diego,66.5,163.29,88.45,154.22,405.97,Single-ply,SBD,F
Girls,67.36,2,Courtney Lamontange,Corpus Christi Tuloso-Midway,66.22,145.15,68.04,158.76,371.95,Single-ply,SBD,F
Girls,67.36,3,Amidy Moreno,Beeville Jones,65.32,149.69,74.84,136.08,360.61,Single-ply,SBD,F
Girls,67.36,4,Destiny Villegas,Beeville Jones,65.23,120.2,70.31,131.54,322.05,Single-ply,SBD,F
Girls,67.36,5,Madeline Dougherty,Skidmore-Tynan,63.78,113.4,61.23,124.74,299.37,Single-ply,SBD,F
Girls,67.36,6,Hannah Garcia,Rockport-Fulton,62.51,117.93,54.43,113.4,285.76,Single-ply,SBD,F
Girls,67.36,7,Samantha Ware,Gregory-Portland,60.6,104.33,61.23,102.06,267.62,Single-ply,SBD,F
Girls,67.36,8,Alex Gonzalez #1,San Diego,60.87,83.91,58.97,115.67,258.55,Single-ply,SBD,F
Girls,67.36,9,Lorenna Nino,Corpus Christi Tuloso-Midway,66.68,97.52,45.36,108.86,251.74,Single-ply,SBD,F
Girls,67.36,10,Natalia Canelo,Orange Grove,61.23,83.91,38.56,102.06,224.53,Single-ply,SBD,F
Girls,67.36,11,Cassandra Moreida,Alice,63.32,88.45,36.29,90.72,215.46,Single-ply,SBD,F
Girls,67.36,12,Ayslian Garcia,Rockport-Fulton,63.78,79.38,34.02,88.45,201.85,Single-ply,SBD,F
Girls,67.36,13,Amy Ayala,Corpus Christi John Paul II High School,62.69,58.97,31.75,81.65,172.37,Single-ply,SBD,F
Girls,67.36,DQ,Justine Rodriguez,Sinton,63.32,,,,,Single-ply,SBD,F
Girls,67.36,DQ,Angelica Beltran,Beeville Jones,63.59,113.4,,,,Single-ply,SBD,F
Girls,67.36,DQ,Realynn Flores,Corpus Christi Tuloso-Midway,67.13,108.86,,,,Single-ply,SBD,F
Girls,75.07,1,Mercedes Rodriguez,San Diego,72.57,181.44,86.18,170.1,437.72,Single-ply,SBD,F
Girls,75.07,2,Desiree Gonzales #1,Beeville Jones,74.93,142.88,99.79,145.15,387.82,Single-ply,SBD,F
Girls,75.07,3,Tori Contretas,Beeville Jones,68.95,154.22,70.31,145.15,369.68,Single-ply,SBD,F
Girls,75.07,4,Emily Rodriguez #5,Beeville Jones,73.03,142.88,83.91,140.61,367.41,Single-ply,SBD,F
Girls,75.07,5,Samantha Sullivan,Corpus Christi John Paul II High School,73.3,151.95,49.9,158.76,360.61,Single-ply,SBD,F
Girls,75.07,6,Makayla Markham,Alice,72.48,133.81,79.38,131.54,344.73,Single-ply,SBD,F
Girls,75.07,7,Ysabella Munoz,Alice,71.76,127.01,49.9,138.35,315.25,Single-ply,SBD,F
Girls,75.07,8,Gisele Covarrubias,Robstown,75.02,111.13,65.77,129.27,306.17,Single-ply,SBD,F
Girls,75.07,9,Lauren Zamaripa,Gregory-Portland,74.66,106.59,52.16,113.4,272.16,Single-ply,SBD,F
Girls,75.07,10,Camdyn Grumbles,Gregory-Portland,73.66,113.4,45.36,111.13,269.89,Single-ply,SBD,F
Girls,75.07,11,Selina Castillo,Santa Gertrudis Academy,71.85,90.72,47.63,129.27,267.62,Single-ply,SBD,F
Girls,75.07,12,Lexi Guzman,Gregory-Portland,70.67,92.99,47.63,120.2,260.82,Single-ply,SBD,F
Girls,75.07,13,Aubrey Benavidez,Santa Gertrudis Academy,72.67,92.99,49.9,102.06,244.94,Single-ply,SBD,F
Girls,75.07,14,Gabriella Moya,Santa Gertrudis Academy,74.75,81.65,40.82,113.4,235.87,Single-ply,SBD,F
Girls,75.07,15,Alexis Gomez #1,Sinton,72.12,90.72,38.56,90.72,219.99,Single-ply,SBD,F
Girls,75.07,16,Kassidy Lee,Orange Grove,74.48,86.18,34.02,83.91,204.12,Single-ply,SBD,F
Girls,75.07,DQ,Eliza Lopez,Gregory-Portland,74.3,111.13,,,,Single-ply,SBD,F
Girls,75.07,DQ,Madison Calderon,Corpus Christi Tuloso-Midway,73.94,161.03,,,,Single-ply,SBD,F
Girls,75.07,DQ,Samaira Camacho,Sinton,74.03,,,,,Single-ply,SBD,F
Girls,75.07,DQ,Madalyn Hernandez,Santa Gertrudis Academy,74.57,,,,,Single-ply,SBD,F
Girls,82.33,1,Lonna Gonzalez,San Diego,80.65,142.88,79.38,122.47,344.73,Single-ply,SBD,F
Girls,82.33,2,Makayla Johnson,Santa Gertrudis Academy,80.92,136.08,65.77,142.88,344.73,Single-ply,SBD,F
Girls,82.33,3,Zoie Hartman,Corpus Christi Calallen,80.1,127.01,61.23,136.08,324.32,Single-ply,SBD,F
Girls,82.33,4,Taylor Ramirez,Sinton,82.28,140.61,56.7,124.74,322.05,Single-ply,SBD,F
Girls,82.33,5,Charlotte Lanham,Corpus Christi Calallen,81.28,108.86,52.16,127.01,288.03,Single-ply,SBD,F
Girls,82.33,6,Arianna Borrego,Beeville Jones,79.92,97.52,63.5,124.74,285.76,Single-ply,SBD,F
Girls,82.33,7,Leandra Valdez,Corpus Christi Tuloso-Midway,81.65,104.33,40.82,106.59,251.74,Single-ply,SBD,F
Girls,82.33,8,Larissa Rodriguez,Santa Gertrudis Academy,81.92,88.45,43.09,102.06,233.6,Single-ply,SBD,F
Girls,82.33,9,Isabelle Randall,Rockport-Fulton,80.47,79.38,43.09,104.33,226.8,Single-ply,SBD,F
Girls,82.33,10,Maegan Grapestine,Corpus Christi Calallen,80.2,68.04,38.56,92.99,199.58,Single-ply,SBD,F
Girls,82.33,11,Aliyah Hunter,Rockport-Fulton,75.57,79.38,43.09,70.31,192.78,Single-ply,SBD,F
Girls,82.33,DQ,Samantha Garcia,Sinton,82.01,95.25,,,,Single-ply,SBD,F
Girls,90.04,1,Lekzi Lopez,San Diego,88.18,136.08,68.04,117.93,322.05,Single-ply,SBD,F
Girls,90.04,2,Jadyn Garcia,Corpus Christi Tuloso-Midway,88.9,136.08,63.5,120.2,319.78,Single-ply,SBD,F
Girls,90.04,3,Sunette Garza,Santa Gertrudis Academy,84.37,120.2,52.16,124.74,297.1,Single-ply,SBD,F
Girls,90.04,4,Emily Ortiz,Orange Grove,83.1,124.74,47.63,113.4,285.76,Single-ply,SBD,F
Girls,90.04,5,Leonor Rodriguez,Sinton,87.09,115.67,65.77,102.06,283.5,Single-ply,SBD,F
Girls,90.04,6,Iysa Sanchez,San Diego,84.55,83.91,31.75,104.33,219.99,Single-ply,SBD,F
Girls,90.04,7,Jaelyn Zapata,Corpus Christi Calallen,83.46,70.31,29.48,90.72,190.51,Single-ply,SBD,F
Girls,90.04,8,Ashley Rodriguez,Corpus Christi Calallen,85.55,43.09,34.02,61.23,138.35,Single-ply,SBD,F
Girls,100.02,1,Kaley Leal,Corpus Christi Tuloso-Midway,92.99,183.7,74.84,161.03,419.57,Single-ply,SBD,F
Girls,100.02,2,Analydia Montes,Corpus Christi Tuloso-Midway,96.16,185.97,70.31,158.76,415.04,Single-ply,SBD,F
Girls,100.02,3,Clarissa Vargas,Orange Grove,91.26,149.69,74.84,147.42,371.95,Single-ply,SBD,F
Girls,100.02,4,Elia Soliz,San Diego,97.07,149.69,86.18,129.27,365.14,Single-ply,SBD,F
Girls,100.02,5,Hailey DeLeon,Alice,97.52,147.42,63.5,145.15,356.07,Single-ply,SBD,F
Girls,100.02,6,Melissa Almaraz,Alice,93.53,124.74,61.23,129.27,315.25,Single-ply,SBD,F
Girls,100.02,7,Araya Hinojosa,Kingsville King,96.16,131.54,61.23,104.33,297.1,Single-ply,SBD,F
Girls,100.02,8,Marley Espinoza,Gregory-Portland,92.99,104.33,61.23,129.27,294.84,Single-ply,SBD,F
Girls,100.02,9,Ashley Trejo,Alice,93.71,97.52,52.16,108.86,258.55,Single-ply,SBD,F
Girls,117.71,1,Marissa Garcia,Alice,109.5,176.9,61.23,165.56,403.7,Single-ply,SBD,F
Girls,117.71,2,Maraya Ruiz,Corpus Christi Calallen,100.7,131.54,61.23,115.67,308.44,Single-ply,SBD,F
Girls,117.71,3,Maribelle Mendieta,Sinton,104.87,133.81,54.43,108.86,297.1,Single-ply,SBD,F
Girls,117.71,4,Claudia Alaniz,San Diego,115.48,117.93,52.16,111.13,281.23,Single-ply,SBD,F
Girls,117.71,5,Deaundra Torres,Sinton,113.76,90.72,54.43,74.84,219.99,Single-ply,SBD,F
Girls,117.71,6,Linda Trevino,Corpus Christi John Paul II High School,103.06,70.31,29.48,113.4,213.19,Single-ply,SBD,F
Girls,117.71+,1,Bethany Gonzales,Santa Gertrudis Academy,149.59,165.56,97.52,165.56,428.64,Single-ply,SBD,F
Girls,117.71+,2,Victoria Adame,Corpus Christi John Paul II High School,137.62,102.06,49.9,136.08,288.03,Single-ply,SBD,F
Girls,117.71+,3,Anisa Navaro,Gregory-Portland,145.42,79.38,45.36,113.4,238.14,Single-ply,SBD,F
Girls,117.71+,4,Makayla Zapata,San Diego,144.24,83.91,45.36,92.99,222.26,Single-ply,SBD,F
