Place,Name,BirthYear,Team,BodyweightKg,Best3SquatKg,Best3BenchKg,Best3DeadliftKg,TotalKg,Event,WeightClassKg,Division,Equipment,Sex,BirthDate
1,Takács Ákos,1992,Toldi SE,56.9,155.0,110.0,157.5,422.5,SBD,59,Open,Single-ply,M,
2,Kálé Csaba,1978,Famílya,59.0,130.0,80.0,150.0,360.0,SBD,59,Open,Single-ply,M,
3,Orosi Tamás,1996,Mérk SE,50.5,110.0,85.0,135.0,330.0,SBD,59,Open,Single-ply,M,
4,Savanyú Tamás,1975,Vitalitás,57.6,105.0,55.0,145.0,305.0,SBD,59,Open,Single-ply,M,
1,Orosi József,1992,Mérk SE,63.4,190.5,150.0,190.0,530.5,SBD,66,Open,Single-ply,M,
2,Földvári Csaba,1985,JÁTESZSE,65.1,115.0,140.0,190.0,445.0,SBD,66,Open,Single-ply,M,
3,Bolyós Gábor,1983,Famílya,65.8,135.0,90.0,165.0,390.0,SBD,66,Open,Single-ply,M,
1,Zeitler Márton,1984,Toldi SE,68.9,180.0,160.0,215.0,555.0,SBD,74,Open,Single-ply,M,
2,Varga István,1968,TIFIT,73.3,190.0,152.5,210.0,552.5,SBD,74,Open,Single-ply,M,
3,Béres Zsolt,1978,Famílya,73.5,200.0,120.0,215.0,535.0,SBD,74,Open,Single-ply,M,
4,Róka Tamás,1990,JAK,71.9,170.0,120.0,221.0,511.0,SBD,74,Open,Single-ply,M,
5,László Márk,1996,Mérk SE,72.3,170.0,140.0,200.0,510.0,SBD,74,Open,Single-ply,M,
6,Rácz Dávid,1996,Mérk SE,72.0,157.5,145.0,205.0,507.5,SBD,74,Open,Single-ply,M,
7,Bódi András,1991,Mérk SE,69.6,160.0,115.0,210.0,485.0,SBD,74,Open,Single-ply,M,
8,Bódi Attila,1993,Mérk SE,67.1,155.0,130.0,175.0,460.0,SBD,74,Open,Single-ply,M,
9,Bete Vilmos,1994,JAK,70.2,150.0,100.0,170.0,420.0,SBD,74,Open,Single-ply,M,
10,Baksa András,1992,JAK,68.2,140.0,90.0,180.0,410.0,SBD,74,Open,Single-ply,M,
11,Bosnyák László,1960,TabiFK,68.4,110.0,105.0,155.0,370.0,SBD,74,Open,Single-ply,M,
1,Juhász Attila,1981,Famílya,83.0,205.0,140.0,210.0,555.0,SBD,83,Open,Single-ply,M,
2,Szűcs Sándor,1988,Mérk SE,76.9,177.5,155.0,210.0,542.5,SBD,83,Open,Single-ply,M,
3,Frühwirth Péter,1984,Flex SE,81.7,175.0,155.0,185.0,515.0,SBD,83,Open,Single-ply,M,
4,Antolik Attila,1985,Vitalitás,81.2,170.0,117.5,220.0,507.5,SBD,83,Open,Single-ply,M,
5,Mihálik Ádám,1994,TabiFK,80.9,180.0,130.0,185.0,495.0,SBD,83,Open,Single-ply,M,
6,Majoros Ádám,1994,JAK,80.0,180.0,130.0,170.0,480.0,SBD,83,Open,Single-ply,M,
1,Ódor András,1985,Vitalitás,89.9,280.0,212.5,271.5,764.0,SBD,93,Open,Single-ply,M,
2,Csernyánszki Csaba,1985,AttilaSE,90.6,260.0,160.0,240.0,660.0,SBD,93,Open,Single-ply,M,
3,Kószás Erik,1990,Flex SE,91.0,245.0,160.0,235.0,640.0,SBD,93,Open,Single-ply,M,
4,Horváth Péter,1991,Flex SE,89.3,250.0,135.0,250.0,635.0,SBD,93,Open,Single-ply,M,
5,Tóth Szabolcs,1984,Famílya,89.8,180.0,127.5,212.5,520.0,SBD,93,Open,Single-ply,M,
6,Flekács Ágoston,1996,JAK,87.3,140.0,100.0,190.0,430.0,SBD,93,Open,Single-ply,M,
DQ,Szabó Árpád,1993,JAK,87.3,,,,,SBD,93,Open,Single-ply,M,
1,Szöllősi Gábor,1983,Toldi SE,93.2,270.0,190.0,245.0,705.0,SBD,105,Open,Single-ply,M,
2,Bíró Zoltán,1986,TabiFK,97.5,170.0,172.5,180.0,522.5,SBD,105,Open,Single-ply,M,
3,Darázs Ádám,1992,TabiFK,102.0,200.0,110.0,205.0,515.0,SBD,105,Open,Single-ply,M,
DQ,Sáfrány Zoltán,1960,TabiFK,99.4,180.0,180.0,,,SBD,105,Open,Single-ply,M,
1,Géresi Péter,1977,Völgy SE,113.7,215.0,212.5,242.5,670.0,SBD,120,Open,Single-ply,M,
2,Kromek András,1974,TabiFK,106.8,230.0,172.5,250.0,652.5,SBD,120,Open,Single-ply,M,
3,Horváth Mihály,1993,Toldi SE,109.7,185.0,90.0,200.0,475.0,SBD,120,Open,Single-ply,M,
1,Pesszer Gábor,1984,JAK,179.5,352.5,220.0,250.0,822.5,SBD,120+,Open,Single-ply,M,
2,Kovács Ferenc,1988,Toldi SE,127.7,265.0,250.0,230.0,745.0,SBD,120+,Open,Single-ply,M,
3,Fülöp Mihály,1987,Marvel,144.0,260.0,205.0,247.5,712.5,SBD,120+,Open,Single-ply,M,
4,Pécsi József,1969,TabiFK,127.7,250.0,190.0,250.0,690.0,SBD,120+,Open,Single-ply,M,
5,Darázs Attila,1982,TabiFK,159.5,245.0,190.0,240.0,675.0,SBD,120+,Open,Single-ply,M,
DQ,Sánta László,1986,Ásotthalom,147.8,370.0,,300.0,,SBD,120+,Open,Single-ply,M,
1,Nyers Mónika,1978,TabiFK,46.7,75.0,75.0,95.0,245.0,SBD,47,Open,Single-ply,F,
2,Kutelszki Adrienn,1988,Vitalitás,46.9,45.0,27.5,75.0,147.5,SBD,47,Open,Single-ply,F,
1,Petróczki Magdolna,1968,BodyPower,51.9,150.0,85.0,160.0,395.0,SBD,52,Open,Single-ply,F,
2,Szűcs Szilvia,1983,Vitalitás,49.9,55.0,32.5,87.5,175.0,SBD,52,Open,Single-ply,F,
1,Szántó Erika,1977,Pannonia,56.4,120.0,75.0,145.0,340.0,SBD,57,Open,Single-ply,F,
2,Kakas Gáborné,1979,Vitalitás,56.3,90.0,50.0,92.5,232.5,SBD,57,Open,Single-ply,F,
1,Kosztin Flóra,1955,Atlas SE,60.9,110.0,95.0,130.0,335.0,SBD,63,Open,Single-ply,F,
2,Kirilla Szilvia,1993,Famílya,60.7,100.0,52.5,135.0,287.5,SBD,63,Open,Single-ply,F,
3,Szásznádasi Melinda,1977,TabiFK,57.1,65.0,55.0,82.5,202.5,SBD,63,Open,Single-ply,F,
1,Imre Daniella,1994,Toldi SE,71.5,160.5,90.0,150.0,400.5,SBD,72,Open,Single-ply,F,
2,Tibori Nóra,1989,AttilaSE,68.0,140.0,97.5,142.5,380.0,SBD,72,Open,Single-ply,F,
3,Sárközi Jutka,1975,Atlas SE,69.6,90.0,77.5,110.0,277.5,SBD,72,Open,Single-ply,F,
4,Bolyós Timea,1985,Famílya,66.3,95.0,50.0,117.5,262.5,SBD,72,Open,Single-ply,F,
1,Kromek Mónika,1977,TabiFK,83.2,155.0,97.5,170.5,423.0,SBD,84,Open,Single-ply,F,
2,Haklik Dóra,1996,Toldi SE,82.0,110.0,65.0,100.0,275.0,SBD,84,Open,Single-ply,F,
3,Savanyúné Oroszki Rita,1978,Vitalitás,77.1,85.0,47.5,120.0,252.5,SBD,84,Open,Single-ply,F,
1,Szabó Ágnes,1988,Toldi SE,104.6,210.0,175.0,170.0,555.0,SBD,84+,Open,Single-ply,F,
2,Ulveczki Edina,1981,Vitalitás,100.1,110.0,110.0,115.0,335.0,SBD,84+,Open,Single-ply,F,
3,Puskás Ildikó,1988,Atlas SE,97.7,80.0,80.0,105.0,265.0,SBD,84+,Open,Single-ply,F,
