Place,Name,Country,Sex,Age,Equipment,Division,BodyweightKg,WeightClassKg,Squat1Kg,Squat2Kg,Squat3Kg,Squat4Kg,Best3SquatKg,Bench1Kg,Bench2Kg,Bench3Kg,Bench4Kg,Best3BenchKg,Deadlift1Kg,Deadlift2Kg,Deadlift3Kg,Deadlift4Kg,Best3DeadliftKg,TotalKg,Event,BirthDate
1,Chloe Shemmans,UK,F,20,Wraps,F_JCR_WPC,53.3,56,75,80,87.5,,87.5,45,50,55,,55,85,92.5,100,,100,242.5,SBD,
1,Anna Migliazza,Switzerland,F,20,Wraps,F_JCR_WPC,74.5,75,120,125,130,,130,65,-70,-70,,65,155,165,-172.5,,165,360,SBD,
1,Milly Baker,UK,F,20,Wraps,F_JCR_AWPC,58.9,60,105,117.5,120,,120,50,55,62.5,,62.5,-115,130,-140,,130,312.5,SBD,
2,Linne Laukka,Finland,F,23,Wraps,F_JCR_AWPC,59.8,60,95,105,112.5,,112.5,47.5,52.5,55,,55,120,130,140,,140,307.5,SBD,
1,Ellie Saipe,UK,F,21,Wraps,F_JCR_AWPC,66.6,67.5,102.5,112.5,-120,,112.5,45,-50,-50,,45,130,140,145,,145,302.5,SBD,
1,Erica Bridgewater,UK,F,22,Wraps,F_JCR_AWPC,73.2,75,122.5,130,137.5,,137.5,47.5,52.5,-55,,52.5,140,150,-157.5,,150,340,SBD,
1,Elli Peromaa,Finland,F,23,Wraps,F_JCR_AWPC,81.4,82.5,150,165,175,,175,80,87.5,92.5,,92.5,147.5,160,165,-172.5,165,432.5,SBD,
1,Rachel Measures,UK,F,41,Wraps,F_MCR_1_AWPC,53.1,56,90,95,-100,,95,50,-55,-55,,50,135,142.5,-145,,142.5,287.5,SBD,
1,Laura Morgan,UK,F,41,Wraps,F_MCR_1_AWPC,65.6,67.5,110,117.5,-122.5,,117.5,-60,-60,60,,60,125,135,140,,140,317.5,SBD,
2,Sarah Miles,UK,F,44,Wraps,F_MCR_1_AWPC,66.6,67.5,110,117.5,122.5,,122.5,45,-50,-50,,45,130,140,-142.5,,140,307.5,SBD,
1,Petra Hiisiö,Finland,F,48,Wraps,F_MCR_2_WPC,58.9,60,-165,165,185,-192.5,185,75,80,85,,85,170,180,190,,190,460,SBD,
1,Mariana Dankova,Ireland,F,52,Wraps,F_MCR_3_AWPC,65.6,67.5,82.5,92.5,102.5,,102.5,40,45,-47.5,,45,105,115,120,,120,267.5,SBD,
1,Charlie Beardsley,UK,F,53,Wraps,F_MCR_3_AWPC,72,75,100,107.5,112.5,,112.5,45,47.4,50,,50,125,132.5,-137.5,,132.5,295,SBD,
1,Mo Proctor,UK,F,57,Wraps,F_MCR_4_WPC,94.4,100,120,127.5,-132.5,,127.5,75,80,-82.5,,80,130,135,140,,140,347.5,SBD,
1,Louise Clark #3,UK,F,58,Wraps,F_MCR_4_AWPC,63.9,67.5,115,-122.5,122.5,,122.5,60,65,-67.5,,65,125,132.5,137.5,,137.5,325,SBD,
2,Sandy Pandya,UK,F,57,Wraps,F_MCR_4_AWPC,64.2,67.5,100,110,120,,120,55,-60,-60,,55,132.5,140,145,,145,320,SBD,
1,Pihla-Terttu Oksanen,Finland,F,69,Wraps,F_MCR_6_AWPC,57.8,60,57.5,60,62.5,65,62.5,35,-37.5,-37.5,,35,97.5,102.5,105,107.5,105,202.5,SBD,
1,Tuulikki Kare,Finland,F,56,Wraps,F_OCR_WPC,60,60,155,-167.5,167.5,,167.5,87.5,92.5,95,,95,180,190,200,,200,462.5,SBD,
2,Petra Hiisiö,Finland,F,48,Wraps,F_OCR_WPC,58.9,60,-165,165,185,-192.5,185,75,80,85,,85,170,180,190,,190,460,SBD,
1,Martyna Ostrowska,Poland,F,28,Wraps,F_OCR_WPC,82.5,82.5,155,167.5,-180,,167.5,67.5,-72.5,72.5,,72.5,150,160,-170,,160,400,SBD,
1,Emma Huhta,Finland,F,31,Sleeves,F_OCR_WPC,88.5,90,100,130,170,,170,100,115,120,,120,170,200,215,,215,505,SBD,
1,Megan Bernard,UK,F,30,Wraps,F_OCR_AWPC,50.3,52,80,90,-100,,90,42.5,45,-47.5,,45,140,152.5,-160,,152.5,287.5,SBD,
1,Krystal Winter,UK,F,31,Wraps,F_OCR_AWPC,55.6,56,105,115,-125,,115,55,60,65,,65,130,140,-145,,140,320,SBD,
2,Rachel Measures,UK,F,41,Wraps,F_OCR_AWPC,53.1,56,95,,,,95,50,,,,50,135,142.5,-145,,142.5,287.5,SBD,
3,Jenni Pulli,Finland,F,34,Wraps,F_OCR_AWPC,55.6,56,60,67.5,-75,,67.5,35,42.5,45,,45,90,100,-105,,100,212.5,SBD,
1,Vilhelmiina Sillanpää,Finland,F,28,Wraps,F_OCR_AWPC,66.1,67.5,150,167.5,-176,,167.5,70,77.5,80,,80,140,-165,165,-180.5,165,412.5,SBD,
2,Tara McCully,UK,F,31,Wraps,F_OCR_AWPC,65.9,67.5,115,120,127.5,,127.5,65,67.5,-70,,67.5,135,145,152.5,,152.5,347.5,SBD,
1,Katie Bickle,UK,F,25,Wraps,F_OCR_AWPC,74.5,75,165,175,-180,,175,75,80,-82.5,,80,152.5,160,165,,165,420,SBD,
2,Róisín Maher,Ireland,F,35,Wraps,F_OCR_AWPC,74.6,75,85,95,100,,100,55,-60,-60,,55,130,140,-150,,140,295,SBD,
1,Essi Jäntti,Finland,F,24,Sleeves,F_OCR_AWPC,82.3,82.5,150,160,167.5,,167.5,105,110,-115,,110,180,190,195,-200,195,472.5,SBD,
2,Jessica Pallot,UK,F,28,Wraps,F_OCR_AWPC,79,82.5,147.5,157.5,162.5,,162.5,77.5,-82.5,-82.5,,77.5,145,155,162.5,,162.5,402.5,SBD,
1,Bridget-Jean Lynn,UK,F,24,Wraps,F_OCR_AWPC,101,110,130,140,-155,,140,60,65,-70,,65,160,-170,-175,,160,365,SBD,
1,Sara Honkakangas,Finland,F,15,Wraps,F_TCR_1_WPC,57.6,60,-100,100,105,,105,52.5,55,58,-60,58,100,110,121,,121,284,SBD,
1,Inka Arhenius,Finland,F,15,Wraps,F_TCR_1_WPC,84.9,90,100,115,-130,,115,50,57.5,62.5,,62.5,110,130,135,,135,312.5,SBD,
1,Vivian Ihanmäki,Finland,F,16,Wraps,F_TCR_2_WPC,50.8,52,80,83,85,,85,42.5,45,50,,50,95,101,-105,,101,236,SBD,
1,Sofia Valkama,Finland,F,19,Wraps,F_TCR_3_WPC,67.2,67.5,100,107.5,-116.5,,107.5,60,65,67.5,,67.5,145,152.5,160,,160,335,SBD,
1,Joanna Kusznerko,UK,F,19,Wraps,F_TCR_3_AWPC,82.5,82.5,147.5,155,162.5,,162.5,70,75,80,,80,160,170,-180,,170,412.5,SBD,
2,Aada Vuoriaho,Finland,F,18,Wraps,F_TCR_3_AWPC,76.6,82.5,130,137.5,145,,145,47.5,52.5,55,,55,132.5,142.5,-150,,142.5,342.5,SBD,
3,Gweneth Fisher,UK,F,18,Wraps,F_TCR_3_AWPC,79,82.5,125,135,140,,140,67.5,72.5,-75,,72.5,125,-140,-145,,125,337.5,SBD,
1,Jatta Ihanmäki,Finland,F,40,Bare,F_MR_1_WPC,54.7,56,80,85,-90,,85,50,-55,-55,,50,100,115,-127.5,,115,250,SBD,
1,Charlie Hooson-Sykes,UK,F,45,Bare,F_MR_2_AWPC,131.1,110+,115,125,135,,135,67.5,72.5,-77.5,,72.5,125,132.5,142.5,,142.5,350,SBD,
1,Geraldine Goligher,UK,F,51,Bare,F_MR_3_WPC,65.6,67.5,122.5,132.5,137.5,140.5,137.5,92.5,97.5,-102.5,,97.5,155,165,-170,,165,400,SBD,
1,Hetty Salmon,UK,F,57,Bare,F_MR_4_AWPC,80.6,82.5,80,90,100,,100,67.5,72.5,-75,,72.5,100,115,-125,,115,287.5,SBD,
1,Julie Green #1,UK,F,56,Bare,F_MR_4_AWPC,106,110,100,110,-120,,110,65,67.5,70,,70,120,130,140,,140,320,SBD,
1,Martine Barons,UK,F,63,Bare,F_MR_5_AWPC,83.9,90,-70,70,-80,,70,50,-55,55,,55,120,130,140,,140,265,SBD,
1,Diane Romano-Woodward,UK,F,69,Bare,F_MR_6_AWPC,78.4,82.5,60,70,80,,80,50,55,60,,60,80,92.5,105,,105,245,SBD,
1,Melanie Peter,France,F,30,Bare,F_OR_WPC,58.9,60,97.5,105,-110,,105,55,60,62.5,,62.5,125,135,140,,140,307.5,SBD,
1,Tiffany Ko,UK,F,39,Bare,F_OR_WPC,67.1,67.5,145,150,-155,,150,-80,87.5,90,,90,170,180,187.5,,187.5,427.5,SBD,
2,Riina Mikkonen,Finland,F,36,Bare,F_OR_WPC,67.1,67.5,-120,120,132.5,,132.5,87.5,92.5,97.5,,97.5,140,150,160,,160,390,SBD,
3,Mathilde Frankinet,France,F,27,Bare,F_OR_WPC,64.5,67.5,117.5,125,130,,130,55,60,65,,65,155,165,172.5,,172.5,367.5,SBD,
1,Amra Halilovic,Finland,F,31,Bare,F_OR_WPC,86.9,90,155,162.5,-165,,162.5,90,-92.5,-92.5,,90,175,-185,-185,,175,427.5,SBD,
DQ,Silja Myllymäki,Finland,F,28,Bare,F_OR_WPC,87.3,90,105,115,120,,120,65,-70,-70,,65,-140,-150,,,,,SBD,
1,Emily Hussey,UK,F,33,Bare,F_OR_AWPC,49.4,52,85,-90,90,,90,52.5,55,-57.5,,55,107.5,112.5,115,,115,260,SBD,
1,Sarah Ellis #2,UK,F,29,Bare,F_OR_AWPC,54.2,56,97.5,105,110,,110,42.5,45,47.5,,47.5,135,-145,-145,,135,292.5,SBD,
1,Louise Breen,UK,F,38,Bare,F_OR_AWPC,58.5,60,120,127.5,132.5,,132.5,70,75,-77.5,,75,-127.5,127.5,137.5,,137.5,345,SBD,
1,Nikki Beck,UK,F,36,Bare,F_OR_AWPC,67.3,67.5,107.5,115,-120,,115,65,67.5,70,,70,127.5,137.5,-142.5,,137.5,322.5,SBD,
1,Samantha Vickers,UK,F,38,Bare,F_OR_AWPC,73.6,75,120,130,-138,,130,72.5,-77.5,77.5,,77.5,155,165,172.5,,172.5,380,SBD,
1,Hannah Newberry,UK,F,32,Bare,F_OR_AWPC,87.3,90,132.5,140,145,,145,70,77.5,82.5,,82.5,162.5,-172.5,172.5,,172.5,400,SBD,
2,Zhala Azizova,Azerbaijan,F,37,Bare,F_OR_AWPC,88.4,90,125,130,135,,135,70,75,-80,,75,170,180,-192.5,,180,390,SBD,
1,Alex Young #2,UK,F,33,Bare,F_OR_AWPC,123.7,110+,190,206,,,206,95,-102.5,-102.5,,95,160,175,-182.5,,175,476,SBD,
1,Oona Kuusisto,Finland,F,14,Bare,F_TR_1_WPC,66,67.5,85,93,-100,,93,45,-51,-51,,45,102.5,112.5,120,,120,258,SBD,
1,Joe Heasman,UK,M,22,Bare,M_JR_AWPC,87.3,90,180,190,-197.5,,190,135,140,145,,145,220,230,237.5,,237.5,572.5,SBD,
2,Brandon Lee Barton,UK,M,20,Bare,M_JR_AWPC,86,90,140,155,170,,170,100,110,-115,,110,200,-210,220,,220,500,SBD,
1,Jeremy Morley,UK,M,56,Bare,M_MR_4_AWPC,89.9,90,-125,130,-137.5,,130,95,100,-105,,100,175,182.5,187.5,,187.5,417.5,SBD,
2,Alberto Van Burch,Ireland,M,55,Bare,M_MR_4_AWPC,88.7,90,-130,130,140,,140,82.5,85,-87.5,,85,180,187.5,-192.5,,187.5,412.5,SBD,
1,Mark Johnson #1,UK,M,63,Bare,M_MR_5_AWPC,99.5,100,145,155,-160,,155,107.5,-115,-115,,107.5,190,200,-210,,200,462.5,SBD,
1,Olavi Nieminen,Finland,M,27,Bare,M_OR_AWPC,81.7,82.5,145,155,160,,160,120,-125,125,,125,170,190,200,,200,485,SBD,
2,Timo Tissari,Finland,M,24,Bare,M_OR_AWPC,80.5,82.5,130,140,150,,150,92.5,100,-105,,100,210,222.5,-235,,222.5,472.5,SBD,
1,Jake Lonsdale,UK,M,29,Bare,M_OR_AWPC,88.4,90,245,260,-270,,260,150,155,-160,,155,250,270,-280,,270,685,SBD,
2,Alastair Griggs,UK,M,25,Bare,M_OR_AWPC,87.5,90,172.5,180,190,,190,125,135,140,,140,227.5,242.5,250,,250,580,SBD,
1,Robert Hunt #1,UK,M,31,Bare,M_OR_AWPC,106.8,110,265,-280,280,,280,160,167.5,-170,,167.5,260,272.5,,,272.5,720,SBD,
2,Leon Parry,UK,M,32,Bare,M_OR_AWPC,109.8,110,215,227.5,232.5,,232.5,162.5,172.5,-177.5,,172.5,235,255,265,,265,670,SBD,
1,Razim Huseynov,Azerbaijan,M,48,Bare,M_OR_AWPC,124.9,125,320,-337.5,342,,342,220,-231,231,,231,315,331,345,,345,918,SBD,
1,Alekss Sneider,Ireland,M,17,Bare,M_TR_2_AWPC,78.4,82.5,140,-150,150,,150,92.5,97.5,100,,100,155,167.5,175,,175,425,SBD,
1,Joseph Gill,UK,M,16,Bare,M_TR_2_AWPC,85.6,90,170,-182.5,185,,185,145,153,-157.5,,153,217.5,225,230,,230,568,SBD,
2,Patrick Daly,Ireland,M,17,Bare,M_TR_2_AWPC,89.1,90,75,90,115,,115,82.5,90,95,,95,140,150,155,,155,365,SBD,
1,Noel Henriksson,Finland,M,17,Bare,M_TR_2_AWPC,109,110,200,210,220,,220,130,140,145,,145,-230,240,260,,260,625,SBD,
1,Mathias Mynttinen,Finland,M,23,Wraps,M_JCR_WPC,81.1,82.5,-177.5,180,-187.5,,180,117.5,125,-130,,125,-200,205,215,,215,520,SBD,
1,Sam Bentley,UK,M,21,Sleeves,M_JCR_WPC,90,90,250,262.5,272.5,,272.5,180,192.5,-202.5,,192.5,285,307.5,-315,,307.5,772.5,SBD,
2,Enzo Brelaud,France,M,22,Wraps,M_JCR_WPC,89.7,90,205,215,220,,220,140,-145,-145,,140,205,215,-235,,215,575,SBD,
1,Ron Zitzmann,Switzerland,M,22,Wraps,M_JCR_WPC,91.8,100,190,195,-202.5,,195,125,130,135,,135,190,205,-210,,205,535,SBD,
1,Beau Rogers,UK,M,23,Wraps,M_JCR_WPC,109.2,110,240,260,275,,275,135,145,152.5,,152.5,260,280,297.5,,297.5,725,SBD,
2,Nico Viljakainen,Finland,M,21,Wraps,M_JCR_WPC,109.3,110,190,-210,,,190,140,-150,-150,,140,200,220,-240,,220,550,SBD,
1,Anthony Singh #1,Finland,M,23,Wraps,M_JCR_WPC,123.5,125,330,350,-360,,350,190,200,-205,,200,300,335,-353,,335,885,SBD,
1,Ben Astin,UK,M,21,Wraps,M_JCR_AWPC,59.4,60,180,192.5,202.5,,202.5,125,130,,,130,160,170,-177.5,,170,502.5,SBD,
1,Nathan Lynch,UK,M,21,Wraps,M_JCR_AWPC,74.5,75,200,212.5,217.5,,217.5,110,-117.5,-117.5,,110,210,-227.5,-227.5,,210,537.5,SBD,
1,Alex Gyursanszky,Finland,M,23,Sleeves,M_JCR_AWPC,99.3,100,205,220,230,,230,125,132.5,140,,140,-240,250,-262.5,,250,620,SBD,
1,Nikita Romov,Estonia,M,23,Wraps,M_JCR_AWPC,109.7,110,220,240,-250,,240,150,160,,,160,235,250,,,250,650,SBD,
1,Darren Robertson,UK,M,40,Wraps,M_MCR_1_AWPC,74.1,75,172.5,182.5,-193,,182.5,122.5,-127.5,-127.5,,122.5,212.5,225.5,232.5,,232.5,537.5,SBD,
1,Raivis Hofs,UK,M,40,Wraps,M_MCR_1_AWPC,88.8,90,210,-227.5,227.5,,227.5,142.5,150,155.5,,155.5,220,240,253,,253,636,SBD,
2,Tommi Läntinen,Finland,M,43,Wraps,M_MCR_1_AWPC,89.1,90,190,212.5,-220,,212.5,100,110,-115,,110,220,240,250,,250,572.5,SBD,
3,Kevin McGrath,Ireland,M,41,Wraps,M_MCR_1_AWPC,88.2,90,200,210,-215,,210,105,112.5,-117.5,,112.5,205,-215,215,,215,537.5,SBD,
1,Jason Berrington,UK,M,40,Wraps,M_MCR_1_AWPC,98.6,100,210,-220,222.5,,222.5,147.5,152.5,-155,,152.5,240,255,-265,,255,630,SBD,
1,Oliver Coffey,Ireland,M,46,Wraps,M_MCR_2_AWPC,95.1,100,180,200,-205,,200,107.5,115,120,,120,200,212.5,220,,220,540,SBD,
1,Pete Tryner,UK,M,52,Wraps,M_MCR_3_AWPC,99.7,100,250,262.5,272.5,,272.5,150,157.5,-165,,157.5,290,305,-315,,305,735,SBD,
1,Richard Baker #2,UK,M,54,Wraps,M_MCR_3_AWPC,121.1,125,257.5,276,280,,280,162.5,172.5,-180,,172.5,255,271,-280,,271,723.5,SBD,
1,Mark Jones #2,UK,M,59,Wraps,M_MCR_4_AWPC,107.6,110,185,195,205,,205,127.5,132.5,-135,,132.5,180,200,205,,205,542.5,SBD,
1,Raimo Lehtimäki,Finland,M,74,Wraps,M_MCR_7_AWPC,97.2,100,150,165,172.5,,172.5,77.5,82.5,-85,,82.5,195,207.5,-215,,207.5,462.5,SBD,
1,Elmeri Töyry,Finland,M,26,Wraps,M_OCR_AWPC,67.4,67.5,-238,-238,238,,238,112.5,122.5,-130,,122.5,230,245.5,,,245.5,606,SBD,
2,Conor O'Sullivan,Ireland,M,32,Wraps,M_OCR_AWPC,67.1,67.5,135,145,-150,,145,100,105,107.5,,107.5,200,210,-220,,210,462.5,SBD,
1,James Mason #1,UK,M,27,Wraps,M_OCR_AWPC,81.5,82.5,205,222.5,227.5,,227.5,135,140,142.5,,142.5,230,247.5,255,,255,625,SBD,
2,Sam Frew,UK,M,27,Wraps,M_OCR_AWPC,78.8,82.5,215,230,237.5,,237.5,137.5,145,150,,150,205,220,230,,230,617.5,SBD,
1,Raivis Hofs,UK,M,40,Wraps,M_OCR_AWPC,88.8,90,210,-227.5,227.5,,227.5,142.5,150,155.5,,155.5,220,240,253,,253,636,SBD,
2,Rob Clark #1,UK,M,37,Wraps,M_OCR_AWPC,86.9,90,205,220,230,,230,125,135,-142.5,,135,220,240,260,,260,625,SBD,
3,Orkhan Farzaliyev,Azerbaijan,M,32,Wraps,M_OCR_AWPC,89.3,90,215,225,-232.5,,225,130,137.5,140,,140,225,237.5,242.5,,242.5,607.5,SBD,
4,Ville Saranpää,Finland,M,25,Wraps,M_OCR_AWPC,86.9,90,200,220,230,,230,120,130,-140,,130,210,230,240,,240,600,SBD,
1,Pete Tryner,UK,M,52,Wraps,M_OCR_AWPC,99.7,100,250,262.5,272.5,,272.5,150,157.5,-165,,157.5,290,305,-315,,305,735,SBD,
1,Levi Hartshorne,UK,M,33,Sleeves,M_OCR_AWPC,107.3,110,250,265,272.5,,272.5,180,192.5,-200,,192.5,285,300,-305,,300,765,SBD,
2,Liam Cowley,UK,M,34,Wraps,M_OCR_AWPC,107,110,270,285,-300,,285,157.5,-165,-165,,157.5,270,285,-300,,285,727.5,SBD,
3,Matt Davy,UK,M,36,Wraps,M_OCR_AWPC,109.2,110,235,250,257.5,,257.5,147.5,152.5,-155,,152.5,275,292.5,300,,300,710,SBD,
4,Aaro Mäki-Jouppila,Finland,M,25,Wraps,M_OCR_AWPC,108,110,190,210,220,,220,130,140,-145,,140,225,240,250,,250,610,SBD,
1,Richard Baker #2,UK,M,54,Wraps,M_OCR_AWPC,121.1,125,257.5,276,280,,280,162.5,172.5,-180,,172.5,255,271,-280,,271,723.5,SBD,
1,Jason Vernon,UK,M,36,Wraps,M_OCR_AWPC,136.9,140,290,312.5,-322.5,,312.5,165,177.5,-185,,177.5,267.5,285,-300,,285,775,SBD,
1,Valto Astaptsev,Finland,M,13,Wraps,M_TCR_1_WPC,63.8,67.5,100,105,,,105,40,45,,,45,97.5,102.5,105,,105,255,SBD,
1,Matti Huotari,Finland,M,15,Sleeves,M_TCR_1_WPC,85.7,90,130,145,157.5,,157.5,80,85,90,,90,155,175,187.5,,187.5,435,SBD,
1,Osku Laitinen,Finland,M,13,Wraps,M_TCR_1_AWPC,55.4,56,60,77.5,82.5,,82.5,45,55,60,,60,130,145,150,,150,292.5,SBD,
1,Gregorz Gibaszek,UK,M,15,Wraps,M_TCR_1_AWPC,74.4,75,125,132.5,-140,,132.5,80,90,-95,,90,142.5,152.5,162.5,,162.5,385,SBD,
1,Axel Annunen,Finland,M,16,Wraps,M_TCR_2_WPC,74.8,75,140,-150,-150,,140,95,102.5,-110,,102.5,75,,,,75,317.5,SBD,
1,Aaron Wiman,Finland,M,17,Sleeves,M_TCR_2_WPC,99.6,100,215,230,240,,240,120,135,-142.5,,135,-215,225,235,,235,610,SBD,
1,Navv Arora,UK,M,18,Wraps,M_TCR_3_AWPC,57.9,60,125,140,-145,,140,95,-105,-105,,95,170,180,-185,,180,415,SBD,
1,Marko Kuussaari,Finland,M,47,Bare,M_MR_2_AWPC,59.8,60,,,,,,75,85,-90,,85,,,,,,85,B,
1,Ali Asgarov,Azerbaijan,M,39,Bare,M_OR_AWPC,89.8,90,,,,,,180,190,195,,195,,,,,,195,B,
2,Bradley Pears,UK,M,29,Bare,M_OR_AWPC,84.5,90,,,,,,140,150,-155,,150,,,,,,150,B,
1,Joseph Gill,UK,M,16,Bare,M_TR_2_AWPC,89.4,90,,,,,,-145,150,-155.5,,150,,,,,,150,B,
1,Justin Carroll,Ireland,M,43,Bare,M_MR_1_AWPC,93,100,,,,,,142.5,150,152.5,,152.5,,,,,,152.5,B,
1,Pete Tryner,UK,M,52,Bare,M_MR_3_AWPC,99.7,100,,,,,,,,,,,290,305,-315,,305,305,D,
1,Kauko Viitala,Finland,M,85,Bare,M_MR_9_AWPC,76.9,82.5,,,,,,,,,,,125,130,135,140,135,135,D,
1,Timo Saarela,Finland,M,45,Bare,M_MR_2_AWPC,82.2,82.5,,,,,,,,,,,220,230.5,-240,,230.5,230.5,D,
1,Richard Green #2,UK,M,57,Bare,M_MR_4_AWPC,117.2,125,,,,,,,,,,,220,235,250,,250,250,D,
1,Pete Tryner,UK,M,52,Bare,M_OR_AWPC,99.7,100,,,,,,,,,,,290,305,-315,,305,305,D,
1,Elmir Tarverdiyev,Azerbaijan,M,40,Bare,M_OR_AWPC,64.7,67.5,,,,,,,,,,,217.5,232.5,-242.5,,232.5,232.5,D,
1,Ville Lintunen,Finland,M,34,Bare,M_OR_AWPC,72.3,75,,,,,,,,,,,275,285,295,-300,295,295,D,
1,Timo Saarela,Finland,M,45,Bare,M_OR_AWPC,82.2,82.5,,,,,,,,,,,220,230.5,-240,,230.5,230.5,D,
2,Alex Hulme,UK,M,24,Bare,M_OR_AWPC,81.2,82.5,,,,,,,,,,,210,220,227.5,,227.5,227.5,D,
3,Lewis Mee,UK,M,26,Bare,M_OR_AWPC,80.1,82.5,,,,,,,,,,,185,200,-205,,200,200,D,
1,Bradley Pears,UK,M,29,Bare,M_OR_AWPC,84.5,90,,,,,,,,,,,220,245,250,,250,250,D,
1,Seymur Guliyev,Azerbaijan,M,40,Bare,M_OR_AWPC,108.7,110,,,,,,,,,,,300,320,326,,326,326,D,
1,Ismayil Mammadov,Azerbaijan,M,19,Bare,M_TR_3_AWPC,82.5,82.5,,,,,,,,,,,230,240,-245,,240,240,D,
2,Orkhan Farzaliyev,Azerbaijan,M,32,Bare,M_OR_AWPC,89.3,90,,,,,,,,,,,225,237.5,242.5,,242.5,242.5,D,
1,Vilhelmiina Sillanpää,Finland,F,28,Single-ply,F_OES_AWPC,66.5,67.5,175,205,210.5,215.5,210.5,70,100,105,,105,140,167.5,-186,,167.5,483,SBD,
DQ,Emma Lahti,Finland,F,26,Multi-ply,F_OEM_WPC,72.5,75,-235,240,-260,,240,-150,-150,-150,,,215,230,-242.5,,230,,SBD,
1,Nerina Olander,Finland,F,20,Bare,F_JR_WPC,47,48,,,,,,52,55,-57.5,,55,,,,,,55,B,
1,Silvia Burgio,Italy,F,23,Bare,F_JR_AWPC,65,67.5,,,,,,82.5,-87.5,-87.5,,82.5,,,,,,82.5,B,
1,Therese Thorin,Sweden,F,43,Bare,F_MR_1_WPC,64.9,67.5,,,,,,77.5,82.5,85,,85,,,,,,85,B,
1,Natalie Johnson,UK,F,41,Bare,F_MR_1_AWPC,73.5,75,,,,,,90,95,-97.5,,95,,,,,,95,B,
2,Elisa Hyytinen,Finland,F,43,Bare,F_MR_1_AWPC,73.2,75,,,,,,75,82.5,-87.5,,82.5,,,,,,82.5,B,
1,Elisabeth Erholtz,Finland,F,47,Bare,F_MR_2_WPC,93.5,100,,,,,,100,107.5,112,-115,112,,,,,,112,B,
2,Sanna Halenius,Finland,F,45,Bare,F_MR_2_WPC,90.8,100,,,,,,90,100,-102.5,,100,,,,,,100,B,
1,Johanna Bies,Finland,F,51,Bare,F_MR_3_WPC,55.1,56,,,,,,105.5,110,115,118,115,,,,,,115,B,
1,Cecile Bengtsson,Sweden,F,51,Bare,F_MR_3_AWPC,73.4,75,,,,,,-67.5,67.5,-72.5,,67.5,,,,,,67.5,B,
1,Virpi Pukkila,Finland,F,56,Bare,F_MR_4_WPC,73,75,,,,,,80,87.5,92.5,,92.5,,,,,,92.5,B,
1,Julie Green #1,UK,F,56,Bare,F_MR_4_AWPC,106.8,110,,,,,,67.5,70,-73.5,,70,,,,,,70,B,
1,Mary Palmer,UK,F,71,Bare,F_MR_7_AWPC,65.4,67.5,,,,,,35,37.5,-40,,37.5,,,,,,37.5,B,
1,Nelly Herrmann,Switzerland,F,79,Bare,F_MR_8_AWPC,57,60,,,,,,40,42.5,-45,,42.5,,,,,,42.5,B,
1,Minna Korhonen,Finland,F,34,Bare,F_OR_WPC,51.4,52,,,,,,45,47.5,50,,50,,,,,,50,B,
1,Johanna Bies,Finland,F,51,Bare,F_OR_WPC,55.1,56,,,,,,105.5,110,115,118,115,,,,,,115,B,
2,Maija Sjöblom,Finland,F,27,Bare,F_OR_WPC,65.4,67.5,,,,,,85,-90,-90,,85,,,,,,85,B,
1,Anna Nyyssönen,Finland,F,35,Bare,F_OR_WPC,73.9,75,,,,,,80,87.5,-90,,87.5,,,,,,87.5,B,
1,Emma Huhta,Finland,F,31,Bare,F_OR_WPC,88.6,90,,,,,,100,122.5,,,122.5,,,,,,122.5,B,
1,Elisabeth Erholtz,Finland,F,47,Bare,F_OR_WPC,93.5,100,,,,,,100,107.5,112,-115,112,,,,,,112,B,
2,Sanna Halenius,Finland,F,45,Bare,F_OR_WPC,90.8,100,,,,,,90,100,-102.5,,100,,,,,,100,B,
1,Carmen Crisafull,Italy,F,26,Bare,F_OR_AWPC,58.5,60,,,,,,62.5,-67.5,-67.5,,62.5,,,,,,62.5,B,
1,Natalie Johnson,UK,F,41,Bare,F_OR_AWPC,73.5,75,,,,,,90,95,-97.5,,95,,,,,,95,B,
1,Kerttu Mehtälä,Finland,F,15,Bare,F_TR_1_WPC,88.9,90,,,,,,25,35,40,,40,,,,,,40,B,
1,Julia Chowaniak,Poland,F,16,Bare,F_TR_2_AWPC,66.7,67.5,,,,,,52.5,-57.5,-57.5,,52.5,,,,,,52.5,B,
1,Therese Thorin,Sweden,F,43,Sleeves,F_OR_WPC,64.9,67.5,,,,,,77.5,82.5,85,,85,,,,,,85,B,
1,Julie Green #1,UK,F,56,Single-ply,F_MES_4_AWPC,106.8,110,,,,,,85,90,95,-100,95,,,,,,95,B,
1,Nerina Olander,Finland,F,20,Bare,F_JR_WPC,47,48,,,,,,,,,,,105,110,117.5,,117.5,117.5,D,
1,Silvia Burgio,Italy,F,23,Bare,F_JR_AWPC,65,67.5,,,,,,,,,,,-135,140,145,,145,145,D,
1,Mira Taylor,UK,F,40,Bare,F_MR_1_WPC,59.2,60,,,,,,,,,,,155,-165,165,,165,165,D,
1,Elisa Hyytinen,Finland,F,43,Bare,F_MR_1_AWPC,73.2,75,,,,,,,,,,,135,147.5,-155,,147.5,147.5,D,
1,Petra Blomvall,Finland,F,46,Bare,F_MR_2_WPC,77.8,82.5,,,,,,,,,,,217.5,230,250,-260,250,250,D,
1,Sanna Halenius,Finland,F,45,Bare,F_MR_2_WPC,90.8,100,,,,,,,,,,,185,-200,-200,,185,185,D,
1,Deborah Mangan,Ireland,F,49,Bare,F_MR_2_AWPC,71.9,75,,,,,,,,,,,170,175,-180,,175,175,D,
1,Victoria Howson,UK,F,46,Bare,F_MR_2_AWPC,90,90,,,,,,,,,,,140,150,160,-165,160,160,D,
1,Maria Tindara Scilipoti,Italy,F,50,Bare,F_MR_3_AWPC,59,60,,,,,,,,,,,100,107.5,-112.5,,107.5,107.5,D,
1,Pauliina Inervo,Finland,F,59,Bare,F_MR_4_WPC,58.5,60,,,,,,,,,,,70,80,85,,85,85,D,
1,Julie Green #1,UK,F,56,Bare,F_MR_4_AWPC,106.8,110,,,,,,,,,,,125,135,-145,,135,135,D,
1,Mary Palmer,UK,F,71,Bare,F_MR_7_AWPC,65.5,67.5,,,,,,,,,,,72.5,75,80,,80,80,D,
1,Mira Taylor,UK,F,40,Bare,F_OR_WPC,59.2,60,,,,,,,,,,,155,-165,165,,165,165,D,
1,Jerna Rytkönen,Finland,F,39,Bare,F_OR_WPC,66.8,67.5,,,,,,,,,,,170,180,190,,190,190,D,
1,Petra Blomvall,Finland,F,46,Bare,F_OR_WPC,77.8,82.5,,,,,,,,,,,217.5,230,250,-260,250,250,D,
1,Emma Huhta,Finland,F,31,Bare,F_OR_WPC,88.6,90,,,,,,,,,,,200,220,-233,,220,220,D,
1,Sanna Halenius,Finland,F,45,Bare,F_OR_WPC,90.8,100,,,,,,,,,,,185,-200,-200,,185,185,D,
1,Katja Jäppinen,Finland,F,38,Bare,F_OR_AWPC,55.3,56,,,,,,,,,,,110,120,-130,,120,120,D,
1,Carmen Crisafull,Italy,F,26,Bare,F_OR_AWPC,58.5,60,,,,,,,,,,,135,142.5,150,,150,150,D,
1,Dearbhla Gilhooly,Ireland,F,32,Bare,F_OR_AWPC,96,100,,,,,,,,,,,160,165,170,,170,170,D,
1,Rachel Curley,Ireland,F,31,Bare,F_OR_AWPC,112.1,110+,,,,,,,,,,,130,-142.5,-142.5,,130,130,D,
1,Kerttu Mehtälä,Finland,F,15,Bare,F_TR_1_WPC,88.9,90,,,,,,,,,,,70,80,90,,90,90,D,
1,Kiia Ihanmäki,Finland,F,17,Bare,F_TR_2_WPC,47.6,48,,,,,,,,,,,96,100,102.5,105,102.5,102.5,D,
1,Julia Chowaniak,Poland,F,16,Bare,F_TR_2_AWPC,66.7,67.5,,,,,,,,,,,-80,80,85,,85,85,D,
1,Eija Pesonen,Finland,F,32,Multi-ply,F_OEM_WPC,59.8,60,,,,,,,,,,,197.5,205,-215,,205,205,D,
1,Emma Lahti,Finland,F,26,Multi-ply,F_OEM_WPC,72.5,75,,,,,,,,,,,215,230,-242.5,,230,230,D,
1,Maël Le Paven,France,M,43,Single-ply,M_MES_1_WPC,81.1,82.5,210,225,240,,240,130,137.5,-140,,137.5,240,260,-273.5,,260,637.5,SBD,
1,Janne Peltoniemi,Finland,M,40,Single-ply,M_MES_1_WPC,126,140,220,240,,,240,-200,200,-215,,200,220,245,,,245,685,SBD,
1,Richard Curtis,UK,M,41,Single-ply,M_MES_1_AWPC,88.7,90,225,235,-250,,235,130,137.5,142.5,,142.5,230,-245,,,230,607.5,SBD,
1,Shane Brodie,Ireland,M,50,Single-ply,M_MES_3_WPC,98,100,325,-340,340,,340,152.5,155,157.5,,157.5,240,252.5,-255,,252.5,750,SBD,
1,Maël Le Paven,France,M,43,Single-ply,M_OES_WPC,81.1,82.5,210,225,240,,240,130,137.5,-140,,137.5,240,260,-273.5,,260,637.5,SBD,
1,Shane Brodie,Ireland,M,50,Single-ply,M_OES_WPC,98,100,325,-340,340,,340,152.5,155,157.5,,157.5,240,252.5,-255,,252.5,750,SBD,
2,Aleksi Halminen,Finland,M,27,Single-ply,M_OES_WPC,99,100,250,-275,275,,275,160,170,180,,180,250,275,285,,285,740,SBD,
1,Eliot Page,UK,M,31,Single-ply,M_OES_WPC,121.7,125,385,415,440,,440,-255,255,262.5,,262.5,297.5,320,330,,330,1032.5,SBD,
1,Kieran Peters,UK,M,35,Single-ply,M_OES_AWPC,99,100,282.5,300,,,300,185,192.5,,,192.5,275,302.5,,,302.5,795,SBD,
DQ,Daniel Whittall,UK,M,30,Single-ply,M_OES_AWPC,99.9,100,-305,-305,-305,,,175,-202.5,,,175,,,,,,,SBD,
1,Miika Pesonen,Finland,M,15,Single-ply,M_TES_1_WPC,54.6,56,125,135,-150,,135,47.5,52.5,55.5,-60,55.5,150,160,-170,,160,350.5,SBD,
1,Joonas Asikainen,Finland,M,23,Multi-ply,M_JEM_WPC,104,110,270,290,300,,300,-215,220,235,,235,210,230,-250,,230,765,SBD,
1,Shane Brodie,Ireland,M,50,Multi-ply,M_MEM_3_WPC,98,100,360,-370,,,360,167.5,-172.5,,,167.5,230,-240,-250,,230,757.5,SBD,
1,Velimatti Karhu,Finland,M,52,Multi-ply,M_MEM_3_WPC,107.9,110,330,-355,-355,,330,210,-225,225,,225,230,245,-262.5,,245,800,SBD,
1,William Tovell,UK,M,28,Multi-ply,M_OEM_WPC,74.9,75,-225,240,265,,265,120,130,-140,,130,225,245,-260,,245,640,SBD,
1,Sébastien Boizou,France,M,50,Multi-ply,M_OEM_WPC,88.8,90,255,280,-300,,280,-200,-205,205,,205,230,245,260,,260,745,SBD,
1,Johan Frisk,Finland,M,32,Multi-ply,M_OEM_WPC,99.2,100,360,-380,,,360,210,240,-255,,240,280,-310,-330,,280,880,SBD,
2,Shane Brodie,Ireland,M,50,Multi-ply,M_OEM_WPC,98,100,360,-370,,,360,167.5,-172.5,,,167.5,230,-240,-250,,230,757.5,SBD,
3,Antero Bergh,Finland,M,37,Multi-ply,M_OEM_WPC,97.4,100,100,130,140,,140,-100,125,130,,130,150,-160,170,,170,440,SBD,
DQ,Oskari Lehtinen,Finland,M,35,Multi-ply,M_OEM_WPC,99.1,100,-410,-410,410,,410,-295,-295,-295,,,,,,,,,SBD,
1,Marko Hyytinen,Finland,M,38,Multi-ply,M_OEM_WPC,106.5,110,305,320,-335,,320,220,-230,235,,235,230,245,-260,,245,800,SBD,
2,Velimatti Karhu,Finland,M,52,Multi-ply,M_OEM_WPC,107.9,110,330,-355,-355,,330,210,-225,225,,225,230,245,-262.5,,245,800,SBD,
1,Ville Pulli,Finland,M,34,Multi-ply,M_OEM_WPC,117.5,125,-305,-305,305,,305,215,-235,-245,,215,290,310,-320,,310,830,SBD,
1,Juha Suomalainen,Finland,M,51,Single-ply,M_MES_3_WPC,98.7,100,,,,,,190,-197.5,197.5,,197.5,,,,,,197.5,B,
1,Petter Elvekrok,Sweden,M,54,Single-ply,M_MES_3_WPC,115.8,125,,,,,,190,-220.5,-220.5,,190,,,,,,190,B,
1,David Gibson #2,UK,M,58,Single-ply,M_MES_4_WPC,79.8,82.5,,,,,,130,135,-140,,135,,,,,,135,B,
1,Marcus Young,Finland,M,59,Single-ply,M_MES_4_WPC,92,100,,,,,,180,190,-195,,190,,,,,,190,B,
1,Tahvo Jauhojärvi,Finland,M,62,Single-ply,M_MES_5_WPC,73.4,75,,,,,,150,160,,,160,,,,,,160,B,
DQ,Vili Muhonen,Finland,M,25,Single-ply,M_OES_WPC,74.3,75,,,,,,-185,-185,-190,,,,,,,,,B,
1,Kari Järvinen-Heistaro,Finland,M,43,Single-ply,M_OES_WPC,98.6,100,,,,,,-210,210,-250,,210,,,,,,210,B,
2,Agostino Vaccaro,Italy,M,33,Single-ply,M_OES_WPC,95,100,,,,,,140,,,,140,,,,,,140,B,
1,Jussi Kananen,Finland,M,39,Single-ply,M_OES_WPC,152.9,140+,,,,,,182.5,-200,,,182.5,,,,,,182.5,B,
1,Medjahed Sid Ahmed,Algeria,M,26,Single-ply,M_OES_AWPC,69.7,75,,,,,,120,-130,130,,130,,,,,,130,B,
1,Samir Mammadov,Azerbaijan,M,42,Single-ply,M_OES_AWPC,79,82.5,,,,,,190,-205,-205,,190,,,,,,190,B,
1,Daniel Whittall,UK,M,30,Single-ply,M_OES_AWPC,99.9,100,,,,,,175,-202.5,,,175,,,,,,175,B,
1,Zaur Jafarov,Azerbaijan,M,41,Single-ply,M_OES_AWPC,117.4,125,,,,,,245,263,,,263,,,,,,263,B,
1,Toni Haaparanta,Finland,M,50,Multi-ply,M_MEM_3_WPC,74.9,75,,,,,,183,190,-201,,190,,,,,,190,B,
1,Marcus Young,Finland,M,59,Multi-ply,M_MEM_4_WPC,92,100,,,,,,185,192.5,-200,,192.5,,,,,,192.5,B,
1,Kari Markku Kalliola,,M,61,Multi-ply,M_MEM_5_WPC,156.5,140+,,,,,,290,-300,300,,300,,,,,,300,B,
1,Tapio Laine,Finland,M,72,Multi-ply,M_MEM_7_WPC,109.6,110,,,,,,185,195,-210,,195,,,,,,195,B,
1,Kalle Kananen,Finland,M,29,Multi-ply,M_OEM_WPC,80.2,82.5,,,,,,105,112.5,115,,115,,,,,,115,B,
1,Kari Markku Kalliola,,M,61,Multi-ply,M_OEM_WPC,156.5,140+,,,,,,290,-300,300,,300,,,,,,300,B,
1,Eemeli Salomäki,Finland,M,36,Multi-ply,M_OEM_AWPC,81,82.5,,,,,,167.5,-177.5,-177.5,,167.5,,,,,,167.5,B,
1,Eric Platel,France,M,52,Unlimited,M_MEM_3_WPC,108.5,110,,,,,,-280,-280,280,,280,,,,,,280,B,
1,Petter Elvekrok,Sweden,M,54,Unlimited,M_MEM_3_WPC,115.8,125,,,,,,260,285,-305,,285,,,,,,285,B,
1,Anders Oscarsson,Sweden,M,58,Unlimited,M_MEM_4_WPC,105.4,110,,,,,,270,-300,-305,,270,,,,,,270,B,
1,Richard Evans,UK,M,57,Unlimited,M_MEM_4_AWPC,148,140+,,,,,,225,-240,-245,,225,,,,,,225,B,
1,Kevin Maher,UK,M,63,Unlimited,M_MEM_5_WPC,104.6,110,,,,,,210,-220,-227.5,,210,,,,,,210,B,
1,Didier Theux,France,M,66,Unlimited,M_MEM_6_WPC,88.6,90,,,,,,-235,235,250,,250,,,,,,250,B,
1,Didier Theux,France,M,66,Unlimited,M_OEM_WPC,88.6,90,,,,,,-235,235,250,,250,,,,,,250,B,
1,Jani-Markus Mannerkorpi,Finland,M,28,Unlimited,M_OEM_WPC,109.9,110,,,,,,330,340,-350,,340,,,,,,340,B,
2,Eric Platel,France,M,52,Unlimited,M_OEM_WPC,108.5,110,,,,,,-280,-280,280,,280,,,,,,280,B,
1,Petter Elvekrok,Sweden,M,54,Unlimited,M_OEM_WPC,115.8,125,,,,,,260,285,-305,,285,,,,,,285,B,
1,Jussi Kananen,Finland,M,39,Unlimited,M_OEM_WPC,152.9,140+,,,,,,262.5,282.5,-312.5,,282.5,,,,,,282.5,B,
1,Maël Le Paven,France,M,43,Single-ply,M_MES_1_WPC,81.1,82.5,,,,,,,,,,,240,260,-273.5,,260,260,D,
1,Jukka Hakala,Finland,M,46,Single-ply,M_MES_2_WPC,109.8,110,,,,,,,,,,,280,310,-320,,310,310,D,
1,Ismo Koivisto,Finland,M,54,Single-ply,M_MES_3_WPC,98.9,100,,,,,,,,,,,262.5,270.5,280,,280,280,D,
1,Richard Green #2,UK,M,57,Single-ply,M_MES_4_AWPC,117.1,125,,,,,,,,,,,220,-230,230,,230,230,D,
1,Maël Le Paven,France,M,43,Single-ply,M_OES_WPC,81.1,82.5,,,,,,,,,,,240,260,-273.5,,260,260,D,
1,Agostino Vaccaro,Italy,M,33,Single-ply,M_OES_WPC,95,100,,,,,,,,,,,215,-230,,,215,215,D,
1,Toni Haaparanta,Finland,M,50,Multi-ply,M_MEM_3_WPC,74.9,75,,,,,,,,,,,210.5,220,-230,,220,220,D,
1,Richard Green #2,UK,M,57,Multi-ply,M_MEM_4_AWPC,117.1,125,,,,,,,,,,,70,,,,70,70,D,
1,Antony Ciraolo,Italy,M,23,Bare,M_JR_WPC,103,110,,,,,,140,145,150,,150,,,,,,150,B,
1,Petri Mäkelä,Finland,M,40,Bare,M_MR_1_WPC,67,67.5,,,,,,145,148,-150,,148,,,,,,148,B,
1,Kari-Tapio Palvianen,Finland,M,44,Bare,M_MR_1_WPC,80.8,82.5,,,,,,147.5,152.5,-157.5,,152.5,,,,,,152.5,B,
2,Joni Oravasaari,Finland,M,41,Bare,M_MR_1_WPC,81.7,82.5,,,,,,142.5,152.5,-157.5,,152.5,,,,,,152.5,B,
1,Bastien Riou,France,M,42,Bare,M_MR_1_WPC,88.5,90,,,,,,150,165,170,,170,,,,,,170,B,
1,Juha Tuomainen,Finland,M,40,Bare,M_MR_1_WPC,109.1,110,,,,,,250,-260.5,-260.5,,250,,,,,,250,B,
2,Sakari Kuusisto,Finland,M,43,Bare,M_MR_1_WPC,104.2,110,,,,,,185,200,-205,,200,,,,,,200,B,
1,Hannu Koskinen,Finland,M,42,Bare,M_MR_1_WPC,124.2,125,,,,,,225,235,242.5,,242.5,,,,,,242.5,B,
2,Miika Oinonen,Finland,M,41,Bare,M_MR_1_WPC,115.2,125,,,,,,-200,205,212.5,,212.5,,,,,,212.5,B,
1,Matti Matti-Tuuri,Finland,M,40,Bare,M_MR_1_WPC,129.6,140,,,,,,170,180,-190,,180,,,,,,180,B,
1,Jari Airio,Finland,M,49,Bare,M_MR_2_WPC,74.1,75,,,,,,125,135,142.5,,142.5,,,,,,142.5,B,
1,Rami Haaparanta,Finland,M,48,Bare,M_MR_2_WPC,98.9,100,,,,,,175,187.5,195,,195,,,,,,195,B,
2,Kimmo Kalteinen,Finland,M,48,Bare,M_MR_2_WPC,96.4,100,,,,,,175,180,-187.5,,180,,,,,,180,B,
3,Jarkko Ylä-Häkkinen,Finland,M,45,Bare,M_MR_2_WPC,96.9,100,,,,,,170,175,177.5,,177.5,,,,,,177.5,B,
4,Mihails Rekaikins,Latvia,M,47,Bare,M_MR_2_WPC,99.2,100,,,,,,160,170,-177.5,,170,,,,,,170,B,
5,Christian Stoebke,Germany,M,47,Bare,M_MR_2_WPC,96.7,100,,,,,,125,132.5,-140,,132.5,,,,,,132.5,B,
1,Mikael Rantanen,Finland,M,46,Bare,M_MR_2_WPC,109.4,110,,,,,,180,195,-205,,195,,,,,,195,B,
2,Jari Hakkio,Finland,M,45,Bare,M_MR_2_WPC,108.5,110,,,,,,182.5,-195,,,182.5,,,,,,182.5,B,
DQ,Jukka Hakala,Finland,M,46,Bare,M_MR_2_WPC,117.2,125,,,,,,,,,,,,,,,,,B,
1,Artur Kiczuk,Poland,M,46,Bare,M_MR_2_WPC,129.1,140,,,,,,170,182.5,187.5,,187.5,,,,,,187.5,B,
1,Gwezheneg Le Carrer,France,M,50,Bare,M_MR_3_WPC,80.5,82.5,,,,,,105,115,125,,125,,,,,,125,B,
2,Andrea Siino,Italy,M,50,Bare,M_MR_3_WPC,78.3,82.5,,,,,,70,80,90,,90,,,,,,90,B,
1,Klaus Renfors,Finland,M,51,Bare,M_MR_3_WPC,89.4,90,,,,,,147.5,155,-160,,155,,,,,,155,B,
2,Cédric Hupin,France,M,52,Bare,M_MR_3_WPC,86.5,90,,,,,,135,145,150,,150,,,,,,150,B,
1,Marko Kokkinen,Finland,M,54,Bare,M_MR_3_WPC,97.7,100,,,,,,180,187.5,-190,,187.5,,,,,,187.5,B,
2,Kimmo Karjalainen,Finland,M,51,Bare,M_MR_3_WPC,98.3,100,,,,,,160,170,180,,180,,,,,,180,B,
3,Ismo Koivisto,Finland,M,54,Bare,M_MR_3_WPC,100,100,,,,,,145,150,155,,155,,,,,,155,B,
4,Teppo Koskinen,Finland,M,50,Bare,M_MR_3_WPC,99,100,,,,,,132.5,142.5,-152.5,,142.5,,,,,,142.5,B,
1,Krzysztof Chowaniak,Poland,M,51,Bare,M_MR_3_WPC,117.6,125,,,,,,185,195,200,,200,,,,,,200,B,
2,Peter Diethalm,Switzerland,M,50,Bare,M_MR_3_WPC,122.2,125,,,,,,185,197.5,200,,200,,,,,,200,B,
1,Raimo Mannelin,Finland,M,52,Bare,M_MR_3_WPC,143.2,140+,,,,,,155,165,-170,,165,,,,,,165,B,
1,Ari-Pekka Airaksinen,Finland,M,59,Bare,M_MR_4_WPC,79.6,82.5,,,,,,130,140,142.5,,142.5,,,,,,142.5,B,
1,Tilo Kupper,Switzerland,M,59,Bare,M_MR_4_WPC,89.4,90,,,,,,155,160,162.5,,162.5,,,,,,162.5,B,
1,Tero Ylivinkka,Finland,M,58,Bare,M_MR_4_WPC,118.8,125,,,,,,160,170,-175,,170,,,,,,170,B,
1,Tahvo Jauhojärvi,Finland,M,62,Bare,M_MR_5_WPC,74,75,,,,,,110,-120,130,,130,,,,,,130,B,
1,Rane Ovaska,Finland,M,63,Bare,M_MR_5_WPC,76.5,82.5,,,,,,90,100,-110,,100,,,,,,100,B,
1,Gábor Kovács,Hungary,M,61,Bare,M_MR_5_WPC,87.3,90,,,,,,110,-120,120,,120,,,,,,120,B,
1,Tapio Laine,Finland,M,72,Bare,M_MR_7_WPC,113.3,125,,,,,,-140,140,-150,,140,,,,,,140,B,
1,Petri Mäkelä,Finland,M,40,Bare,M_OR_WPC,67,67.5,,,,,,145,148,-150,,148,,,,,,148,B,
1,Marcin Garbas,Poland,M,39,Bare,M_OR_WPC,81.6,82.5,,,,,,200,205,-210,,205,,,,,,205,B,
2,Heikki Kulppi,Finland,M,33,Bare,M_OR_WPC,82,82.5,,,,,,152.5,-157.5,-157.5,,152.5,,,,,,152.5,B,
1,Ville Sieppi,Finland,M,36,Bare,M_OR_WPC,89.2,90,,,,,,195,205,210,,210,,,,,,210,B,
2,Klaus Renfors,Finland,M,51,Bare,M_OR_WPC,89.4,90,,,,,,147.5,155,-160,,155,,,,,,155,B,
1,Jani Virtanen,Finland,M,29,Bare,M_OR_WPC,99.1,100,,,,,,210,217.5,225,,225,,,,,,225,B,
2,Juha Tikka,Finland,M,32,Bare,M_OR_WPC,98.9,100,,,,,,205,-210,-210,,205,,,,,,205,B,
3,Marko Kokkinen,Finland,M,54,Bare,M_OR_WPC,97.7,100,,,,,,180,187.5,-190,,187.5,,,,,,187.5,B,
4,Mathias Steiner,Switzerland,M,36,Bare,M_OR_WPC,99.9,100,,,,,,170,177.5,-182.5,,177.5,,,,,,177.5,B,
5,Otto Untamo,Finland,M,34,Bare,M_OR_WPC,98.9,100,,,,,,160,165,-170,,165,,,,,,165,B,
DQ,Harri Vakkinen-Huhta,Finland,M,39,Bare,M_OR_WPC,96.8,100,,,,,,-160,-160,,,,,,,,,,B,
1,Juha Tuomainen,Finland,M,40,Bare,M_OR_WPC,109.1,110,,,,,,250,-260.5,-260.5,,250,,,,,,250,B,
2,Joona Piironen,Finland,M,34,Bare,M_OR_WPC,107.7,110,,,,,,225,232.5,237.5,,237.5,,,,,,237.5,B,
3,Lauri Marttilla,Finland,M,33,Bare,M_OR_WPC,109.2,110,,,,,,215,225,-235,,225,,,,,,225,B,
4,Mikael Kettunen,Finland,M,27,Bare,M_OR_WPC,109.6,110,,,,,,190,202.5,-207.5,,202.5,,,,,,202.5,B,
5,Juuso Knuutila,Finland,M,26,Bare,M_OR_WPC,106.3,110,,,,,,170,175,-180,,175,,,,,,175,B,
6,Salvatoe Busuito,Italy,M,34,Bare,M_OR_WPC,106.7,110,,,,,,150,155,-162.5,,155,,,,,,155,B,
1,Hannu Koskinen,Finland,M,42,Bare,M_OR_WPC,124.2,125,,,,,,225,235,242.5,,242.5,,,,,,242.5,B,
2,Olivier Bertin,France,M,39,Bare,M_OR_WPC,122.2,125,,,,,,200,212.5,215,,215,,,,,,215,B,
3,Miika Oinonen,Finland,M,41,Bare,M_OR_WPC,115.2,125,,,,,,-200,205,212.5,,212.5,,,,,,212.5,B,
4,Krzysztof Chowaniak,Poland,M,51,Bare,M_OR_WPC,117.6,125,,,,,,185,195,200,,200,,,,,,200,B,
1,Jani Ruotsalainen,Finland,M,35,Bare,M_OR_WPC,133.5,140,,,,,,205,-215,215,,215,,,,,,215,B,
2,Artur Kiczuk,Poland,M,46,Bare,M_OR_WPC,129.1,140,,,,,,170,182.5,187.5,,187.5,,,,,,187.5,B,
3,Toni Liikanen,Finland,M,38,Bare,M_OR_WPC,133,140,,,,,,170,180,-187.5,,180,,,,,,180,B,
1,Raimo Mannelin,Finland,M,52,Bare,M_OR_WPC,143.2,140+,,,,,,155,165,-170,,165,,,,,,165,B,
1,Theo Boizou,France,M,15,Bare,M_TR_1_WPC,54.1,56,,,,,,-80,80,-85,,80,,,,,,80,B,
1,Konsta Mehtälä,Finland,M,17,Bare,M_TR_2_WPC,81.4,82.5,,,,,,87.5,95,-100,,95,,,,,,95,B,
1,Vihtori Tuomainen,Finland,M,17,Bare,M_TR_2_WPC,74.7,75,,,,,,100,110,117.5,,117.5,,,,,,117.5,B,
1,Sami Vaskelainen,Finland,M,40,Bare,M_MR_1_WPC,74.9,75,,,,,,,,,,,270,285,292.5,-300,292.5,292.5,D,
1,Maël Le Paven,France,M,43,Bare,M_MR_1_WPC,82.5,82.5,,,,,,,,,,,237.5,247.5,257.5,-277.5,257.5,257.5,D,
1,Martin O Mahony,Ireland,M,44,Bare,M_MR_1_WPC,94.8,100,,,,,,,,,,,275,-300,-300,,275,275,D,
1,Mauritz Varha,Finland,M,43,Bare,M_MR_1_WPC,109.5,110,,,,,,,,,,,270,290,-300,,290,290,D,
2,Kaj Österberg,Finland,M,43,Bare,M_MR_1_WPC,108.9,110,,,,,,,,,,,255,265,272.5,,272.5,272.5,D,
1,Matti Matti-Tuuri,Finland,M,40,Bare,M_MR_1_WPC,129.6,140,,,,,,,,,,,260,280,292.5,,292.5,292.5,D,
1,Andrea Siino,Italy,M,50,Bare,M_MR_3_WPC,78.3,82.5,,,,,,,,,,,175,187.5,195,,195,195,D,
1,Christophe Lesieux,France,M,50,Bare,M_MR_3_WPC,86,90,,,,,,,,,,,190,210,225,,225,225,D,
1,Marko Kokkinen,Finland,M,54,Bare,M_MR_3_WPC,97.7,100,,,,,,,,,,,277.5,287.5,292.5,,292.5,292.5,D,
1,Arto Selkee,Finland,M,63,Bare,M_MR_5_WPC,81.6,82.5,,,,,,,,,,,175,185,190,,190,190,D,
1,Gábor Kovács,Hungary,M,61,Bare,M_MR_5_WPC,87.3,90,,,,,,,,,,,120,130,135,,135,135,D,
1,Olavi Rintanen,Finland,M,69,Bare,M_MR_6_WPC,119.8,125,,,,,,,,,,,225,245,265,,265,265,D,
1,Raine Mäkinen,Finland,M,66,Bare,M_MR_6_WPC,72.1,75,,,,,,,,,,,170,180,185,,185,185,D,
1,Matti Oksanen,Finland,M,84,Bare,M_MR_9_WPC,53,56,,,,,,,,,,,85,90,101,,101,101,D,
1,Taisto Inervo,Finland,M,82,Bare,M_MR_9_WPC,61.9,67.5,,,,,,,,,,,90,110,115,-117.5,115,115,D,
1,Jeremy Sailleau,France,M,36,Bare,M_OR_WPC,66.4,67.5,,,,,,,,,,,190,210,217.5,,217.5,217.5,D,
2,Giuseppe Miano,Italy,M,36,Bare,M_OR_WPC,74.5,75,,,,,,,,,,,195,210,-220,,210,210,D,
1,Sami Vaskelainen,Finland,M,40,Bare,M_OR_WPC,74.9,75,,,,,,,,,,,270,285,292.5,-300,292.5,292.5,D,
1,Maël Le Paven,France,M,43,Bare,M_OR_WPC,82.5,82.5,,,,,,,,,,,237.5,247.5,257.5,,257.5,257.5,D,
2,Andrea Ungaro,Italy,M,28,Bare,M_OR_WPC,81.2,82.5,,,,,,,,,,,220,230,-247.5,,230,230,D,
1,Teemu Leppänen,Finland,M,31,Bare,M_OR_WPC,89.2,90,,,,,,,,,,,270,300,-312.5,,300,300,D,
1,Jukka Matikainen,Finland,M,30,Bare,M_OR_WPC,98.2,100,,,,,,,,,,,272.5,300,315,,315,315,D,
2,Marko Kokkinen,Finland,M,54,Bare,M_OR_WPC,97.7,100,,,,,,,,,,,277.5,287.5,292.5,,292.5,292.5,D,
3,Harri Vakkinen-Huhta,Finland,M,39,Bare,M_OR_WPC,96.8,100,,,,,,,,,,,-275,275,-300,,275,275,D,
4,Otto Untamo,Finland,M,34,Bare,M_OR_WPC,98.9,100,,,,,,,,,,,240,260,-280,,260,260,D,
5,Teppo Koskinen,Finland,M,50,Bare,M_OR_WPC,99,100,,,,,,,,,,,220,237.5,242.5,,242.5,242.5,D,
DQ,Stuart Morris #2,UK,M,39,Bare,M_OR_WPC,98,100,,,,,,,,,,,-230,,,,,,D,
1,Oskari Simonen,Finland,M,26,Bare,M_OR_WPC,107.6,110,,,,,,,,,,,330,350,360,,360,360,D,
2,Mauritz Varha,Finland,M,43,Bare,M_OR_WPC,109.5,110,,,,,,,,,,,270,290,-300,,290,290,D,
1,Markus Haake,Finland,M,30,Bare,M_OR_WPC,117.4,125,,,,,,,,,,,340,360,-370,,360,360,D,
2,Atte Anttila,Finland,M,30,Bare,M_OR_WPC,117.2,125,,,,,,,,,,,270,300,-310,,300,300,D,
1,Toni Liikanen,Finland,M,38,Bare,M_OR_WPC,133,140,,,,,,,,,,,220,240,-245,,240,240,D,
1,Theo Boizou,France,M,15,Bare,M_TR_1_WPC,54.1,56,,,,,,,,,,,140,151,155,,155,155,D,
1,Konsta Mehtälä,Finland,M,17,Bare,M_TR_2_WPC,81.4,82.5,,,,,,,,,,,145,155,162.5,,162.5,162.5,D,
1,Adam Stone #1,UK,M,20,Bare,M_JR_WPC,105.3,110,140,180,210,,210,140,147.5,152.5,,152.5,240,260,265,,265,627.5,SBD,
1,Jussi Wilén,Finland,M,42,Bare,M_MR_1_WPC,81.3,82.5,155,165,170,,170,127.5,135,140,,140,230,250,260,265,260,570,SBD,
1,Samppa Nyman,Finland,M,41,Bare,M_MR_1_WPC,88,90,212.5,222.5,232.5,,232.5,135,145,155,,155,252.5,270,280,,280,667.5,SBD,
1,Gareth James,UK,M,44,Bare,M_MR_1_WPC,93.7,100,175,190,202.5,,202.5,115,122.5,127.5,,127.5,240,260,-270,,260,590,SBD,
1,Olli Myöhänen,Finland,M,42,Bare,M_MR_1_WPC,123.4,125,265,,,,265,210,217.5,-225,,217.5,310,325,340,,340,822.5,SBD,
1,Timo Tuuri,Finland,M,47,Bare,M_MR_2_WPC,67.3,67.5,155,160,-162.5,,160,-110,-112.5,112.5,-115,112.5,200,-207.5,-207.5,,200,472.5,SBD,
1,Nuno Nobre,Portugal,M,46,Bare,M_MR_2_WPC,89.3,90,195,210,215,,215,165,175,-180.5,,175,220,230,240,,240,630,SBD,
2,Antti Tietäväinen,Finland,M,46,Bare,M_MR_2_WPC,88.2,90,180,195,202.5,,202.5,130,145,150,,150,215,-230,,,215,567.5,SBD,
1,Miika Kajavalta,Finland,M,45,Bare,M_MR_2_WPC,91.4,100,150,-160,-160,,150,130,140,-150,,140,170,,,,170,460,SBD,
DQ,Harri Korhonen,Finland,M,45,Bare,M_MR_2_WPC,103.2,110,160,-170,170,,170,125,-130,,,125,-220,-220,,,,,SBD,
1,Jarno Ojala,Finland,M,47,Bare,M_MR_2_WPC,126.5,140,-180,180,200,,200,160,175,185,,185,190,200,210,,210,595,SBD,
1,Jukka Aho,Finland,M,53,Bare,M_MR_3_WPC,89.7,90,150,165,180,,180,125,135,142.5,,142.5,185,205,230,,230,552.5,SBD,
1,Juha-Pekka Kinnunen,Finland,M,50,Bare,M_MR_3_WPC,115.7,125,210,220,227.5,,227.5,135,142.5,-147.5,,142.5,220,230,240,,240,610,SBD,
1,Jan Augustat,Germany,M,55,Bare,M_MR_4_WPC,79.9,82.5,165,177.5,-185,,177.5,120,125,130,,130,200,210,-226,,210,517.5,SBD,
1,Janne Murto,Finland,M,56,Bare,M_MR_4_WPC,98.4,100,135,145,-157.5,,145,120,-130,130,,130,185,195,-200,,195,470,SBD,
1,Juha Järvisalo,Finland,M,56,Bare,M_MR_4_WPC,105.9,110,200,216,225.5,,225.5,125,135,140,,140,210,237.5,-252.5,,237.5,603,SBD,
1,Timo Tuuri,Finland,M,47,Bare,M_OR_WPC,67.3,67.5,155,160,-162.5,,160,-110,-112.5,112.5,-115,112.5,200,-207.5,-207.5,,200,472.5,SBD,
1,Manu Iehtiniemi,Finland,M,25,Bare,M_OR_WPC,73.9,75,180,190,-195,,190,135,142.5,-145,,142.5,220,235,-242.5,,235,567.5,SBD,
2,Henri Toukometsä,Finland,M,30,Bare,M_OR_WPC,74.8,75,175,-190,,,175,125,135,145,,145,190,220,245,,245,565,SBD,
1,Andrea Ungaro,Italy,M,28,Bare,M_OR_WPC,81.3,82.5,180,-190,-190,,180,125,135,140,,140,205,220,230,,230,550,SBD,
DQ,Cyriaque Audouard,France,M,40,Bare,M_OR_WPC,81.2,82.5,210,-230,237.5,,237.5,-175,-175,-190,,,,,,,,,SBD,
3,Jussi Jaakkola,Finland,M,35,Bare,M_OR_WPC,81.6,82.5,200,212.5,-220,,212.5,140,150,-162.5,,150,270,-285,-285,,270,632.5,SBD,
1,Samppa Nyman,Finland,M,41,Bare,M_OR_WPC,88,90,212.5,222.5,232.5,,232.5,135,145,155,,155,252.5,270,280,,280,667.5,SBD,
2,Yassine Ibn el Ha,France,M,26,Bare,M_OR_WPC,89.7,90,200,215,-225,,215,160,165,-170,,165,280,-300,-300,,280,660,SBD,
3,Ville Hepokari,Finland,M,39,Bare,M_OR_WPC,88.7,90,200,215,225,,225,150,-160,-160,,150,250,260,-270,,260,635,SBD,
1,Aleksi Hiissa,Finland,M,30,Bare,M_OR_WPC,98.9,100,220,235,-240,,235,150,-160,-160,,150,260,-275,,,260,645,SBD,
2,Gareth James,UK,M,44,Bare,M_OR_WPC,93.7,100,175,190,202.5,,202.5,115,122.5,127.5,,127.5,240,260,-270,,260,590,SBD,
1,Adam Stone #1,UK,M,20,Bare,M_OR_WPC,105.3,110,140,180,210,,210,140,147.5,152.5,,152.5,240,260,265,,265,627.5,SBD,
2,Henri Kotkansalo,Finland,M,27,Bare,M_OR_WPC,107.5,110,150,170,-185,,170,130,140,145,,145,250,270,-280,,270,585,SBD,
1,Olli Myöhänen,Finland,M,42,Bare,M_OR_WPC,123.4,125,265,,,,265,210,217.5,-225,,217.5,310,325,340,,340,822.5,SBD,
2,Iiro Jokipalo,Finland,M,32,Bare,M_OR_WPC,121.1,125,295,300,-307.5,,300,185,195,-200,,195,290,300,-312.5,,300,795,SBD,
1,Eslam Sabry,Egypt,M,17,Bare,M_OR_AWPC,63.7,67.5,140,165,177.5,,177.5,100,120,-125,,120,200,-215,215,,215,512.5,SBD,
1,Theo Boizou,France,M,15,Bare,M_TR_1_WPC,54.4,56,100,-110,110,,110,67.5,75.5,80,,80,137.5,145,152.5,,152.5,342.5,SBD,
1,Hannu Niemelä,Finland,M,53,Wraps,M_MCR_3_WPC,82.5,82.5,155,165,,,165,120,125,127.5,,127.5,190,197.5,202.5,,202.5,495,SBD,
1,Vilho Määttä,Finland,M,71,Wraps,M_MCR_7_WPC,81.2,82.5,90,100,110,,110,85,90,92.5,,92.5,150,160,165,,165,367.5,SBD,
1,Youssef Abdallah,Egypt,M,18,Wraps,M_OCR_WPC,63.8,67.5,180,200,205,,205,95,100,-105,,100,305,-320,,,305,610,SBD,
1,Elsayed Sabry,Egypt,M,19,Wraps,M_OCR_WPC,73.5,75,215,230,-240,,230,165,175,180.5,-185,180.5,225,232.5,-240,,232.5,643,SBD,
2,Rafael Costa,Switzerland,M,25,Wraps,M_OCR_WPC,74.4,75,75,170,180,,180,120,130,-135,,130,150,,,,150,460,SBD,
1,Emil Karjalainen,Finland,M,25,Wraps,M_OCR_WPC,82.1,82.5,262.5,285,-300,,285,165,177.5,183,,183,270,287.5,300,,300,768,SBD,
2,Leevi Sieppi,Finland,M,23,Wraps,M_OCR_WPC,77.8,82.5,200,215,230,,230,127.5,135,-142.5,,135,210,225,235,,235,600,SBD,
3,Atte Sumén,Finland,M,30,Wraps,M_OCR_WPC,82.1,82.5,170,180,-190,,180,120,130,137.5,,137.5,200,217.5,227.5,,227.5,545,SBD,
1,Raul Kivine,Finland,M,40,Wraps,M_MCR_1_WPC,89.1,90,-250,267.5,275,,275,145,-155,-155,,145,260,275,-292.5,,275,695,SBD,
1,Adam Stankiewicz,Poland,M,43,Wraps,M_MCR_1_WPC,99.3,100,290,-310,-310,,290,185,190,195,,195,250,270,280,,280,765,SBD,
2,Tero Pitkänen,Finland,M,43,Wraps,M_MCR_1_WPC,99.4,100,250,270,-280,,270,170,180,-190,,180,265,277.5,-290,,277.5,727.5,SBD,
3,Asseri Kyytsönen,Finland,M,40,Wraps,M_MCR_1_WPC,99.8,100,230,240,-255,,240,155,180,,,180,200,,,,200,620,SBD,
4,Tero Manner,Finland,M,43,Wraps,M_MCR_1_WPC,99.3,100,190,-210,210,,210,110,115,120,,120,210,220,230,,230,560,SBD,
5,Tuomas Siivonen,Finland,M,44,Wraps,M_MCR_1_WPC,95.2,100,170,175,180,,180,110,-115,,,110,170,190,,,190,480,SBD,
1,Jussi Valkama,Finland,M,43,Wraps,M_MCR_1_WPC,109.9,110,300,-325,325,,325,180,190,-200,,190,300,320,-330.5,,320,835,SBD,
2,Szymon Bielucy,Poland,M,42,Wraps,M_MCR_1_WPC,109,110,270,-290,290,,290,160,170,-175,,170,-270,270,-300,,270,730,SBD,
3,Lasse Ohtamaa,Finland,M,43,Wraps,M_MCR_1_WPC,103.4,110,215,230,245,,245,155,160,165,,165,255,260,265,,265,675,SBD,
4,David Lindström,Sweden,M,43,Wraps,M_MCR_1_WPC,109.5,110,185,205,215,,215,115,122.5,-130,,122.5,230,250,260,,260,597.5,SBD,
1,Jouko Kiesiläinen,Finland,M,41,Wraps,M_MCR_1_WPC,120.1,125,235,250,260,,260,170,180,-185,,180,235,250,260,,260,700,SBD,
1,Jorma Mäkeläinen,Finland,M,48,Wraps,M_MCR_2_WPC,98.2,100,210,-220,-220,,210,155,162.5,-167.5,,162.5,210,,,,210,582.5,SBD,
1,Ari Kortetjärvi,Finland,M,53,Sleeves,M_MCR_3_WPC,89.5,90,235,265,280,,280,160,170,175,,175,255,-305,,,255,710,SBD,
1,Petri Lindholm,Finland,M,53,Wraps,M_MCR_3_WPC,129.7,140,280,310,331,,331,170,185,-194,,185,270,290,300,,300,816,SBD,
1,Raimo Hiisiö,Finland,M,55,Wraps,M_MCR_4_WPC,123.4,125,210,230,245,,245,165,180,185,,185,220,240,247.5,,247.5,677.5,SBD,
1,Asko Kajanoja,Finland,M,63,Wraps,M_MCR_5_WPC,98.2,100,200,-222.5,-222.5,,200,125,132.5,140,,140,230,250.5,,,250.5,590.5,SBD,
1,Aki Vuorio,Finland,M,60,Wraps,M_MCR_5_WPC,109,110,185,195,-200,,195,50,,,,50,195,205,-212.5,,205,450,SBD,
1,Jukka Lindström,Finland,M,71,Wraps,M_MCR_7_WPC,95.6,100,-190,-190,190,200,190,80,100,,,100,120,150,170,,170,460,SBD,
1,Joni Laiho,Finland,M,31,Wraps,M_OCR_WPC,88.9,90,245,260,270,,270,157.5,170,180,,180,250,-265,270,,270,720,SBD,
2,Raul Kivine,Finland,M,40,Wraps,M_OCR_WPC,89.1,90,-250,267.5,275,,275,145,-155,-155,,145,260,275,-292.5,,275,695,SBD,
DQ,Harri Vakkinen-Huhta,Finland,M,39,Wraps,M_OCR_WPC,88.8,90,-320,-320,-320,,,,,,,,,,,,,,SBD,
1,Joona Leppäjärvi,Finland,M,28,Sleeves,M_OCR_WPC,99.5,100,275,300,312.5,,312.5,180,190,200,,200,275,300,-312.5,,300,812.5,SBD,
1,Jussi Valkama,Finland,M,43,Wraps,M_OCR_WPC,109.9,110,300,-325,325,,325,180,190,-200,,190,300,320,-330.5,,320,835,SBD,
2,Hannu Österman,Finland,M,25,Sleeves,M_OCR_WPC,103.7,110,300,320,330,,330,150,162.5,-170,,162.5,220,270,300,,300,792.5,SBD,
3,Jonathan Bottin,France,M,36,Wraps,M_OCR_WPC,107.8,110,270,280,290,,290,190,-200,200,,200,280,300,-305,,300,790,SBD,
1,Miikka Orädd,Finland,M,39,Wraps,M_OCR_WPC,122.9,125,320,-345,345,,345,230,237.5,-245,,237.5,320,335,345,,345,927.5,SBD,
2,Anthony Singh #1,Finland,M,23,Wraps,M_OCR_WPC,123.5,125,330,350,360,,360,190,200,-205,,200,300,330,-343,,330,890,SBD,
3,AJ Cronin,Ireland,M,36,Wraps,M_OCR_WPC,121.6,125,305,335,-345,,335,185,195,-197.5,,195,305,317.5,322.5,,322.5,852.5,SBD,
4,Jan-Erik Maantila,Finland,M,38,Wraps,M_OCR_WPC,119.7,125,290,310,,,310,205,220,-225,,220,260,275,285,,285,815,SBD,
DQ,Jani Varha,Finland,M,31,Wraps,M_OCR_WPC,118.8,125,-330,-330,-355,,,,,,,,,,,,,,SBD,
1,Petri Lindholm,Finland,M,53,Wraps,M_OCR_WPC,129.7,140,280,310,331,,331,170,185,-194,,185,270,290,300,,300,816,SBD,
2,Tero Soini,Finland,M,38,Wraps,M_OCR_WPC,126,140,220,230,240,,240,145,155,-162.5,,155,240,265,272.5,,272.5,667.5,SBD,
3,Tuomas Uotila,Finland,M,28,Wraps,M_OCR_WPC,126.5,140,230,245,260,,260,145,152.5,157.5,,157.5,-230,245,-255,,245,662.5,SBD,
4,Seppo Honkanen,Finland,M,36,Wraps,M_OCR_WPC,137.8,140,220,-240,240,,240,140,150,160,,160,220,245,-255,,245,645,SBD,
