Division,WeightClassKg,Place,Name,Team,BodyweightKg,Best3SquatKg,Best3BenchKg,Best3DeadliftKg,TotalKg,Equipment,Event,Sex
Girls,44.23,1,Alexis Iglesias #1,Port Lavaca Calhoun,44,102.06,52.16,106.59,260.82,Single-ply,SBD,F
Girls,44.23,2,Thay Blute,Port Lavaca Calhoun,44,102.06,49.9,104.33,256.28,Single-ply,SBD,F
Girls,44.23,3,Say Paw,Port Lavaca Calhoun,44,102.06,56.7,95.25,254.01,Single-ply,SBD,F
Girls,44.23,4,Reiann Longoria,Corpus Christi John Paul II High School,44,68.04,45.36,79.38,192.78,Single-ply,SBD,F
Girls,47.85,1,Salma Anaya-Martinez,Port Lavaca Calhoun,47.17,117.93,56.7,117.93,292.57,Single-ply,SBD,F
Girls,47.85,2,Isabella Adams,Sinton,45.36,86.18,45.36,83.91,215.46,Single-ply,SBD,F
Girls,47.85,3,Raven Decker,Rockport-Fulton,44.36,72.57,34.02,92.99,199.58,Single-ply,SBD,F
Girls,47.85,4,Aprilrayne Lancaster,San Antonio East Central,46.72,77.11,40.82,74.84,192.78,Single-ply,SBD,F
Girls,47.85,5,Amber Reasner,Corpus Christi Calallen,44.45,43.09,20.41,54.43,117.93,Single-ply,SBD,F
Girls,51.94,1,Present May,Port Lavaca Calhoun,51.26,158.76,68.04,145.15,371.95,Single-ply,SBD,F
Girls,51.94,2,Juliana Vasquez,Corpus Christi Tuloso-Midway,51.26,113.4,61.23,113.4,288.03,Single-ply,SBD,F
Girls,51.94,3,Hannah Saegert,Rockport-Fulton,50.8,115.67,45.36,115.67,276.69,Single-ply,SBD,F
Girls,51.94,4,Mkenzie Estrada,Gregory-Portland,51.71,106.59,47.63,88.45,242.67,Single-ply,SBD,F
Girls,51.94,5,Lorena Rodriguez,Gregory-Portland,51.26,90.72,47.63,90.72,229.06,Single-ply,SBD,F
Girls,51.94,6,Myndi Rodgriquez,Corpus Christi Tuloso-Midway,48.08,108.86,,,108.86,Single-ply,S,F
Girls,51.94,DQ,Abby Saegert,Rockport-Fulton,49.9,,,,,Single-ply,SBD,F
Girls,51.94,DQ,Mikayla Garcia,San Antonio East Central,51.94,,,,,Single-ply,SBD,F
Girls,51.94,DQ,Jackie Cantu,Taft,51.71,,,,,Single-ply,SBD,F
Girls,56.02,1,Skyleigh Sears,Port Lavaca Calhoun,55.34,172.37,81.65,172.37,426.38,Single-ply,SBD,F
Girls,56.02,2,Eh Nay Gay Hso,Port Lavaca Calhoun,53.98,145.15,56.7,129.27,331.12,Single-ply,SBD,F
Girls,56.02,3,Mikayla Martinez,Beeville Jones,55.47,111.13,74.84,124.74,310.71,Single-ply,SBD,F
Girls,56.02,4,Law Ra Moo,Port Lavaca Calhoun,55.79,124.74,63.5,117.93,306.17,Single-ply,SBD,F
Girls,56.02,5,Jocelyn Rodriguez,San Antonio East Central,55.79,122.47,54.43,113.4,290.3,Single-ply,SBD,F
Girls,56.02,6,Iliana Garza,Santa Gertrudis Academy,53.98,104.33,45.36,117.93,267.62,Single-ply,SBD,F
Girls,56.02,7,Maddie Mae Johnson,Corpus Christi Tuloso-Midway,55.34,102.06,54.43,102.06,258.55,Single-ply,SBD,F
Girls,56.02,8,Angel Rodríguez #2,Corpus Christi Calallen,52.16,92.99,47.63,102.06,242.67,Single-ply,SBD,F
Girls,56.02,9,Alexandria Licea,San Antonio East Central,55.34,95.25,52.16,92.99,240.4,Single-ply,SBD,F
Girls,56.02,10,Samantha Rivas,Beeville Jones,55.66,72.57,49.9,102.06,224.53,Single-ply,SBD,F
Girls,56.02,11,Zowie Sifuentes,San Antonio East Central,53.07,86.18,36.29,95.25,217.72,Single-ply,SBD,F
Girls,56.02,12,Bailey Breshiers,Gregory-Portland,53.52,68.04,38.56,79.38,185.97,Single-ply,SBD,F
Girls,56.02,DQ,Laney Bustos,Gregory-Portland,54.43,115.67,54.43,,,Single-ply,SBD,F
Girls,56.02,DQ,Emily Allen,Corpus Christi Tuloso-Midway,54.88,120.2,47.63,,,Single-ply,SBD,F
Girls,60.1,1,Julianna Perez,Corpus Christi Tuloso-Midway,58.97,163.29,79.38,147.42,390.09,Single-ply,SBD,F
Girls,60.1,2,Morgan Candela,Corpus Christi Tuloso-Midway,60.06,154.22,65.77,145.15,365.14,Single-ply,SBD,F
Girls,60.1,3,Angelica Beltran,Beeville Jones,60.01,122.47,61.23,147.42,331.12,Single-ply,SBD,F
Girls,60.1,4,Samantha Ware,Gregory-Portland,59.87,127.01,68.04,115.67,310.71,Single-ply,SBD,F
Girls,60.1,5,Adalysa Rosales,San Antonio East Central,59.42,117.93,61.23,113.4,292.57,Single-ply,SBD,F
Girls,60.1,6,Emma Brice,Orange Grove,56.7,120.2,54.43,102.06,276.69,Single-ply,SBD,F
Girls,60.1,7,Bianca Guzman,Corpus Christi Tuloso-Midway,58.06,104.33,40.82,113.4,258.55,Single-ply,SBD,F
Girls,60.1,8,Valerie Ramirez,Rockport-Fulton,56.25,108.86,45.36,102.06,256.28,Single-ply,SBD,F
Girls,60.1,9,Kyla Beard,Corpus Christi London,56.25,95.25,40.82,102.06,238.14,Single-ply,SBD,F
Girls,60.1,10,Chelsey Wood,Port Lavaca Calhoun,57.15,90.72,47.63,95.25,233.6,Single-ply,SBD,F
Girls,60.1,11,Jackie McClendon,Corpus Christi Calallen,56.43,81.65,38.56,102.06,222.26,Single-ply,SBD,F
Girls,60.1,12,Madison Gardner,Corpus Christi Calallen,56.7,47.63,22.68,56.7,127.01,Single-ply,SBD,F
Girls,60.1,DQ,Destiny Villegas,Beeville Jones,60.01,,,,,Single-ply,SBD,F
Girls,60.1,DQ,Camille Yeltatzie,Gregory-Portland,59.42,120.2,56.7,,,Single-ply,SBD,F
Girls,67.36,1,Amidy Moreno,Beeville Jones,66.04,170.1,79.38,161.03,410.5,Single-ply,SBD,F
Girls,67.36,2,Tori Contreras,Beeville Jones,66.77,145.15,68.04,161.03,374.21,Single-ply,SBD,F
Girls,67.36,3,Abbie Etzler,Port Lavaca Calhoun,67.13,133.81,72.57,145.15,351.53,Single-ply,SBD,F
Girls,67.36,4,Ellysabeth Morales,San Antonio East Central,67.13,120.2,58.97,117.93,297.1,Single-ply,SBD,F
Girls,67.36,5,Madeline Dougherty,Skidmore-Tynan,61.23,113.4,56.7,124.74,294.84,Single-ply,SBD,F
Girls,67.36,6,Realynn Flores,Corpus Christi Tuloso-Midway,64.86,122.47,47.63,115.67,285.76,Single-ply,SBD,F
Girls,67.36,7,Adrianna Cruz,Corpus Christi Tuloso-Midway,61.69,102.06,56.7,117.93,276.69,Single-ply,SBD,F
Girls,67.36,8,Riley Zipprian,Gregory-Portland,63.96,95.25,49.9,90.72,235.87,Single-ply,SBD,F
Girls,67.36,9,Ayslian Garcia,Rockport-Fulton,64.41,90.72,43.09,102.06,235.87,Single-ply,SBD,F
Girls,67.36,10,Dolly Hinojosa,Gregory-Portland,62.6,56.7,38.56,92.99,188.24,Single-ply,SBD,F
Girls,67.36,11,Kaci Garcia,Gregory-Portland,65.77,54.43,38.56,79.38,172.37,Single-ply,SBD,F
Girls,67.36,DQ,Annointiyae Beasley,Odem,61.69,,,,,Single-ply,SBD,F
Girls,67.36,DQ,Hannah Garcia,Rockport-Fulton,62.14,113.4,56.7,,,Single-ply,SBD,F
Girls,67.36,DQ,Courtney Lamontagne,Corpus Christi Tuloso-Midway,65.77,156.49,72.57,,,Single-ply,SBD,F
Girls,75.07,1,Desiree Gonzales #1,Beeville Jones,74.75,163.29,95.25,149.69,408.23,Single-ply,SBD,F
Girls,75.07,2,Emily Rodriguez #5,Beeville Jones,72.71,147.42,95.25,149.69,392.36,Single-ply,SBD,F
Girls,75.07,3,Samantha Sullivan,Corpus Christi John Paul II High School,71.21,149.69,63.5,161.03,374.21,Single-ply,SBD,F
Girls,75.07,4,Nee Hso,Port Lavaca Calhoun,72.12,156.49,70.31,140.61,367.41,Single-ply,SBD,F
Girls,75.07,5,Katya Garza-Rodriguez,Port Lavaca Calhoun,69.4,133.81,61.23,129.27,324.32,Single-ply,SBD,F
Girls,75.07,6,Lexie Guzman,Gregory-Portland,70.76,124.74,52.16,136.08,312.98,Single-ply,SBD,F
Girls,75.07,7,Kat Lopez,Gregory-Portland,72.57,124.74,65.77,111.13,301.64,Single-ply,SBD,F
Girls,75.07,8,Madysin Moreno,Odem,72.57,124.74,52.16,122.47,299.37,Single-ply,SBD,F
Girls,75.07,9,Aliyah Hunter,Rockport-Fulton,74.39,88.45,49.9,120.2,258.55,Single-ply,SBD,F
Girls,75.07,10,Shakira Pena,Orange Grove,74.39,83.91,43.09,102.06,229.06,Single-ply,SBD,F
Girls,75.07,11,Celeste Martinez,Corpus Christi John Paul II High School,68.04,61.23,34.02,102.06,197.31,Single-ply,SBD,F
Girls,75.07,DQ,Selina Castillo,Santa Gertrudis Academy,72.12,115.67,56.7,,,Single-ply,SBD,F
Girls,75.07,DQ,Kassidy Lee,Orange Grove,74.39,,,,,Single-ply,SBD,F
Girls,75.07,DQ,Hel Koo,Port Lavaca Calhoun,69.85,,,,,Single-ply,SBD,F
Girls,82.33,1,Zoie Hartman,Corpus Christi Calallen,81.19,140.61,70.31,156.49,367.41,Single-ply,SBD,F
Girls,82.33,2,Jackee Corrigan,Beeville Jones,81.47,151.95,72.57,142.88,367.41,Single-ply,SBD,F
Girls,82.33,3,Makayla Johnson,Santa Gertrudis Academy,81.65,142.88,70.31,145.15,358.34,Single-ply,SBD,F
Girls,82.33,4,Megan Frerich,Odem,78.02,138.35,65.77,138.35,342.46,Single-ply,SBD,F
Girls,82.33,5,Eliza Lopez,Gregory-Portland,77.11,129.27,72.57,120.2,322.05,Single-ply,SBD,F
Girls,82.33,6,Katryn Edwards,Sinton,77.56,124.74,61.23,124.74,310.71,Single-ply,SBD,F
Girls,82.33,7,Charlotte Lanam,Corpus Christi Calallen,80.74,120.2,58.97,129.27,308.44,Single-ply,SBD,F
Girls,82.33,8,Maegan Grapetine,Corpus Christi Calallen,79.38,65.77,49.9,106.59,222.26,Single-ply,SBD,F
Girls,82.33,DQ,Leandra Valadez,Corpus Christi Tuloso-Midway,77.11,,,,,Single-ply,SBD,F
Girls,82.33,DQ,Taylor Ramirez,Sinton,81.65,147.42,65.77,,,Single-ply,SBD,F
Girls,90.04,1,Kennedi Butcher,Port Lavaca Calhoun,84.37,158.76,99.79,158.76,417.3,Single-ply,SBD,F
Girls,90.04,2,Jessica Morales,Odem,87.09,165.56,72.57,136.08,374.21,Single-ply,SBD,F
Girls,90.04,3,May-Gway Tao,San Antonio East Central,86.18,136.08,68.04,122.47,326.59,Single-ply,SBD,F
Girls,90.04,4,Jadyn Garcia,Corpus Christi Tuloso-Midway,88.45,133.81,65.77,127.01,326.59,Single-ply,SBD,F
Girls,90.04,5,Emily Ortiz,Orange Grove,82.55,136.08,61.23,117.93,315.25,Single-ply,SBD,F
Girls,90.04,6,Ashley Rogriguez,Corpus Christi Calallen,84.37,79.38,34.02,77.11,190.51,Single-ply,SBD,F
Girls,90.04,7,Jaelynn Zapata,Corpus Christi Calallen,82.55,77.11,38.56,68.04,183.7,Single-ply,SBD,F
Girls,100.02,1,Kaley Leal,Corpus Christi Tuloso-Midway,96.62,197.31,74.84,172.37,444.52,Single-ply,SBD,F
Girls,100.02,2,Maraya Ruiz,Corpus Christi Calallen,99.34,136.08,61.23,122.47,319.78,Single-ply,SBD,F
Girls,100.02,3,Ashley Dickey,San Antonio East Central,93.89,129.27,56.7,124.74,310.71,Single-ply,SBD,F
Girls,100.02,DQ,Analydia Montes,Corpus Christi Tuloso-Midway,95.25,179.17,,,,Single-ply,SBD,F
Girls,100.02,DQ,Clarissa Vargas,Orange Grove,93.44,,,,,Single-ply,SBD,F
Girls,117.71,1,India Davis,San Antonio East Central,102.97,120.2,68.04,142.88,331.12,Single-ply,SBD,F
Girls,117.71,2,Makaila Goad-Mills,Rockport-Fulton,100.24,142.88,49.9,133.81,326.59,Single-ply,SBD,F
Girls,117.71,3,Annmarie Rodriguez,San Antonio East Central,115.21,129.27,63.5,133.81,326.59,Single-ply,SBD,F
Girls,117.71,DQ,Maribelle Mendieta,Sinton,105.23,142.88,,,,Single-ply,SBD,F
Girls,117.71+,1,Alayna Searcy,Port Lavaca Calhoun,125.19,208.65,106.59,154.22,469.47,Single-ply,SBD,F
Girls,117.71+,2,Analicia Ramirez,Beeville Jones,122.61,183.7,122.47,147.42,453.59,Single-ply,SBD,F
Girls,117.71+,3,Anisa Navarro,Gregory-Portland,147.42,92.99,45.36,113.4,251.74,Single-ply,SBD,F
