﻿contest,contest_date,c_date,location,type,gender,name,province,age_category,bodyWeight,weightclass_new,squat_1,squat_2,squat_3,squat,bench_1,bench_2,bench_3,bench,deadlift_1,deadlift_2,deadlift_3,deadlift,total,gl_points,unequipped,year
Barbell Bash 9,2024-09-28,Sep-28-24,Barbell Rive-Nord,All,F,Jasmine Simard,QC,Junior,73.95,76,90,95,100,100,47.5,52.5,57.5,57.5,107.5,112.5,120,120,277.5,55.43760090757312,yes,2024
Barbell Bash 9,2024-09-28,Sep-28-24,Barbell Rive-Nord,All,F,Cloé St-pierre,QC,Junior,73.95,76,127.5,132.5,135,135,72.5,-75,77.5,77.5,142.5,147.5,152.5,152.5,365,72.91792551806915,yes,2024
Barbell Bash 9,2024-09-28,Sep-28-24,Barbell Rive-Nord,All,F,Stéphanie Pilon,QC,Open,75.45,76,-137.5,145,-155,145,60,67.5,-70,67.5,145,155,-160,155,367.5,72.70486226546879,yes,2024
Barbell Bash 9,2024-09-28,Sep-28-24,Barbell Rive-Nord,All,F,Shanna Maguire,QC,Open,81.9,84,117.5,127.5,135,135,62.5,67.5,70,70,137.5,147.5,160,160,365,69.63212280266133,yes,2024
Barbell Bash 9,2024-09-28,Sep-28-24,Barbell Rive-Nord,All,F,Paraskevi Turac,QC,Junior,80.5,84,-75,-75,-75,0,-35,0,0,0,0,0,0,0,0,0,yes,2024
Barbell Bash 9,2024-09-28,Sep-28-24,Barbell Rive-Nord,All,F,Alexe Madore Deschênes,QC,Open,61.25,63,-112.5,115,120,120,67.5,70,72.5,72.5,137.5,145,-152.5,145,337.5,75.2211461842899,yes,2024
Barbell Bash 9,2024-09-28,Sep-28-24,Barbell Rive-Nord,All,F,Azalea Hughes,QC,Open,73.2,76,135,142.5,150,150,80,82.5,85,85,140,155,170,170,405,81.32127522198569,yes,2024
Barbell Bash 9,2024-09-28,Sep-28-24,Barbell Rive-Nord,All,F,Khushpreet Yuma Nagra-Yasuoka,QC,Sub-Junior,51.7,52,85,92.5,-97.5,92.5,60,65,72.5,72.5,100,107.5,115,115,280,71.05536818686012,yes,2024
Barbell Bash 9,2024-09-28,Sep-28-24,Barbell Rive-Nord,All,F,Sabrina Bessa Lucia,QC,Open,75,76,115,122.5,127.5,127.5,50,-55,55,55,132.5,142.5,147.5,147.5,330,65.47358030973061,yes,2024
Barbell Bash 9,2024-09-28,Sep-28-24,Barbell Rive-Nord,All,M,Danick Lachapelle,QC,Junior,73.3,74,165,-170,-175,165,-92.5,92.5,-95,92.5,185,197.5,212.5,212.5,470,69.34207804121752,yes,2024
Barbell Bash 9,2024-09-28,Sep-28-24,Barbell Rive-Nord,All,M,Hanif Hashim,QC,Junior,90.1,93,-165,172.5,185,185,110,117.5,125,125,195,210,220,220,530,70.42079005868592,yes,2024
Barbell Bash 9,2024-09-28,Sep-28-24,Barbell Rive-Nord,All,M,Étienne Lizotte,QC,Junior,68.6,74,110,117.5,125,125,87.5,92.5,95,95,-162.5,162.5,175,175,395,60.33203175373404,yes,2024
Barbell Bash 9,2024-09-28,Sep-28-24,Barbell Rive-Nord,All,M,Clovis Rioux,QC,Junior,90.85,93,-180,-190,190,190,120,127.5,135,135,190,205,-215,205,530,70.1339832406425,yes,2024
Barbell Bash 9,2024-09-28,Sep-28-24,Barbell Rive-Nord,All,M,Emrick Jean-Paul,QC,Junior,89.7,93,255,265,-275,265,155,165,170,170,270,285,-300,285,720,95.87619689433345,yes,2024
Barbell Bash 9,2024-09-28,Sep-28-24,Barbell Rive-Nord,All,M,Antoino Guarraci,QC,Junior,84.8,93,170,182.5,-190,182.5,102.5,107.5,-115,107.5,200,215,-227.5,215,505,69.1541678226708,yes,2024
Barbell Bash 9,2024-09-28,Sep-28-24,Barbell Rive-Nord,All,M,Nicolas Bélanger,QC,Junior,79.9,83,162.5,177.5,187.5,187.5,152.5,165,-173,165,160,177.5,-187.5,177.5,530,74.79747005431736,yes,2024
Barbell Bash 9,2024-09-28,Sep-28-24,Barbell Rive-Nord,Single,M,Raphael Guay,QC,Junior,88.2,93,0,0,0,0,137.5,145,-150,145,0,0,0,0,145,49.53810684110016,no,2024
Barbell Bash 9,2024-09-28,Sep-28-24,Barbell Rive-Nord,All,M,Bernard Gauthier,QC,Master 2,77.4,83,-122.5,122.5,130,130,87.5,92.5,-95,92.5,165,177.5,190,190,412.5,59.170304895456525,yes,2024
Barbell Bash 9,2024-09-28,Sep-28-24,Barbell Rive-Nord,All,M,Nicolas Licois,QC,Open,91.3,93,-220,-230,230,230,135,142.5,-145,142.5,250,265,-285,265,637.5,84.15476064365839,yes,2024
Barbell Bash 9,2024-09-28,Sep-28-24,Barbell Rive-Nord,All,M,Guillaume Nantel,QC,Master 2,125,120+,185,195,207.5,207.5,135,142.5,147.5,147.5,200,215,225,225,580,66.24606483744353,yes,2024
Barbell Bash 9,2024-09-28,Sep-28-24,Barbell Rive-Nord,All,M,Jean-Denys St-Hilaire,QC,Open,81.25,83,160,170,177.5,177.5,117.5,125,130,130,205,215,-227.5,215,522.5,73.11281471602213,yes,2024
Barbell Bash 9,2024-09-28,Sep-28-24,Barbell Rive-Nord,All,M,Taj Grewal,QC,Sub-Junior,91.95,93,190,195,210,210,125,130,135,135,240,-252.5,260,260,605,79.58723070468919,yes,2024
Barbell Bash 9,2024-09-28,Sep-28-24,Barbell Rive-Nord,All,M,Martial Maillot,QC,Master 2,116.25,120,155,162.5,-167.5,162.5,-100,100,105,105,180,192.5,-200,192.5,460,54.22512439536899,yes,2024
Barbell Bash 9,2024-09-28,Sep-28-24,Barbell Rive-Nord,All,M,Richar Raigoza,QC,Open,72.05,74,185,-195,-200,185,115,-120,-120,115,195,210,-220,210,510,75.92045782426855,yes,2024
Barbell Bash 9,2024-09-28,Sep-28-24,Barbell Rive-Nord,All,M,Ezekiel Gouin,QC,Open,81.1,83,210,222.5,235,235,142.5,152.5,160,160,250,270,285,285,680,95.24097637723636,yes,2024
Barbell Bash 9,2024-09-28,Sep-28-24,Barbell Rive-Nord,All,M,Rami Kesserwan,QC,Junior,123.9,120+,255,270,280,280,180,190,-197.5,190,255,265,275,275,745,85.41398638600052,yes,2024
Barbell Bash 9,2024-09-28,Sep-28-24,Barbell Rive-Nord,All,M,Xavier Rivest,QC,Sub-Junior,64.85,66,105,115,117.5,117.5,65,72.5,80,80,140,155,165,165,362.5,57.03650658923561,yes,2024