Division,Name,Country,BirthYear,BodyweightKg,Squat1Kg,Squat2Kg,Squat3Kg,Best3SquatKg,Bench1Kg,Bench2Kg,Bench3Kg,Best3BenchKg,Deadlift1Kg,Deadlift2Kg,Deadlift3Kg,Best3DeadliftKg,TotalKg,WeightClassKg,Sex,Equipment,Event,Place,BirthDate
Sub-Juniors,Claris Castillejo Campos,Colombia,2008,42.25,90,100,-105,100,35,40,-42.5,40,110,-120,-120,110,250,43,F,Raw,SBD,1,
Sub-Juniors,Isabella Bolivar Gallardo,Colombia,2007,42.65,-80,80,-92.5,80,43,-48,-48,43,-90,90,-100,90,213,43,F,Raw,SBD,2,
Open,Madelein Canto,Argentina,1989,46.95,115,-122.5,122.5,122.5,67.5,70.5,-72,70.5,140,147.5,-150.5,147.5,340.5,47,F,Raw,SBD,1,
Open,Juliana Bhering,Brazil,1998,46.25,-110,110,115,115,60,65,-67.5,65,142.5,-150.5,-150.5,142.5,322.5,47,F,Raw,SBD,2,
Juniors,Karoll Contrera Fernandez,Colombia,2002,46.85,120,125,127.5,127.5,57.5,60,62.5,62.5,135,145,-148,145,335,47,F,Raw,SBD,1,
Juniors,Melany Guachin Alvarado,Ecuador,2002,46.1,112.5,117.5,122.5,122.5,55,60,-62.5,60,127.5,135,-140,135,317.5,47,F,Raw,SBD,2,
Juniors,Karen Olguin,Argentina,2001,47,92.5,97.5,100,100,62.5,67.5,-70.5,67.5,105,110,-115,110,277.5,47,F,Raw,SBD,3,
Masters 1,Erica Duque,Brazil,1984,46.75,92.5,97.5,-103,97.5,50,-55.5,-55.5,50,100,110,-112.5,110,257.5,47,F,Raw,SBD,1,
Sub-Juniors,Yushara Ayala Triana,Peru,2006,44.85,75,82.5,87.5,87.5,-50.5,-50.5,-50.5,,100,110,-120.5,110,,47,F,Raw,SBD,DQ,
Open,Carmen Bueno,Ecuador,1985,52,130,137.5,-142.5,137.5,85,90,92.5,92.5,155,162.5,165,165,395,52,F,Raw,SBD,1,
Open,Carmen Fernandez,Peru,1976,51.6,140,-145,145,145,67.5,70,-72.5,70,167.5,175.5,-180,175.5,390.5,52,F,Raw,SBD,2,
Open,Keissy Garcia Candanoza,Colombia,1985,49.1,145,-147.5,-150,145,65,-70,-70,65,-150,-160,160,160,370,52,F,Raw,SBD,3,
Open,Julieta Sánchez,Argentina,1996,51.85,95,100,102.5,102.5,-57.5,57.5,60,60,117.5,125,-132.5,125,287.5,52,F,Raw,SBD,4,
Open,Lizbeth Martinez Gomez,Bolivia,1991,49.8,-125,-127.5,-127.5,,50,55,57.5,57.5,130,135,140,140,,52,F,Raw,SBD,DQ,
Sub-Juniors,Magali Lemos,Argentina,2006,50.95,95,100,102.5,102.5,50,55.5,-60,55.5,115,122.5,-130,122.5,280.5,52,F,Raw,SBD,1,
Sub-Juniors,Daiany Medina Armoa,Bolivia,2006,51.15,90,-92.5,100,100,40,-45,-50,40,110,-115,115,115,255,52,F,Raw,SBD,2,
Sub-Juniors,Vanessa Guerra Mia,Peru,2006,51.7,75,-85,-85,75,37.5,42.5,45,45,95,107.5,117.5,117.5,237.5,52,F,Raw,SBD,3,
Juniors,Lady Romero,Peru,2001,51.85,125,130,133,133,70,75,-77.5,75,147.5,153.5,160.5,160.5,368.5,52,F,Raw,SBD,1,
Juniors,Claribel Rivero,Argentina,2003,51.6,115,120,-127.5,120,-57.5,-57.5,57.5,57.5,142.5,147.5,152.5,152.5,330,52,F,Raw,SBD,2,
Juniors,Cristel Pilalo Calle,Ecuador,2005,50.55,110,117.5,122.5,122.5,-60,60,-67.5,60,135,140,142.5,142.5,325,52,F,Raw,SBD,3,
Juniors,Keily Rojas,Chile,2003,51.25,110,-117.5,-117.5,110,60,-65,-65,60,132.5,145,-154,145,315,52,F,Raw,SBD,4,
Juniors,Karen Ramirez Torres,Ecuador,2003,51.4,115,122.5,127.5,127.5,65,-70,70,70,115,-117.5,-117.5,115,312.5,52,F,Raw,SBD,5,
Juniors,Agustina Collao,Chile,2001,51.6,95,100,-105,100,-55,-55,55,55,117.5,125,-130,125,280,52,F,Raw,SBD,6,
Masters 1,Renata Inamassu,Brazil,1978,50.75,110,117.5,120,120,65,70,-77.5,70,125,135,-145,135,325,52,F,Raw,SBD,1,
Masters 1,Marybel Luciano,Peru,1978,50.45,-110,-110,110,110,52.5,-57.5,-57.5,52.5,125,-132.5,-132.5,125,287.5,52,F,Raw,SBD,2,
Masters 2,Mariela Navarrete,Peru,1972,51.25,70,-77.5,-85,70,42.5,45,-47.5,45,120,130,-132.5,130,245,52,F,Raw,SBD,1,
Open,Kenia Monserrate,Ecuador,1991,56.65,145,152.5,160,160,85,90,95,95,152.5,160,167.5,167.5,422.5,57,F,Raw,SBD,1,
Open,Rocio Chilon,Peru,1996,56.4,140,150,-157.5,150,55,60,-65,60,160,167.5,170,170,380,57,F,Raw,SBD,2,
Open,Mariana Coelho Silva,Brazil,1995,56.7,-140,140,150,150,67.5,70,72.5,72.5,145,-150,-150,145,367.5,57,F,Raw,SBD,3,
Open,Guadalupe Cabral,Argentina,1997,56.15,117.5,122.5,-127.5,122.5,77.5,-82.5,-82.5,77.5,150,155,157.5,157.5,357.5,57,F,Raw,SBD,4,
Open,Luisa Simei Dos Santos,Brazil,1998,56.3,-122.5,-125,-125,,72.5,-75,75,75,132.5,137.5,-145,137.5,,57,F,Raw,SBD,DQ,
Sub-Juniors,Nahomy Coloma Galarza,Ecuador,2007,55.3,120,-127.5,-127.5,120,47.5,-50,-50,47.5,150,-155,-155,150,317.5,57,F,Raw,SBD,1,
Sub-Juniors,Lorena Bertoldi,Brazil,2006,56.55,117.5,-123,-123,117.5,50,55,57.5,57.5,127.5,132.5,135,135,310,57,F,Raw,SBD,2,
Sub-Juniors,Isabella Salazar Campis,Colombia,2007,56.45,-112.5,112.5,-122.5,112.5,50,55,-57.5,55,125,137.5,-150.5,137.5,305,57,F,Raw,SBD,3,
Sub-Juniors,Ainhoa Lino Zenteno,Bolivia,2007,55.95,105,-112.5,-112.5,105,40,45,50,50,125,132.5,135,135,290,57,F,Raw,SBD,4,
Sub-Juniors,Jazmín Luna,Argentina,2006,57,-105,105,112.5,112.5,50,52.5,55,55,-112.5,112.5,-122.5,112.5,280,57,F,Raw,SBD,5,
Sub-Juniors,Maria Hurtado Bravo,Bolivia,2006,56.75,-105,-110,-110,,55,-60,60,60,100,-110,-110,100,,57,F,Raw,SBD,DQ,
Juniors,Nauru Barraza,Chile,2004,56.3,-135,135,-147.5,135,-70,70,75,75,150,160,165,165,375,57,F,Raw,SBD,1,
Juniors,Juanita Alfonso,Argentina,2004,54.05,135,140,145,145,50,57.5,62.5,62.5,145,152.5,160,160,367.5,57,F,Raw,SBD,2,
Juniors,Paulina Rivera,Chile,2002,57,125,-132.5,-132.5,125,67.5,-70,70,70,160,167.5,-173,167.5,362.5,57,F,Raw,SBD,3,
Juniors,Erika Lopez Carmona,Colombia,2003,56.85,-140,140,-147.5,140,60,-65,-65,60,145,-152.5,-152.5,145,345,57,F,Raw,SBD,4,
Juniors,Samantha Bravo Acaro,Ecuador,2001,54.9,115,120,-125,120,60,65,-70,65,130,137.5,142.5,142.5,327.5,57,F,Raw,SBD,5,
Masters 1,Lucia Sierra Pinzon,Colombia,1976,56.3,120,-127.5,127.5,127.5,60,-65,-65,60,140,150,-152.5,150,337.5,57,F,Raw,SBD,1,
Masters 1,Norma Melo Guzman,Peru,1977,56.3,100,-110,110,110,57.5,62.5,-65,62.5,125,135,-145,135,307.5,57,F,Raw,SBD,2,
Masters 1,Mariela Di Nápoli,Argentina,1978,54.3,100,105,-110,105,57.5,-60,-60,57.5,-117.5,117.5,122.5,122.5,285,57,F,Raw,SBD,3,
Open,Yassmin Arias Navarrete,Chile,1993,61.25,165,175,183.5,183.5,85,90,92.5,92.5,160,170,-175,170,446,63,F,Raw,SBD,1,
Open,Mikaela Ferreira,Uruguay,1991,62.45,132.5,137.5,142.5,142.5,70,-75,-77.5,70,185,193,203,203,415.5,63,F,Raw,SBD,2,
Open,Irina Leonor Davila Zapata,Colombia,1994,62,150,160,-167.5,160,-80,82.5,87.5,87.5,160,165,167.5,167.5,415,63,F,Raw,SBD,3,
Open,Daniela Anton,Peru,2000,62.05,140,147.5,152.5,152.5,75,-80,-80,75,140,152.5,160,160,387.5,63,F,Raw,SBD,4,
Open,Nazarena Diaz,Argentina,2000,59.25,135,-142.5,-142.5,135,67.5,72.5,-75,72.5,155,165,-172.5,165,372.5,63,F,Raw,SBD,5,
Open,Refugio Sarai Rodriguez Callapa,Bolivia,1993,62.3,-140,-140,140,140,75,80,-82.5,80,140,142.5,-150,142.5,362.5,63,F,Raw,SBD,6,
Sub-Juniors,Francisca Nunez,Chile,2006,60.35,125,130,132.5,132.5,65,67.5,-70,67.5,155,165,168.5,168.5,368.5,63,F,Raw,SBD,1,
Sub-Juniors,Arlet Prada Angelina,Peru,2006,62.75,132.5,-140,140,140,62.5,65,-70,65,152.5,160,162.5,162.5,367.5,63,F,Raw,SBD,2,
Sub-Juniors,Maylin Bermejo Cuevas,Colombia,2006,60.25,125,132.5,137.5,137.5,55,57.5,60,60,147.5,155.5,-168,155.5,353,63,F,Raw,SBD,3,
Juniors,Ana Campo Sanchez,Colombia,2001,61.5,145,152.5,160,160,75,-80,80,80,160,-171.5,-171.5,160,400,63,F,Raw,SBD,1,
Juniors,Daniela Sierra,Chile,2001,61.75,127.5,135,-140,135,65,70,72.5,72.5,152.5,-160,165,165,372.5,63,F,Raw,SBD,2,
Juniors,Jenifer Gonzalez,Ecuador,2001,60.3,137.5,145,150,150,55,62.5,67.5,67.5,140,150,152.5,152.5,370,63,F,Raw,SBD,3,
Juniors,Fabyana Ribeiro,Brazil,2001,61.75,120,125,-130,125,55,60,-65,60,125,-135,135,135,320,63,F,Raw,SBD,4,
Juniors,Guadalupe Charchir,Argentina,2001,62.6,-130,-130,130,130,55,-60,-60,55,130,-132.5,-137.5,130,315,63,F,Raw,SBD,5,
Juniors,Paulina Gauthier,Uruguay,2002,62.95,105,112.5,,112.5,55,57.5,-60,57.5,120,130,-140,130,300,63,F,Raw,SBD,6,
Juniors,Valeria Amaya Amira,Peru,2004,58.4,-105,105,112.5,112.5,55,57.5,60,60,125,-135,,125,297.5,63,F,Raw,SBD,7,
Juniors,Nayely Yucra,Peru,2003,62.7,125,-130,-135,125,40,45,-50,45,-122.5,-122.5,122.5,122.5,292.5,63,F,Raw,SBD,8,
Juniors,Giuliana Relling,Argentina,2002,59.4,-130,-130,-135,,-70,-70,-70,,160,-170,175,175,,63,F,Raw,SBD,DQ,
Masters 1,Gisele Barbosa Lourenco,Brazil,1982,61.4,117.5,122.5,125,125,65,67.5,-70,67.5,160,165,172.5,172.5,365,63,F,Raw,SBD,1,
Masters 1,Melina Grittini,Argentina,1978,61.85,117.5,122.5,127.5,127.5,-70,70,72.5,72.5,127.5,135,-145,135,335,63,F,Raw,SBD,2,
Masters 1,Antonela Lamenza,Argentina,1984,62.55,-117.5,122.5,125,125,52.5,-57.5,-57.5,52.5,125,130,-135,130,307.5,63,F,Raw,SBD,3,
Masters 2,Ada Chuyo,Peru,1971,61.75,130,135,140,140,60,65,-70,65,120,125,127.5,127.5,332.5,63,F,Raw,SBD,1,
Masters 2,Ferminia Seas Marin,Bolivia,1971,62.3,-110,-110,-110,,45,50,-55,50,170,175,-180,175,,63,F,Raw,SBD,DQ,
Open,Bruna Bisol,Brazil,1997,68.5,177.5,-187.5,-187.5,177.5,97.5,102.5,-105,102.5,200,-210,-210,200,480,69,F,Raw,SBD,1,
Open,Jeniffer Lazo,Peru,1997,67,150,-157.5,157.5,157.5,62.5,67.5,-70,67.5,170,177.5,-180,177.5,402.5,69,F,Raw,SBD,2,
Open,Hilda Ordenes,Chile,1993,67.3,115,127.5,140,140,70,77.5,82.5,82.5,150,162.5,-175,162.5,385,69,F,Raw,SBD,3,
Open,Antonella Garri,Argentina,1999,68.5,130,140,-145,140,70,-75,-75,70,155,165,-172.5,165,375,69,F,Raw,SBD,4,
Open,Karina Cuello,Uruguay,1993,67.6,102.5,107.5,110,110,52.5,-55,57.5,57.5,110,117.5,122.5,122.5,290,69,F,Raw,SBD,5,
Sub-Juniors,Martina Rivas,Uruguay,2007,67.9,150,160,-163,160,65,70,72.5,72.5,135,145,152.5,152.5,385,69,F,Raw,SBD,1,
Sub-Juniors,Leysi Rodriguez,Peru,2006,68.75,132.5,137.5,-142.5,137.5,67.5,-72.5,-72.5,67.5,145,155,155.5,155.5,360.5,69,F,Raw,SBD,2,
Sub-Juniors,Ema Gallardo,Chile,2007,66.8,112.5,117.5,120,120,77.5,84,-87,84,155,-167,-167,155,359,69,F,Raw,SBD,3,
Sub-Juniors,Martina Vivares,Argentina,2007,70.7,-130,-130,130,130,60,67.5,70,70,160,170,-180,170,370,76,F,Raw,SBD,1,
Juniors,Antonia Madrid,Chile,2001,68.95,145,152.5,160,160,82.5,87.5,-90.5,87.5,170,180,-190,180,427.5,69,F,Raw,SBD,1,
Juniors,Sarah Sanmoogan,Guyana,2002,67.45,145,150,-157.5,150,82.5,-90,-90,82.5,150,-157.5,160,160,392.5,69,F,Raw,SBD,3,
Juniors,Luana Delgado,Uruguay,2003,68.1,155,162.5,-167.5,162.5,67.5,70,,70,150,160,-167.5,160,392.5,69,F,Raw,SBD,4,
Juniors,Sophia Cabrera #2,Peru,2004,67.35,135,145,-150,145,85,-90,-90,85,155,162.5,-167.5,162.5,392.5,69,F,Raw,SBD,2,
Juniors,Kira Yashnyk,Argentina,2004,68.15,127.5,-135,-135,127.5,67.5,72.5,-75,72.5,130,137.5,140,140,340,69,F,Raw,SBD,5,
Juniors,Lucien Flores,Bolivia,2001,63.9,-115,-115,-120,,50,-55,-55,50,135,145,-152.5,145,,69,F,Raw,SBD,DQ,
Juniors,Adela Aparicio,Bolivia,2002,64.6,-150,-160,-160,,50,60,-70,60,155,-165,-172.5,155,,69,F,Raw,SBD,DQ,
Masters 1,Marcia Marins,Brazil,1981,68,125,-132.5,-132.5,125,62.5,67.5,70,70,127.5,135,145,145,340,69,F,Raw,SBD,1,
Masters 1,Paola Vallejos,Argentina,1982,68.2,-105,-105,105,105,55,60,62.5,62.5,127.5,135,-145,135,302.5,69,F,Raw,SBD,2,
Masters 2,Adriane Schwab,Brazil,1970,66.9,90,97.5,-105,97.5,47.5,52.5,55,55,120,132.5,-150.5,132.5,285,69,F,Raw,SBD,1,
Masters 2,Mirta Celes,Argentina,1969,67.25,100,-107.5,107.5,107.5,45,47.5,-50,47.5,115,-122.5,-125,115,270,69,F,Raw,SBD,2,
Open,Maiara Suellen Cabral Da Silva,Brazil,1987,75.15,165,175,182.5,182.5,72.5,77.5,80,80,180,195,-200,195,457.5,76,F,Raw,SBD,1,
Open,Sofia Gonzalez,Uruguay,1995,73.95,155,165,-170,165,77.5,-82.5,-82.5,77.5,165,175,180,180,422.5,76,F,Raw,SBD,2,
Open,Juliana Pena Alvarez,Colombia,1998,75.2,160,-165,-165,160,77.5,82.5,-85,82.5,150,-157.5,-157.5,150,392.5,76,F,Raw,SBD,3,
Open,Paulina Contreras,Chile,1990,71.6,130,-137.5,-137.5,130,72.5,-77.5,-77.5,72.5,155,160,162.5,162.5,365,76,F,Raw,SBD,4,
Open,Natalia Horno Nilda,Argentina,1985,73.65,-130,130,-132.5,130,80,-85,-85,80,-135,-135,135,135,345,76,F,Raw,SBD,5,
Sub-Juniors,Claudia Lopez,Peru,2007,73.6,130,-135,135,135,60,-65,65,65,157.5,-165,-165,157.5,357.5,76,F,Raw,SBD,2,
Sub-Juniors,Mayte Acosta,Uruguay,2006,73.35,-120,120,125,125,62.5,-67.5,-67.5,62.5,122.5,132.5,-140,132.5,320,76,F,Raw,SBD,3,
Sub-Juniors,Melissa Gomes Moreira,Brazil,2010,75.25,110,115,-120,115,45,47.5,-50,47.5,110,117.5,-122.5,117.5,280,76,F,Raw,SBD,4,
Juniors,Lurdes Ferreira,Argentina,2003,75.7,155,163,-173,163,77.5,82.5,-85,82.5,170,182.5,-190,182.5,428,76,F,Raw,SBD,1,
Juniors,Jireh Bejares Cely,Peru,2005,73.85,130,135,140,140,77.5,90,-92.5,90,145,155,-162.5,155,385,76,F,Raw,SBD,2,
Juniors,Gabriella Sato,Brazil,2003,72.6,107.5,112.5,-117.5,112.5,60,-65,-65,60,152.5,162.5,-170,162.5,335,76,F,Raw,SBD,3,
Juniors,Renata Calabi,Chile,2001,74.9,115,122.5,127.5,127.5,47.5,-52.5,55,55,150,-160,-162.5,150,332.5,76,F,Raw,SBD,4,
Masters 1,Veronica Caorsi,Uruguay,1975,73.9,117.5,125,-130,125,65,-70,70,70,135,142.5,-150,142.5,337.5,76,F,Raw,SBD,1,
Masters 1,Lorena Mansiila,Argentina,1979,75.15,100,110,-120,110,45,55,57.5,57.5,100,110,115,115,282.5,76,F,Raw,SBD,2,
Masters 2,Maria Elena Del Pilar Zarate,Peru,1970,75.35,130,135,140,140,70,72.5,75,75,160,-170,-170,160,375,76,F,Raw,SBD,1,
Masters 2,Miralva Miranda,Brazil,1968,71,82.5,87.5,92.5,92.5,40,45,-47.5,45,105,115,120,120,257.5,76,F,Raw,SBD,2,
Masters 2,Maria Orozco Troya Ledys,Colombia,1971,69.05,-65,-70,70,70,35,37.5,40,40,80,-90,90,90,200,76,F,Raw,SBD,3,
Masters 3,Maria Jose Civetta,Argentina,1964,73.3,40,45,50,50,45,50,-52.5,50,70,80,90,90,190,76,F,Raw,SBD,1,
Masters 4,Graciela Wamba,Argentina,1953,74.75,50,-55,55,55,40,45,-47.5,45,100,105,-110,105,205,76,F,Raw,SBD,1,
Open,Lisset Gonzales,Peru,1991,82.65,180,185,-190,185,70,75,80,80,175,182.5,190,190,455,84,F,Raw,SBD,1,
Open,Salome Armas,Ecuador,1998,79.25,135,142.5,147.5,147.5,97.5,-102.5,-102.5,97.5,147.5,157.5,170,170,415,84,F,Raw,SBD,2,
Open,Myriam Camarena,Peru,1985,83,160,-170,-170,160,92.5,-100,-100,92.5,162.5,-182.5,-205,162.5,415,84,F,Raw,SBD,3,
Sub-Juniors,Guadalupe Martinez,Argentina,2009,80.7,100,-115,-130,100,40,47.5,-52.5,47.5,90,100,115,115,262.5,84,F,Raw,SBD,1,
Juniors,Ailen Mendoza,Argentina,2003,82.15,155,165,172.5,172.5,77.7,82,86,86,160,172.5,185.5,185.5,444,84,F,Raw,SBD,1,
Juniors,Nicole Eillen Rivera Navarrete,Ecuador,2002,83.45,150,157.5,165,165,52.5,60,-67.5,60,155,165,170,170,395,84,F,Raw,SBD,2,
Juniors,Andrea Fabregas,Chile,2002,83.95,135,142.5,-147.5,142.5,75,80.5,-83.5,80.5,147.5,157.5,-167.5,157.5,380.5,84,F,Raw,SBD,3,
Masters 1,Karla Cafiero,Peru,1984,82.3,147.5,152.5,155,155,62.5,-67.5,-67.5,62.5,170,-177.5,-177.5,170,387.5,84,F,Raw,SBD,1,
Masters 1,Virginia Cuitino,Uruguay,1980,81.65,-120,125,140,140,65,-70,75,75,120,140,-150,140,355,84,F,Raw,SBD,2,
Masters 2,Verónica Arregues,Argentina,1973,82.5,120,130,135,135,52.5,57.5,60,60,150,157.5,165,165,360,84,F,Raw,SBD,1,
Masters 2,Silvia Zevallos,Peru,1969,81.1,-90,95,-102.5,95,55,60,-62.5,60,-150.5,160,-165.5,160,315,84,F,Raw,SBD,2,
Open,Bianca Soares Gedeao,Brazil,1982,94.7,185,-197.5,-215.5,185,105,110.5,-113,110.5,210,230.5,235,235,530.5,84+,F,Raw,SBD,1,
Open,Carmen Collazo,Uruguay,1984,108.3,170,180,187.5,187.5,105,-111,111,111,167.5,-175,175,175,473.5,84+,F,Raw,SBD,2,
Open,Laura Torres,Argentina,1995,121.5,155,165,-175,165,100,-107.5,107.5,107.5,160,170,-177.5,170,442.5,84+,F,Raw,SBD,3,
Open,Ludmila Koch,Argentina,1988,143.7,155,165,-175,165,60,70,-80,70,170,190,202.5,202.5,437.5,84+,F,Raw,SBD,4,
Open,Sorena Gonzalez Gil,Chile,1983,99.3,140,150,-155,150,-90,95,-97.5,95,170,180,-190,180,425,84+,F,Raw,SBD,5,
Open,Andrea Montecinos,Chile,1996,96.7,140,150,-160,150,70,77.5,82.5,82.5,162.5,172.5,-180,172.5,405,84+,F,Raw,SBD,6,
Sub-Juniors,Gabriela Martinez,Argentina,2010,89.4,90,100,-130,100,35,42.5,45,45,100,110,-120,110,255,84+,F,Raw,SBD,1,
Juniors,Lourdes Poblete,Argentina,2002,90.55,165,182.5,187.5,187.5,77.5,90,95,95,155,172.5,182.5,182.5,465,84+,F,Raw,SBD,1,
Juniors,Maite Laca,Peru,2005,110.25,165,-172.5,-172.5,165,62.5,67.5,70,70,165,177.5,-180.5,177.5,412.5,84+,F,Raw,SBD,2,
Juniors,Iveth Sanchez Vergara,Ecuador,2003,89.65,160,172.5,-180,172.5,75,80,-82.5,80,-160,-160,-160,,,84+,F,Raw,SBD,DQ,
Sub-Juniors,Arturo Cespedes Cabrera,Bolivia,2007,52.5,-130,130,-132.5,130,70,-76,,70,165,167.5,170,170,370,53,M,Raw,SBD,1,
Sub-Juniors,Isaac Espinoza,Ecuador,2010,47.5,-110,110,-117.5,110,62.5,67.5,-70,67.5,117.5,-127.5,,117.5,295,53,M,Raw,SBD,2,
Open,Adriel Cardozo,Argentina,1998,58.5,145,160,170,170,107.5,-115,-115,107.5,180,200,212.5,212.5,490,59,M,Raw,SBD,1,
Juniors,Jair Kartataroeno,Suriname,2002,58.25,165,175,-180,175,97.5,102.5,-105,102.5,180,-195,-195,180,457.5,59,M,Raw,SBD,1,
Juniors,Hernan Tejada,Peru,2004,56.45,137.5,150,-167.5,150,70,75,80,80,172.5,-182.5,-182.5,172.5,402.5,59,M,Raw,SBD,2,
Sub-Juniors,Carlos Garcia Herrera,Colombia,2008,57.25,150,162.5,-165,162.5,-105,105,108,108,-200,-203,203,203,473.5,59,M,Raw,SBD,1,
Sub-Juniors,Juan Bernaldez,Argentina,2007,59,160,171,173,173,-100,100,-105,100,-195,195,-206,195,468,59,M,Raw,SBD,2,
Sub-Juniors,Joao Victor Nunes Gava,Brazil,2006,57.15,157.5,-170.5,172.5,172.5,65,-70,70,70,177.5,185,-203,185,427.5,59,M,Raw,SBD,3,
Open,Luis Ferrari,Peru,1994,65.6,210,222.5,225,225,130,-137.5,-137.5,130,260,272,-280,272,627,66,M,Raw,SBD,1,
Open,Franklin León,Ecuador,1983,62.35,210,222.5,232.5,232.5,130,137.5,-142.5,137.5,220,230,237.5,237.5,607.5,66,M,Raw,SBD,2,
Open,Diego Duran Araya,Chile,1995,65.8,180,200,,200,115,125,-132.5,125,235,255,260,260,585,66,M,Raw,SBD,3,
Open,Kevin Vila,Ecuador,1995,65.1,210,222.5,232.5,232.5,115,-122.5,-122.5,115,235,-242.5,-242.5,235,582.5,66,M,Raw,SBD,4,
Open,Luis Arturo Huata Flores,Bolivia,1988,65.9,200,-210,-210,200,80,85,90,90,200,-210,-220,200,490,66,M,Raw,SBD,5,
Open,Gustavo Firmino del Rio,Brazil,1998,65.1,-220,220,-233,220,-125,-125,-125,,225,-240,-245,225,,66,M,Raw,SBD,DQ,
Sub-Juniors,Emmanuel Techera,Uruguay,2007,64,187.5,200,208.5,208.5,112.5,120,126,126,212.5,227.5,242,242,576.5,66,M,Raw,SBD,1,
Sub-Juniors,Diego Cedeno Perez,Ecuador,2007,64.15,195,208,213,213,118,125.5,127.5,127.5,212.5,225,236,236,576.5,66,M,Raw,SBD,2,
Sub-Juniors,Juan Silva Quintero,Colombia,2007,65.4,152.5,-165,165,165,92.5,97.5,-102.5,97.5,200,-210,210,210,472.5,66,M,Raw,SBD,3,
Sub-Juniors,Victor Fernandez,Bolivia,2009,64.7,135,145,155,155,60,72.5,-75,72.5,180,195,205,205,432.5,66,M,Raw,SBD,4,
Sub-Juniors,James Silva,Peru,2006,65,135,142.5,-147.5,142.5,90,-92.5,95,95,-182.5,-190,190,190,427.5,66,M,Raw,SBD,5,
Sub-Juniors,Josue Espinoza Javier,Bolivia,2008,65.2,-150,-150,150,150,80,-90,-90,80,190,-195,-195,190,420,66,M,Raw,SBD,6,
Sub-Juniors,Andrew Zavala,Chile,2006,65.1,-182.5,-182.5,182.5,182.5,95,-100,-100,95,-225,-227.5,-227.5,,,66,M,Raw,SBD,DQ,
Juniors,Anthony Azcoitia,Uruguay,2005,65.75,190,-205,205,205,-127.5,130,-135,130,-240,240,-247.5,240,575,66,M,Raw,SBD,1,
Juniors,Tomas Arce,Argentina,2002,65.5,200,-210,210,210,-117.5,117.5,-120,117.5,240,-247.5,-247.5,240,567.5,66,M,Raw,SBD,2,
Juniors,Jeyko Menendez Garcia,Ecuador,2003,64.25,170,182.5,-190,182.5,107.5,-112.5,-112.5,107.5,245,-256,-256,245,535,66,M,Raw,SBD,3,
Juniors,Maximiliano Chamorro,Chile,2004,64.65,190,-195,-195,190,100,-105,107.5,107.5,235,-256,-262.5,235,532.5,66,M,Raw,SBD,4,
Juniors,Valentin Lopez,Argentina,2005,65.85,190,205,210,210,110,-120,120,120,185,202.5,-210,202.5,532.5,66,M,Raw,SBD,5,
Juniors,Ricardo Rodriguez Garcia,Colombia,2004,65.9,-190,-190,190,190,115,-117.5,120,120,210,220,-227.5,220,530,66,M,Raw,SBD,6,
Masters 1,Cristiano Kalata,Brazil,1981,65.5,170,-180,180,180,100,107.5,-112.5,107.5,200,207.5,210,210,497.5,66,M,Raw,SBD,1,
Masters 1,Gonzalo Nuñez,Peru,1976,65.4,-127.5,127.5,-130,127.5,112.5,115,-117.5,115,200,-205,-205,200,442.5,66,M,Raw,SBD,2,
Masters 1,Bruno Soffiato,Argentina,1978,63.95,135,-150,150,150,102.5,-112.5,-112.5,102.5,100,120,140,140,392.5,66,M,Raw,SBD,3,
Masters 2,Agnaldo Levi,Brazil,1970,65.4,-130,-130,-140,,90,92.5,-120,92.5,190,-192.5,-215,190,,66,M,Raw,SBD,DQ,
Open,Mark Tawjoeram,Suriname,1992,73.6,-212.5,-212.5,-212.5,,127.5,-132.5,135,135,210,220,240,240,,74,M,Raw,SBD,DQ,
Open,Roberto Junior Thomas,Peru,1988,73.8,225,232.5,237.5,237.5,137.5,140,-142.5,140,250,257.5,265,265,642.5,74,M,Raw,SBD,1,
Open,Cesar Lago,Ecuador,1992,73,225,232.5,-240,232.5,130,137.5,140,140,-250,250,-262.5,250,622.5,74,M,Raw,SBD,2,
Open,Gabriel Vergara,Chile,1994,73.7,220,230,-235,230,127.5,132.5,-135,132.5,-230,230,260,260,622.5,74,M,Raw,SBD,3,
Open,Alex Yovera,Peru,1995,73.7,-215,220,-230,220,165,-176,-176,165,230,-242.5,-245,230,615,74,M,Raw,SBD,4,
Open,Oscar Briceno Diaz,Colombia,1994,72.75,215,222.5,-225,222.5,120,-122.5,,120,250,-257.5,-257.5,250,592.5,74,M,Raw,SBD,5,
Open,Nahuel Manzelli,Argentina,1990,72.9,232.5,-242.5,-242.5,232.5,135,-137.5,-137.5,135,210,220,-230,220,587.5,74,M,Raw,SBD,6,
Open,Franco Olguin,Argentina,1999,73.3,-220,220,230,230,115,-125,-125,115,220,230,-245,230,575,74,M,Raw,SBD,7,
Open,Ronald Rivero,Bolivia,1994,,240,-250,-250,240,-140,140,-150,140,240,250,-260,250,,74,M,Raw,SBD,DQ,
Open,Alex Ochoa #1,Ecuador,1990,,220,230,240,240,130,140,147.5,147.5,230,247.5,260,260,,74,M,Raw,SBD,DQ,
Sub-Juniors,Kenji Reyke,Suriname,2006,74,175,-182.5,-182.5,175,105,-112.5,,105,-215,-220,-220,,,74,M,Raw,SBD,DQ,
Sub-Juniors,Fernando Watanabe,Brazil,2006,73.05,197.5,207.5,-212.5,207.5,131,135,-140.5,135,-215,220,232.5,232.5,575,74,M,Raw,SBD,1,
Sub-Juniors,Jeremy Mala Villero,Ecuador,2006,72.45,190,200,205,205,140,-147.5,-147.5,140,210,220,227.5,227.5,572.5,74,M,Raw,SBD,2,
Sub-Juniors,Matías Sánchez,Chile,2006,70.9,197.5,-207.5,207.5,207.5,92.5,97.5,-102.5,97.5,225,237.5,-245,237.5,542.5,74,M,Raw,SBD,3,
Sub-Juniors,Nicolas Barahona,Chile,2006,71.3,205,-215,-215,205,112.5,117.5,-120,117.5,220,-235,-242.5,220,542.5,74,M,Raw,SBD,4,
Sub-Juniors,Nurvis Morales Castro,Ecuador,2006,,120,132.5,-142.5,132.5,65,72.5,77.5,77.5,-150,160,-170,160,,74,M,Raw,SBD,DQ,
Juniors,Joaquin Sarasua,Uruguay,2003,73.45,225,240.5,242,242,142.5,152.5,161,161,230,245,-252.5,245,648,74,M,Raw,SBD,1,
Juniors,Benjamin Tobar,Chile,2005,73.75,210,225,230,230,120,125,-127.5,125,240,255,262.5,262.5,617.5,74,M,Raw,SBD,2,
Juniors,Alejandro Leon,Peru,2002,72.2,207.5,-215,-215,207.5,132.5,140,-142.5,140,255,-262.5,-262.5,255,602.5,74,M,Raw,SBD,3,
Juniors,Jordy Rodriguez Realpe,Ecuador,2001,72.7,215,230,241,241,127.5,135,-140,135,205,225,-240,225,601,74,M,Raw,SBD,4,
Juniors,Jhairo Cuellar Gonzales,Bolivia,2005,73.5,200,-210,210,210,130,135,-140,135,220,222.5,-240,222.5,567.5,74,M,Raw,SBD,5,
Masters 1,Luis Virgini,Argentina,1981,73.15,185,192.5,-197.5,192.5,110,115,120,120,190,200,210,210,522.5,74,M,Raw,SBD,1,
Masters 1,Alejandro Campos,Bolivia,1980,73.3,165,175,-180,175,110,112.5,117.5,117.5,190,200,-202.5,200,492.5,74,M,Raw,SBD,2,
Masters 1,Ruben Serfaty,Argentina,1975,72.6,140,160,-170,160,100,107.5,-112.5,107.5,180,190,200,200,467.5,74,M,Raw,SBD,3,
Masters 1,Juan Sanchez #15,Peru,1982,72.9,162.5,-172.5,-172.5,162.5,100,-107.5,-107.5,100,160,-162.5,180,180,442.5,74,M,Raw,SBD,4,
Masters 2,Jacob Carrasco-Gonzales,Peru,1966,73.85,205,-220.5,-220.5,205,105,110,112.5,112.5,225,235,-245,235,552.5,74,M,Raw,SBD,1,
Masters 3,Carlos Burgos,Argentina,1964,73.7,160,180,,180,100,110,120,120,200,225,235,235,535,74,M,Raw,SBD,1,
Open,Cristian Trigo,Peru,1995,81.95,270,280,290,290,167.5,-175,175,175,295,-305,-305,295,760,83,M,Raw,SBD,1,
Open,Jose Figueroa Contreras,Chile,1994,82.2,275,290,-300,290,180,185,-196,185,275,-290,-290,275,750,83,M,Raw,SBD,2,
Open,Handy Zambrano,Ecuador,1992,82.15,255,270,280,280,150,162.5,172.5,172.5,255,270,-297.5,270,722.5,83,M,Raw,SBD,3,
Open,Juan Albin,Uruguay,1999,82.65,235,-245,245,245,145,152.5,160,160,255,275,287.5,287.5,692.5,83,M,Raw,SBD,4,
Open,Guilherme Menezes,Brazil,1995,81.1,235,245,-257.5,245,155,-160,-160,155,270,290,-300,290,690,83,M,Raw,SBD,5,
Open,Ramiro Gimenez,Argentina,1995,82.05,230,242.5,247.5,247.5,-165,-165,165,165,260,-267.5,-267.5,260,672.5,83,M,Raw,SBD,6,
Open,Gaston Calacha,Uruguay,1987,82.95,225,237.5,-247.5,237.5,150,160,167.5,167.5,220,-240,240,240,645,83,M,Raw,SBD,7,
Open,Jhonny Cardenas,Bolivia,1998,82.45,240,-255,-255,240,145,-152.5,-152.5,145,245,-257.5,-260,245,630,83,M,Raw,SBD,8,
Open,Carlos Badillo Arguello,Colombia,2000,83,245,-252.5,-252.5,245,155,-160,-160,155,225,-235,-250,225,625,83,M,Raw,SBD,9,
Open,Juliano Salas,Peru,1994,81.55,195,205,215,215,140,145,-147.5,145,245,255,-260,255,615,83,M,Raw,SBD,10,
Open,Javier Lafaurie Marlon,Colombia,1987,79.35,200,-205,-205,200,-125,125,,125,-250,250,-260,250,575,83,M,Raw,SBD,11,
Open,Luca Marcantoni,Argentina,2000,81.95,195,207.5,215,215,137.5,-142.5,-142.5,137.5,210,222.5,-232.5,222.5,575,83,M,Raw,SBD,12,
Open,Kheon Evans,Guyana,1993,82.2,235,-242.5,242.5,242.5,-140,-140,-140,,255,,,255,,83,M,Raw,SBD,DQ,
Sub-Juniors,Amaru Gutierrez,Chile,2006,81.1,210,222.5,230.5,230.5,120,-127.5,-127.5,120,225,240,247.5,247.5,598,83,M,Raw,SBD,1,
Sub-Juniors,Cristian Farfan,Chile,2007,81.95,200,210,-217.5,210,110,115,120,120,245,257.5,-270,257.5,587.5,83,M,Raw,SBD,2,
Sub-Juniors,Jonathan Picon Orozco,Colombia,2006,81.45,190,202.5,207.5,207.5,125,132.5,135,135,227.5,235,-240,235,577.5,83,M,Raw,SBD,3,
Sub-Juniors,Thamar Kasnawi,Suriname,2007,81.7,195,207.5,212.5,212.5,-110,110,-112.5,110,210,230,-250,230,552.5,83,M,Raw,SBD,4,
Sub-Juniors,Jean Elizalde Morocho,Ecuador,2007,82.75,190,200,207.5,207.5,100,107.5,110,110,225,235,-245,235,552.5,83,M,Raw,SBD,5,
Sub-Juniors,Matias Olivera,Uruguay,2007,81.8,185,192.5,200,200,115,-122.5,-122.5,115,-225,225,-242.5,225,540,83,M,Raw,SBD,6,
Sub-Juniors,Luis Suniga,Ecuador,2006,79.15,190,-200,-200,190,112.5,120,-122.5,120,190,200,-210,200,510,83,M,Raw,SBD,7,
Juniors,Samir Chatas Piamba,Colombia,2004,80.1,245,256,270.5,270.5,137.5,145,-147.5,145,265,280.5,294,294,709.5,83,M,Raw,SBD,1,
Juniors,Jose Garrido,Chile,2003,81.4,235,-247.5,-247.5,235,-155,160.5,-165.5,160.5,250,260,-270,260,655.5,83,M,Raw,SBD,2,
Juniors,Agustin Bayardi,Uruguay,2003,82.1,245,-255,-256.5,245,130,-135,-135,130,260,275,-281,275,650,83,M,Raw,SBD,3,
Juniors,Matias Fuentes,Chile,2001,81.85,207.5,215,222.5,222.5,-137.5,137.5,-142.5,137.5,232.5,247.5,255,255,615,83,M,Raw,SBD,4,
Juniors,Matheus Turcheti,Brazil,2001,81,205,217.5,222.5,222.5,-140,142.5,-147.5,142.5,235,242.5,-255,242.5,607.5,83,M,Raw,SBD,5,
Juniors,Mauricio Jonne,Uruguay,2001,82.25,222.5,235,240,240,127.5,-135,-135,127.5,230,237.5,-245,237.5,605,83,M,Raw,SBD,6,
Juniors,Diego Obando Pullas,Ecuador,2003,82.3,215,225,-235,225,117.5,122.5,,122.5,-250,250,-265,250,597.5,83,M,Raw,SBD,7,
Juniors,Arthur Coutinho,Brazil,2001,82.2,207.5,215,-225,215,115,-120,-120,115,235,-250,250,250,580,83,M,Raw,SBD,8,
Juniors,Jose Escalante,Peru,2003,80.9,190,-200,200,200,-145,145,150,150,200,215,-225,215,565,83,M,Raw,SBD,9,
Juniors,Sergio Guerra Benitez,Colombia,2003,80.15,-230,230,-237.5,230,140,142.5,-147.5,142.5,180,-182.5,-182.5,180,552.5,83,M,Raw,SBD,10,
Juniors,Franco Centeno,Argentina,2001,81.8,190,202.5,-210,202.5,-117.5,-117.5,-117.5,,,,,,,83,M,Raw,SBD,DQ,
Masters 1,Eduardo de Assis,Brazil,1980,82.4,202.5,215,225,225,122.5,132.5,137.5,137.5,230,-250,250,250,612.5,83,M,Raw,SBD,1,
Masters 1,Richard Marquez,Uruguay,1979,82.7,170,-180,180,180,127.5,135,140,140,230,240,-250,240,560,83,M,Raw,SBD,2,
Masters 1,Hernan Cesan,Argentina,1983,82.6,180,190,,190,-115,115,-122.5,115,-180,180,-190,180,485,83,M,Raw,SBD,3,
Masters 2,Jose Oyarse Pinglo,Peru,1968,82.7,170,185,203.5,203.5,102.5,107.5,112.5,112.5,215,230,-241,230,546,83,M,Raw,SBD,1,
Masters 2,Juan Contreras Vega,Chile,1971,81.7,155,165,172.5,172.5,90,97.5,-102.5,97.5,-180,180,-190,180,450,83,M,Raw,SBD,2,
Masters 3,Hugo Agostino,Argentina,1964,82.8,175,190,200,200,-105,105,115,115,185,205,220,220,535,83,M,Raw,SBD,1,
Masters 3,Pablo Puescas,Peru,1957,82,110,125,135,135,90,-92.5,105,105,120,130,140,140,380,83,M,Raw,SBD,2,
Masters 4,Nairanjan Singh,Guyana,1945,78.63,60,75,87.5,87.5,-77.5,77.5,-87.5,77.5,102.5,112.5,120.5,120.5,285.5,83,M,Raw,SBD,1,
Open,Moises Villon,Ecuador,1999,92.5,270,280,290,290,190,200,-207.5,200,285,295,-315,295,785,93,M,Raw,SBD,1,
Open,Edgar Orozco Ramirez,Colombia,1988,85.9,240,250,255,255,175,180,185,185,-290,290,-300,290,730,93,M,Raw,SBD,2,
Open,Lyndon Ammersingh,Suriname,1994,91.7,240,252.5,262.5,262.5,150,157.5,-165,157.5,270,290,-300,290,710,93,M,Raw,SBD,3,
Open,Dante Rodriguez,Argentina,1997,91.6,-235,235,255,255,142.5,152.5,-155,152.5,275,300,-302.5,300,707.5,93,M,Raw,SBD,4,
Open,Fabricio Gutierrez Teixeira,Bolivia,1995,92.25,225,240,-245,240,135,142.5,-150,142.5,-295,295,310,310,692.5,93,M,Raw,SBD,5,
Open,Nicolas Fuentealba,Chile,2000,91.9,260,272.5,-277.5,272.5,150,155,-160,155,260,-277.5,-292.5,260,687.5,93,M,Raw,SBD,6,
Open,Juan Pereyra #2,Uruguay,1991,87.65,225,-235,235,235,175,-182.5,-182.5,175,240,-260,-272.5,240,650,93,M,Raw,SBD,7,
Open,Leonardo Hermisdorf,Brazil,1997,92.75,255,265,,265,175,182.5,185,185,75,,,75,525,93,M,Raw,SBD,8,
Open,Sebastian Rozencvaig,Uruguay,1999,84.1,232.5,240,-245,240,140,147.5,-150,147.5,75,,,75,462.5,93,M,Raw,SBD,9,
Sub-Juniors,Fausto Barja,Bolivia,2008,87.1,-215,215,-225,215,107.5,115,-117.5,115,-235,-235,-235,,,93,M,Raw,SBD,DQ,
Sub-Juniors,Alonzo Parraguez,Chile,2008,90.1,217.5,235,-242.5,235,117.5,127.5,132.5,132.5,235,-250,250,250,617.5,93,M,Raw,SBD,1,
Sub-Juniors,Miguel David Romero Villero,Colombia,2007,84.45,195,210,-220,210,115,122.5,-125,122.5,230,240,245,245,577.5,93,M,Raw,SBD,2,
Sub-Juniors,Antonio Herrera,Chile,2008,91.7,210,217.5,-220,217.5,-95,95,-100,95,240,252.5,-267.5,252.5,565,93,M,Raw,SBD,3,
Sub-Juniors,Arthur Muschioni,Brazil,2006,90.55,175,185,,185,115,117.5,-120,117.5,252.5,260,-270.5,260,562.5,93,M,Raw,SBD,4,
Sub-Juniors,Joaquin Iglesias,Uruguay,2006,91.4,177.5,192.5,202.5,202.5,102.5,105,112.5,112.5,225,245,-252.5,245,560,93,M,Raw,SBD,5,
Juniors,Adrian Rivadera,Argentina,2002,92.1,-260,-265,265,265,155,-162.5,165,165,280,300,-310,300,730,93,M,Raw,SBD,1,
Juniors,Guillermo Carbajal,Peru,2002,91.35,-240,245,-255,245,150,155,160,160,270,-285,-285,270,675,93,M,Raw,SBD,2,
Juniors,Gabriel Lopez #8,Peru,2002,91.3,-245,-250,250,250,145,-150,-150,145,-235,245,265,265,660,93,M,Raw,SBD,3,
Juniors,Vinicius Oliveira,Brazil,2004,90.75,237.5,250,257.5,257.5,135,145,-152.5,145,240,255,-272.5,255,657.5,93,M,Raw,SBD,4,
Juniors,Kevin Xavier Brito Polanco,Ecuador,2004,91.6,-240,245,-255,245,140,-147.5,-147.5,140,-250,250,270,270,655,93,M,Raw,SBD,5,
Juniors,Diego Fuentes,Chile,2001,92.1,235,-255,255,255,130,140,-145,140,240,260,-272.5,260,655,93,M,Raw,SBD,6,
Juniors,Mateo Garcia,Uruguay,2005,89.85,225,242.5,-255,242.5,135,142.5,-145,142.5,230,250,-275,250,635,93,M,Raw,SBD,7,
Masters 1,Patricio Vazquez,Argentina,1982,87.3,200,210,220,220,155,165,,165,200,215,222.5,222.5,607.5,93,M,Raw,SBD,1,
Masters 1,Ruben Loaiza,Peru,1977,91.4,160,180,195,195,130,140,142.5,142.5,200,-215,215,215,552.5,93,M,Raw,SBD,2,
Masters 1,Guillermo Lucero,Argentina,1982,89.85,180,-192.5,-195,180,112.5,117.5,-122.5,117.5,220,227.5,237.5,237.5,535,93,M,Raw,SBD,3,
Masters 1,Raphael Duarte,Brazil,1982,91.2,-165,165,177.5,177.5,105,115,-122.5,115,210,225,237.5,237.5,530,93,M,Raw,SBD,4,
Masters 2,Jose Taboada Flores,Ecuador,1973,91.35,185,202.5,-210,202.5,120,125,127.5,127.5,185,190,200,200,530,93,M,Raw,SBD,1,
Masters 4,Aldemar Furtado,Brazil,1949,88.5,80,95,102.5,102.5,60,70,-72.5,70,120,-130,-140.5,120,292.5,93,M,Raw,SBD,1,
Open,Bernardo Ibanez Pawathon,Chile,1997,100.85,280,295,302.5,302.5,180,187.5,-195,187.5,280,-295,295,295,785,105,M,Raw,SBD,1,
Open,Rodrigo Jamar Santanna,Brazil,1994,103.2,265,282.5,292.5,292.5,170,182.5,190,190,265,282.5,-295,282.5,765,105,M,Raw,SBD,2,
Open,Agustin May,Uruguay,1998,104.3,-250,257.5,272.5,272.5,180,187.5,195,195,265,280,-287.5,280,747.5,105,M,Raw,SBD,3,
Open,Matheus Wallace de Oliveira,Brazil,1995,104.4,275,290,-300,290,162.5,167.5,172.5,172.5,272.5,-290,-290,272.5,735,105,M,Raw,SBD,4,
Open,Sebastian Flores,Chile,1999,105,265,-280,280,280,157.5,165,170,170,280,-300,-310,280,730,105,M,Raw,SBD,5,
Open,Nicolas Mondelli,Uruguay,1994,103.75,252.5,270,-280,270,147.5,155,157.5,157.5,262.5,280,-292.5,280,707.5,105,M,Raw,SBD,6,
Sub-Juniors,Maximo Maritano,Argentina,2006,101.1,230,-245,245,245,130,135,-141,135,-265,265,-276,265,645,105,M,Raw,SBD,1,
Sub-Juniors,Santiago Arias,Uruguay,2007,103.95,215,225,230,230,132.5,140.5,147.5,147.5,230,245,-260,245,622.5,105,M,Raw,SBD,2,
Sub-Juniors,Jean Paul Caicedo Martinez,Colombia,2006,105,210,222.5,-227.5,222.5,105,110,-115,110,250.5,260,265.5,265.5,598,105,M,Raw,SBD,3,
Juniors,Reucher Correa,Peru,2002,103.7,-280,-280,-280,,-165,-165,-165,,230,,,230,,105,M,Raw,SBD,DQ,
Juniors,Joaquin Barrios,Uruguay,2002,104.5,293,310.5,318,318,170,177.5,180,180,272.5,285,292.5,292.5,790.5,105,M,Raw,SBD,1,
Juniors,Bastian Arevalo,Chile,2002,104.75,267.5,280,292.5,292.5,165,172.5,177.5,177.5,-300,300,-321,300,770,105,M,Raw,SBD,2,
Juniors,Urias Valenzuela Paternina,Colombia,2002,104.9,265,272.5,285,285,150,157.5,162.5,162.5,260,-270,270,270,717.5,105,M,Raw,SBD,3,
Juniors,Nicolas Hirzel,Chile,2001,103.85,252.5,265,-270,265,132.5,-140,,132.5,270,290,-302.5,290,687.5,105,M,Raw,SBD,4,
Masters 1,Pablo Gomez,Argentina,1983,102.1,230,250,-260,250,140,150,160,160,240,260,277.5,277.5,687.5,105,M,Raw,SBD,1,
Masters 1,Edson Kamogawa,Brazil,1976,95,185,195,202.5,202.5,137.5,145,150,150,180,190,-202.5,190,542.5,105,M,Raw,SBD,2,
Masters 2,Nicolás Urioste,Uruguay,1968,103.9,205,217.5,227.5,227.5,162.5,-171,-171,162.5,75,,,75,465,105,M,Raw,SBD,1,
Open,Matheus Garcia Costa,Brazil,1991,118.3,300,315,-322.5,315,182.5,190,195,195,340,363,-370,363,873,120,M,Raw,SBD,1,
Open,Sebastian Cociña,Uruguay,1997,119.65,300,317.5,325,325,-205,205,-215,205,260,272.5,-280,272.5,802.5,120,M,Raw,SBD,2,
Open,Federico Rodriguez,Uruguay,1999,112.45,255,270,282.5,282.5,165,172.5,177.5,177.5,265,285,300,300,760,120,M,Raw,SBD,3,
Open,Marco Chepillo,Chile,1990,115.8,280,295,310,310,135,140,142.5,142.5,260,270,280,280,732.5,120,M,Raw,SBD,4,
Open,Jorge León,Peru,1977,107.35,245,262.5,-267.5,262.5,165,172.5,177.5,177.5,215,227.5,-235,227.5,667.5,120,M,Raw,SBD,5,
Open,Juan Kloster,Argentina,1999,,220,-230,-230,220,130,140,-147.5,140,247.5,-260,-260,247.5,607.5,120,M,Raw,SBD,6,
Sub-Juniors,Anthony Limberger,Brazil,2006,117.5,217.5,225,231,231,125,130,135,135,217.5,227.5,-236,227.5,593.5,120,M,Raw,SBD,1,
Sub-Juniors,Felipe Ariel Jesus Vazquez,Ecuador,2007,110.25,160,177.5,,177.5,110,120,-130,120,180,200,-210,200,497.5,120,M,Raw,SBD,2,
Juniors,David Cardoso,Brazil,2002,119.25,310,323,331,331,167.5,175,180,180,-305,325,-343.5,325,836,120,M,Raw,SBD,1,
Juniors,Salvador Albornoz,Uruguay,2004,116.2,245,260,272.5,272.5,142.5,150,155,155,257.5,275,277.5,277.5,705,120,M,Raw,SBD,2,
Juniors,Jesus Narvaez,Chile,2001,112.95,245,-260,260,260,155,170,175,175,250,-270,-275,250,685,120,M,Raw,SBD,3,
Juniors,Diego El Hilon,Argentina,2002,108,245,-260,-260,245,145,-157.5,-165,145,255,270,-275,270,660,120,M,Raw,SBD,4,
Masters 1,Alfredo Velez,Bolivia,1981,108.25,215,225,235,235,150,160,170,170,215,220,-225,220,625,120,M,Raw,SBD,1,
Masters 1,Alejandro Cantatore,Argentina,1980,116,225,232.5,-242.5,232.5,125,130,-135,130,225,-235,235,235,597.5,120,M,Raw,SBD,2,
Masters 2,Abel Baltuano,Peru,1974,112,-200,200,220,220,125,140,150,150,200,225,240,240,610,120,M,Raw,SBD,1,
Masters 3,Horacio Gomez,Argentina,1963,118,-140,152.5,162.5,162.5,90,97.5,100,100,170,190,215,215,477.5,120,M,Raw,SBD,1,
Masters 3,Antonio Lamana,Uruguay,1962,108.05,110,120,130,130,70,75,82.5,82.5,140,150,160,160,372.5,120,M,Raw,SBD,2,
Open,Ivan Bittencourt,Brazil,1999,121.9,290,305,-310,305,-170,180,185,185,315,325,-341,325,815,120+,M,Raw,SBD,1,
Open,Ricardo Coloma,Ecuador,1986,155.6,-320,-320,320,320,192.5,-200,-200,192.5,255,-265,270,270,782.5,120+,M,Raw,SBD,2,
Open,Jonathan Aguirre,Chile,1994,152.25,-280,280,-300,280,175,-185,-185,175,265,-272.5,272.5,272.5,727.5,120+,M,Raw,SBD,3,
Sub-Juniors,Andre Maio,Brazil,2007,148.6,170,195,200,200,77.5,90,-95,90,-210,-210,210,210,500,120+,M,Raw,SBD,1,
Masters 1,Daniel Nacle,Brazil,1978,141.1,270.5,290,-300,290,190,200.5,-205,200.5,270,282.5,-292.5,282.5,773,120+,M,Raw,SBD,1,
Masters 2,Rafael Sanzo,Uruguay,1974,143.5,195,205,210,210,147.5,152.5,-155,152.5,225,242.5,252.5,252.5,615,120+,M,Raw,SBD,1,
Masters 2,Miguel Fasano,Argentina,1968,145.3,175,-190,200,200,142.5,147.5,-152.5,147.5,240,250,-260,250,597.5,120+,M,Raw,SBD,2,
