Division,WeightClassKg,Place,Name,Team,BodyweightKg,Best3SquatKg,Best3BenchKg,Best3DeadliftKg,TotalKg,Equipment,Event,Sex,BirthDate
Boys,51.71,1,Andre Nordie,Ponder,48.53,95.25,47.63,95.25,238.14,Unlimited,SBD,M,
Boys,55.79,1,Colby Murphey,Ponder,53.52,142.88,92.99,163.29,399.16,Unlimited,SBD,M,
Boys,55.79,2,Caden Murphy,Ponder,54.88,122.47,72.57,124.74,319.78,Unlimited,SBD,M,
Boys,59.87,1,Knox Wilson,Van Alstyne,57.61,165.56,86.18,151.95,403.7,Unlimited,SBD,M,
Boys,59.87,2,Brodie Lindstrom,Little Elm,58.97,115.67,63.5,138.35,317.51,Unlimited,SBD,M,
Boys,67.13,1,Evan Rodgers,Celina,65.77,210.92,161.03,192.78,564.72,Unlimited,SBD,M,
Boys,67.13,2,Hayden Acevedo,Farmersville,64.86,197.31,104.33,179.17,480.81,Unlimited,SBD,M,
Boys,67.13,3,Yeray Penaloza,Farmersville,66.22,183.7,113.4,167.83,464.93,Unlimited,SBD,M,
Boys,67.13,4,Christian Phillips,Van Alstyne,62.14,183.7,102.06,165.56,451.32,Unlimited,SBD,M,
Boys,67.13,5,Hamza Ali,Little Elm,65.77,142.88,117.93,179.17,439.98,Unlimited,SBD,M,
Boys,67.13,6,Case Carson,Van Alstyne,65.77,167.83,95.25,172.37,435.45,Unlimited,SBD,M,
Boys,67.13,7,Kyle Barr,Little Elm,65.77,158.76,83.91,154.22,396.89,Unlimited,SBD,M,
Boys,67.13,8,Leland Cortez,Farmersville,66.22,154.22,86.18,154.22,394.63,Unlimited,SBD,M,
Boys,67.13,9,Gabriel Méndez,Little Elm,64.86,136.08,86.18,151.95,374.21,Unlimited,SBD,M,
Boys,67.13,10,Justin Nguyen,Ponder,64.41,115.67,70.31,133.81,319.78,Unlimited,SBD,M,
Boys,74.84,1,Besnik Hysenaj,Little Elm,73.48,219.99,154.22,215.46,589.67,Unlimited,SBD,M,
Boys,74.84,2,Kale Jones #1,Ponder,73.94,226.8,136.08,210.92,573.79,Unlimited,SBD,M,
Boys,74.84,3,Claetyn Moore,Ponder,72.12,206.38,108.86,183.7,498.95,Unlimited,SBD,M,
Boys,74.84,4,Corbin Hood,Ponder,73.94,181.44,106.59,188.24,476.27,Unlimited,SBD,M,
Boys,74.84,5,Kaelan McGuigan,Little Elm,71.67,151.95,102.06,176.9,430.91,Unlimited,SBD,M,
Boys,74.84,6,Luke Mateer,Little Elm,72.57,,92.99,161.03,254.01,Unlimited,BD,M,
Boys,82.1,1,Connor Valley,Little Elm,79.83,204.12,117.93,222.26,544.31,Unlimited,SBD,M,
Boys,82.1,2,Colton Place,Celina,81.19,210.92,136.08,197.31,544.31,Unlimited,SBD,M,
Boys,82.1,3,Devin Gonzales,Little Elm,80.29,167.83,117.93,226.8,512.56,Unlimited,SBD,M,
Boys,82.1,4,Alex Walker,Celina,81.19,161.03,113.4,136.08,410.5,Unlimited,SBD,M,
Boys,82.1,5,Daniel Gaddis,Little Elm,80.29,70.31,79.38,142.88,292.57,Unlimited,SBD,M,
Boys,89.81,1,Cody Ngyuen,Ponder,88.45,229.06,136.08,179.17,544.31,Unlimited,SBD,M,
Boys,89.81,2,Cole Marinelli,Celina,87.09,201.85,129.27,190.51,521.63,Unlimited,SBD,M,
Boys,89.81,3,Logan Gournay,Farmersville,88.45,136.08,74.84,151.95,362.87,Unlimited,SBD,M,
Boys,99.79,1,Cj Hubbard,Celina,97.43,242.67,183.7,254.01,680.39,Unlimited,SBD,M,
Boys,99.79,2,Armando Mendez #3,Celina,94.35,217.72,158.76,249.48,625.96,Unlimited,SBD,M,
Boys,99.79,3,Blaine Turner,Ponder,99.34,238.14,129.27,229.06,596.47,Unlimited,SBD,M,
Boys,109.77,1,Nick Garza,Little Elm,102.06,265.35,142.88,208.65,616.89,Unlimited,SBD,M,
Boys,109.77,2,Easton Clayton,Celina,104.78,240.4,142.88,201.85,585.13,Unlimited,SBD,M,
Boys,109.77,3,Cason Cox,Ponder,107.5,219.99,113.4,199.58,532.97,Unlimited,SBD,M,
Boys,109.77,4,Aldo Orsonia,Farmersville,106.14,170.1,108.86,181.44,460.4,Unlimited,SBD,M,
Boys,109.77,5,Garrett Williams,Farmersville,102.97,151.95,83.91,145.15,381.02,Unlimited,SBD,M,
Boys,124.74,1,Diego Gonzales,Little Elm,119.75,217.72,136.08,204.12,557.92,Unlimited,SBD,M,
Boys,139.71,1,Ty Hughes,Celina,129.73,206.38,174.63,188.24,569.26,Unlimited,SBD,M,
Boys,139.71,2,Shane Brown,Ponder,126.55,210.92,120.2,208.65,539.77,Unlimited,SBD,M,
Boys,139.71,3,Peyton Wilson,Celina,133.81,208.65,124.74,206.38,539.77,Unlimited,SBD,M,
Boys,139.71,4,Cashious McDonald,Ponder,131.54,217.72,142.88,174.63,535.24,Unlimited,SBD,M,
Boys,139.71+,1,John Turntine,North Crowley,141.07,229.06,88.45,188.24,505.76,Unlimited,SBD,M,
Boys,139.71+,2,Manny Segundo,Celina,149.23,,176.9,215.46,392.36,Unlimited,BD,M,
Boys,,NS,Henry Fenuku,North Crowley,,197.31,129.27,154.22,,Unlimited,SBD,M,
Boys,,NS,Jonathan Cunningham,North Crowley,,201.85,124.74,158.76,,Unlimited,SBD,M,
Boys,,NS,Ja' Brelle Asberry,North Crowley,,181.44,79.38,142.88,,Unlimited,SBD,M,
