Division,WeightClassKg,Place,Name,Team,BodyweightKg,Best3SquatKg,Best3BenchKg,Best3DeadliftKg,TotalKg,Equipment,Event,Sex
Boys,51.71,1,JT White,Cedar Hill,51.71,151.95,79.38,190.51,421.84,Single-ply,SBD,M
Boys,51.71,2,Rodney Barnes,Everman,46.81,113.4,61.23,124.74,299.37,Single-ply,SBD,M
Boys,51.71,3,Mohammad Ali,Mansfield Timberview,46.45,108.86,61.23,127.01,297.1,Single-ply,SBD,M
Boys,51.71,4,Michael Claus,Midlothian,50.53,92.99,63.5,117.93,274.42,Single-ply,SBD,M
Boys,55.79,5,Tyler Harden,Burleson,51.89,90.72,52.16,102.06,244.94,Single-ply,SBD,M
Boys,51.71,6,Kourtland Daughtry,Venus,43.27,70.31,31.75,83.91,185.97,Single-ply,SBD,M
Boys,55.79,1,Demitri Sommer,Lewisville The Colony,55.79,176.9,77.11,181.44,435.45,Single-ply,SBD,M
Boys,55.79,2,Kevin Huynh,Kennedale,55.25,154.22,86.18,167.83,408.23,Single-ply,SBD,M
Boys,59.87,3,Dameon Bissant,Cedar Hill,55.88,158.76,77.11,161.03,396.89,Single-ply,SBD,M
Boys,55.79,4,Ashton Williams,Everman,55.34,142.88,79.38,161.03,383.29,Single-ply,SBD,M
Boys,59.87,5,Trent Oliver,Cedar Hill,56.02,142.88,90.72,142.88,376.48,Single-ply,SBD,M
Boys,55.79,6,Daniel Pena,Ferris,54.61,133.81,70.31,167.83,371.95,Single-ply,SBD,M
Boys,55.79,7,Shafiq Asmati,Kennedale,55.61,138.35,74.84,142.88,356.07,Single-ply,SBD,M
Boys,55.79,8,Keith Collins,Kennedale,55.43,133.81,68.04,140.61,342.46,Single-ply,SBD,M
Boys,55.79,9,Rafael Sandoval,Plano John Paul II,55.79,115.67,68.04,154.22,337.93,Single-ply,SBD,M
Boys,55.79,10,Nick Roberts #4,Arlington Seguin,55.79,122.47,65.77,145.15,333.39,Single-ply,SBD,M
Boys,55.79,11,Ryan Shahan,Plano John Paul II,55.79,120.2,68.04,136.08,324.32,Single-ply,SBD,M
Boys,55.79,12,Jacob Lopez,Ferris,54.88,106.59,54.43,111.13,272.16,Single-ply,SBD,M
Boys,55.79,13,Garrett Mowles,Venus,55.7,97.52,61.23,113.4,272.16,Single-ply,SBD,M
Boys,59.87,1,Alejandro Olmos,Everman,59.06,167.83,113.4,161.03,442.25,Single-ply,SBD,M
Boys,67.13,2,Zach Rose,Cedar Hill,60.06,163.29,83.91,158.76,405.97,Single-ply,SBD,M
Boys,59.87,3,Jesus Vasquez,Red Oak,58.06,149.69,86.18,165.56,401.43,Single-ply,SBD,M
Boys,59.87,4,Raul Rodriguez,Hurst Bell,59.06,156.49,97.52,142.88,396.89,Single-ply,SBD,M
Boys,59.87,5,Chase Porter,Burleson,58.06,138.35,97.52,151.95,387.82,Single-ply,SBD,M
Boys,59.87,6,Alex Silva,Bishop Lynch,59.78,145.15,70.31,172.37,387.82,Single-ply,SBD,M
Boys,59.87,7,Brandon Green,Mansfield Timberview,59.42,129.27,72.57,154.22,356.07,Single-ply,SBD,M
Boys,67.13,8,Tj Davis,Maypearl,60.06,122.47,77.11,147.42,347,Single-ply,SBD,M
Boys,59.87,9,Tyler Walker,Red Oak,59.87,127.01,70.31,147.42,344.73,Single-ply,SBD,M
Boys,59.87,DQ,Ty Napier,Arlington Seguin,59.69,147.42,79.38,,,Single-ply,SBD,M
Boys,67.13,1,Sean Guinyard,Kennedale,64.14,201.85,115.67,206.38,523.9,Single-ply,SBD,M
Boys,67.13,2,Essix Lightfoot,Everman,66.86,215.46,106.59,199.58,521.63,Single-ply,SBD,M
Boys,74.84,3,Andres Sandoval,Ferris,67.22,188.24,136.08,190.51,514.83,Single-ply,SBD,M
Boys,67.13,4,Pat White #1,Lewisville The Colony,66.95,199.58,95.25,217.72,512.56,Single-ply,SBD,M
Boys,67.13,5,Stefan Sommer,Lewisville The Colony,66.32,199.58,104.33,195.04,498.95,Single-ply,SBD,M
Boys,67.13,6,Coy Hart,Venus,64.41,185.97,106.59,190.51,483.08,Single-ply,SBD,M
Boys,67.13,7,Jared Clark,Burleson,66.13,192.78,108.86,181.44,483.08,Single-ply,SBD,M
Boys,67.13,8,Fouad Ali,Kennedale,66.41,165.56,106.59,210.92,483.08,Single-ply,SBD,M
Boys,67.13,9,JR Pena,Ferris,65.41,185.97,92.99,197.31,476.27,Single-ply,SBD,M
Boys,67.13,10,Kenneth Stafford,Everman,65.32,181.44,102.06,183.7,467.2,Single-ply,SBD,M
Boys,67.13,11,Ryley Paroulek,Kennedale,66.32,161.03,95.25,192.78,449.06,Single-ply,SBD,M
Boys,67.13,12,Dewayne Toney,Cedar Hill,64.14,165.56,95.25,181.44,442.25,Single-ply,SBD,M
Boys,67.13,13,Ben Bush,Red Oak,66.04,161.03,104.33,172.37,437.72,Single-ply,SBD,M
Boys,67.13,14,Joel Benavides,Venus,65.14,163.29,90.72,181.44,435.45,Single-ply,SBD,M
Boys,67.13,15,Joseph Ogunniyi,Cedar Hill,65.77,165.56,90.72,179.17,435.45,Single-ply,SBD,M
Boys,67.13,16,Tyler Hunter,Kennedale,65.95,165.56,95.25,165.56,426.38,Single-ply,SBD,M
Boys,67.13,17,Jay Barton,Hurst Bell,64.41,158.76,86.18,165.56,410.5,Single-ply,SBD,M
Boys,67.13,18,Tommy Martinez,Midlothian,62.96,151.95,92.99,145.15,390.09,Single-ply,SBD,M
Boys,67.13,19,David Josephs,Dallas Highland Park,64.86,151.95,72.57,151.95,376.48,Single-ply,SBD,M
Boys,67.13,20,Tyron Henton,Everman,63.5,149.69,70.31,145.15,365.14,Single-ply,SBD,M
Boys,67.13,21,Jacob Montes,Midlothian,65.77,136.08,88.45,140.61,365.14,Single-ply,SBD,M
Boys,67.13,22,Jacoby Womack,Midlothian,67.04,131.54,81.65,140.61,353.8,Single-ply,SBD,M
Boys,67.13,23,Tyler Lindsey,Joshua,66.32,129.27,70.31,142.88,342.46,Single-ply,SBD,M
Boys,67.13,24,Brandon Johnson,Everman,65.5,90.72,79.38,158.76,328.85,Single-ply,SBD,M
Boys,67.13,25,Jordan Key,Midlothian,64.41,102.06,68.04,140.61,310.71,Single-ply,SBD,M
Boys,74.84,1,Devin Walker,Everman,73.75,226.8,131.54,231.33,589.67,Single-ply,SBD,M
Boys,74.84,2,Blake Lehew,Maypearl,68.95,226.8,142.88,192.78,562.45,Single-ply,SBD,M
Boys,74.84,3,Ben Adams,Cedar Hill,72.76,185.97,117.93,210.92,514.83,Single-ply,SBD,M
Boys,74.84,4,Frank Perdomo,Lewisville The Colony,74.48,181.44,104.33,226.8,512.56,Single-ply,SBD,M
Boys,74.84,5,Dakota Kundert,Burleson,71.67,181.44,129.27,195.04,505.76,Single-ply,SBD,M
Boys,74.84,6,Brazos Sepert,Maypearl,71.03,204.12,86.18,204.12,494.42,Single-ply,SBD,M
Boys,74.84,7,Collin Radford,Joshua,73.48,176.9,111.13,199.58,487.61,Single-ply,SBD,M
Boys,74.84,8,Tracey Walker,Mansfield Timberview,74.12,176.9,108.86,190.51,476.27,Single-ply,SBD,M
Boys,74.84,9,Christian Byers,Bishop Lynch,69.49,172.37,88.45,204.12,464.93,Single-ply,SBD,M
Boys,74.84,10,Jalun Watkins,Kennedale,69.04,197.31,81.65,181.44,460.4,Single-ply,SBD,M
Boys,74.84,11,Jordan Hicks,Arlington Seguin,74.12,192.78,102.06,165.56,460.4,Single-ply,SBD,M
Boys,74.84,12,Bernal Garza,Venus,73.75,183.7,102.06,172.37,458.13,Single-ply,SBD,M
Boys,74.84,13,Camilo Torres,Bishop Lynch,73.48,170.1,99.79,185.97,455.86,Single-ply,SBD,M
Boys,74.84,14,David Brown #12,Hurst Bell,73.48,142.88,113.4,161.03,417.3,Single-ply,SBD,M
Boys,74.84,15,Matthew O'Brian,Mansfield Timberview,73.94,136.08,97.52,176.9,410.5,Single-ply,SBD,M
Boys,74.84,16,Dean Strouth,Midlothian,72.21,147.42,90.72,163.29,401.43,Single-ply,SBD,M
Boys,74.84,17,Dylan Clary,Midlothian,71.21,149.69,90.72,158.76,399.16,Single-ply,SBD,M
Boys,74.84,18,Cardae Cauley,Everman,73.12,145.15,95.25,154.22,394.63,Single-ply,SBD,M
Boys,74.84,19,Taylor Daniel #1,Hurst Bell,69.04,136.08,79.38,161.03,376.48,Single-ply,SBD,M
Boys,74.84,20,Bodie Fry,Midlothian,69.94,124.74,77.11,167.83,369.68,Single-ply,SBD,M
Boys,74.84,21,Quinton Gayle,Arlington Seguin,70.85,136.08,74.84,147.42,358.34,Single-ply,SBD,M
Boys,74.84,22,Brandon Vineyard,Midlothian,73.94,131.54,61.23,165.56,358.34,Single-ply,SBD,M
Boys,74.84,DQ,Joe Smith,Maypearl,67.77,,,,,Single-ply,SBD,M
Boys,82.1,1,Cameron Bausley,Red Oak,78.29,231.33,129.27,229.06,589.67,Single-ply,SBD,M
Boys,82.1,2,Cale Gilley,Kennedale,78.74,226.8,136.08,226.8,589.67,Single-ply,SBD,M
Boys,89.81,3,Doveon Dillard,Cedar Hill,82.24,213.19,133.81,219.99,566.99,Single-ply,SBD,M
Boys,82.1,4,Elliot Souter,Hurst Bell,81.83,197.31,115.67,217.72,530.7,Single-ply,SBD,M
Boys,89.81,5,Jerry Burris,Cedar Hill,82.28,226.8,97.52,190.51,514.83,Single-ply,SBD,M
Boys,89.81,6,Cameron Bundy,Kennedale,82.28,181.44,117.93,195.04,494.42,Single-ply,SBD,M
Boys,89.81,7,Yama Asmati,Kennedale,82.19,188.24,102.06,190.51,480.81,Single-ply,SBD,M
Boys,82.1,8,Landon Whitlock,Burleson,79.83,181.44,115.67,174.63,471.74,Single-ply,SBD,M
Boys,82.1,9,Brennon Cogburn,Kennedale,78.38,192.78,104.33,170.1,467.2,Single-ply,SBD,M
Boys,82.1,10,Anton Clark,Arlington Seguin,80.38,167.83,106.59,181.44,455.86,Single-ply,SBD,M
Boys,82.1,11,Aaron Molder,Hurst Bell,80.83,163.29,99.79,192.78,455.86,Single-ply,SBD,M
Boys,82.1,12,Andrew Carnes,Burleson,80.83,181.44,77.11,181.44,439.98,Single-ply,SBD,M
Boys,82.1,13,Jack Peabody,Plano John Paul II,78.93,161.03,102.06,174.63,437.72,Single-ply,SBD,M
Boys,82.1,14,Brandon Rose,Plano John Paul II,78.65,147.42,104.33,176.9,428.64,Single-ply,SBD,M
Boys,89.81,15,Malcolm Rodgers,Arlington Seguin,82.28,149.69,95.25,174.63,419.57,Single-ply,SBD,M
Boys,82.1,16,Tyler Kilberg,Everman,81.92,161.03,77.11,176.9,415.04,Single-ply,SBD,M
Boys,89.81,17,Cody Samek,Midlothian,82.19,151.95,92.99,156.49,401.43,Single-ply,SBD,M
Boys,89.81,1,Chris Carnes,Burleson,88,238.14,149.69,226.8,614.62,Single-ply,SBD,M
Boys,89.81,2,Mike Denton,Lewisville The Colony,86.91,235.87,113.4,233.6,582.87,Single-ply,SBD,M
Boys,89.81,3,Marcus Stafford,Everman,88.27,233.6,127.01,213.19,573.79,Single-ply,SBD,M
Boys,99.79,4,Corey Smith,Cedar Hill,89.95,219.99,108.86,217.72,546.58,Single-ply,SBD,M
Boys,89.81,5,Keavin Turner,Cedar Hill,89.58,231.33,106.59,201.85,539.77,Single-ply,SBD,M
Boys,89.81,6,Trey McGahan,Kennedale,84.64,213.19,117.93,206.38,537.51,Single-ply,SBD,M
Boys,89.81,7,Ryan Tharp,Hurst Bell,87.82,195.04,136.08,190.51,521.63,Single-ply,SBD,M
Boys,99.79,8,Eric Martinez,Venus,89.9,190.51,124.74,206.38,521.63,Single-ply,SBD,M
Boys,89.81,9,Zachary Fuscilar,Everman,87.82,215.46,113.4,188.24,517.1,Single-ply,SBD,M
Boys,89.81,10,Caleb Shaw,Midlothian,87.82,199.58,124.74,190.51,514.83,Single-ply,SBD,M
Boys,89.81,11,Antonio Settle,Mansfield Timberview,84.46,172.37,136.08,195.04,503.49,Single-ply,SBD,M
Boys,89.81,12,Braelon Schwartz,Kennedale,88,192.78,113.4,195.04,501.22,Single-ply,SBD,M
Boys,89.81,13,Darian Sumberlin,Everman,87.18,192.78,131.54,172.37,496.68,Single-ply,SBD,M
Boys,89.81,14,Najee Mustafaa,Midlothian,83.01,190.51,104.33,192.78,487.61,Single-ply,SBD,M
Boys,89.81,15,Greg Woodward,Arlington Seguin,83.28,183.7,99.79,195.04,478.54,Single-ply,SBD,M
Boys,89.81,16,Warren Brightmon,Red Oak,86.45,174.63,117.93,183.7,476.27,Single-ply,SBD,M
Boys,89.81,17,Devin Jackson,Kennedale,87.45,185.97,104.33,181.44,471.74,Single-ply,SBD,M
Boys,89.81,18,Cao Songbo,Dallas Highland Park,85.18,174.63,102.06,181.44,458.13,Single-ply,SBD,M
Boys,89.81,19,Collin Garcia,Midlothian,86.27,158.76,97.52,185.97,442.25,Single-ply,SBD,M
Boys,89.81,20,Marcus Gentry,Ferris,84.73,149.69,113.4,170.1,433.18,Single-ply,SBD,M
Boys,89.81,21,John Walser,Midlothian,86.64,147.42,124.74,149.69,421.84,Single-ply,SBD,M
Boys,89.81,22,Taylor Wines,Burleson,84.55,136.08,90.72,183.7,410.5,Single-ply,SBD,M
Boys,89.81,23,Riley Hyslop,Plano John Paul II,87.72,127.01,95.25,185.97,408.23,Single-ply,SBD,M
Boys,89.81,24,Jose Diaz #8,Joshua,84.46,151.95,90.72,142.88,385.55,Single-ply,SBD,M
Boys,89.81,25,Zack Whiznand,Midlothian,88.18,142.88,88.45,151.95,383.29,Single-ply,SBD,M
Boys,89.81,26,Rogelio Medina,Maypearl,84.28,145.15,77.11,158.76,381.02,Single-ply,SBD,M
Boys,89.81,27,Angus Pebworth,Midlothian,87.36,124.74,88.45,151.95,365.14,Single-ply,SBD,M
Boys,89.81,DQ,Michael McDowell,Kennedale,88.54,,,,,Single-ply,SBD,M
Boys,99.79,1,Strat Washington,Cedar Hill,97.2,299.37,170.1,256.28,725.75,Single-ply,SBD,M
Boys,99.79,2,Calan Johnson,Cedar Hill,95.16,272.16,161.03,238.14,671.32,Single-ply,SBD,M
Boys,109.77,3,Isaiah Hinton,Lewisville The Colony,99.88,260.82,147.42,247.21,655.44,Single-ply,SBD,M
Boys,99.79,4,Addison Parish,Burleson,98.16,249.48,136.08,238.14,623.69,Single-ply,SBD,M
Boys,99.79,5,Sam Amaka,Mansfield Timberview,94.71,251.74,117.93,240.4,610.08,Single-ply,SBD,M
Boys,99.79,6,Josh Whitworth,Joshua,90.9,208.65,136.08,226.8,571.53,Single-ply,SBD,M
Boys,99.79,7,Kameron Salley,Hurst Bell,94.17,224.53,136.08,208.65,569.26,Single-ply,SBD,M
Boys,99.79,8,Dalton Carter,Joshua,98.25,226.8,129.27,197.31,553.38,Single-ply,SBD,M
Boys,99.79,9,Ben Blakely,Red Oak,93.44,188.24,120.2,219.99,528.44,Single-ply,SBD,M
Boys,99.79,10,Karim Behloul,Hurst Bell,93.89,201.85,111.13,215.46,528.44,Single-ply,SBD,M
Boys,99.79,11,Larry Hill,Cedar Hill,94.17,213.19,122.47,190.51,526.17,Single-ply,SBD,M
Boys,99.79,12,Cameron Davis #6,Bishop Lynch,98.52,201.85,111.13,197.31,510.29,Single-ply,SBD,M
Boys,99.79,13,Oscar Moreno,Ferris,94.71,201.85,111.13,195.04,508.02,Single-ply,SBD,M
Boys,99.79,14,Jack Ceverha,Dallas Highland Park,97.61,190.51,113.4,197.31,501.22,Single-ply,SBD,M
Boys,99.79,15,Jarius Haynes,Red Oak,97.98,190.51,120.2,183.7,494.42,Single-ply,SBD,M
Boys,99.79,16,Russell Rice,Dallas Highland Park,91.53,170.1,140.61,158.76,469.47,Single-ply,SBD,M
Boys,99.79,17,Cody Heckman,Joshua,97.16,179.17,106.59,183.7,469.47,Single-ply,SBD,M
Boys,99.79,18,Michael Cliff,Venus,91.81,174.63,106.59,181.44,462.66,Single-ply,SBD,M
Boys,99.79,19,Rashawn Marable,Arlington Seguin,92.26,170.1,104.33,185.97,460.4,Single-ply,SBD,M
Boys,99.79,20,Andrew Young #3,Joshua,95.62,210.92,92.99,154.22,458.13,Single-ply,SBD,M
Boys,99.79,21,Trent Haynes,Red Oak,94.35,181.44,90.72,183.7,455.86,Single-ply,SBD,M
Boys,99.79,22,Caden Patterson,Burleson,96.89,181.44,108.86,165.56,455.86,Single-ply,SBD,M
Boys,99.79,23,Daniel Ambriz,Everman,95.35,188.24,92.99,170.1,451.32,Single-ply,SBD,M
Boys,99.79,24,Bobby McGruder,Arlington Seguin,92.44,147.42,104.33,190.51,442.25,Single-ply,SBD,M
Boys,99.79,25,Lawton Anderson,Midlothian,97.25,158.76,113.4,163.29,435.45,Single-ply,SBD,M
Boys,99.79,26,Austin Adams,Midlothian,90.72,154.22,104.33,170.1,428.64,Single-ply,SBD,M
Boys,99.79,27,Caleb Dobson,Midlothian,97.89,158.76,92.99,163.29,415.04,Single-ply,SBD,M
Boys,99.79,28,Tony Richards,Dallas Highland Park,95.25,165.56,102.06,142.88,410.5,Single-ply,SBD,M
Boys,109.77,29,Thomas O'Toole-Halverson,Plano John Paul II,99.97,142.88,79.38,158.76,381.02,Single-ply,SBD,M
Boys,99.79,30,Trey Crumbley,Dallas Highland Park,91.08,129.27,70.31,138.35,337.93,Single-ply,SBD,M
Boys,99.79,DQ,Diego Mejia,Everman,94.35,251.74,,,,Single-ply,SBD,M
Boys,99.79,DQ,Chris Roberts,Cedar Hill,96.52,213.19,172.37,,,Single-ply,SBD,M
Boys,99.79,DQ,Martin Guerro,Ferris,98.07,201.85,,,,Single-ply,SBD,M
Boys,99.79,DQ,Eric Ramon,Bishop Lynch,94.89,195.04,77.11,,,Single-ply,SBD,M
Boys,99.79,DQ,Shawn Hargrove,Venus,97.98,170.1,,,,Single-ply,SBD,M
Boys,99.79,DQ,Jared Walsh,Mansfield Timberview,97.16,,,,,Single-ply,SBD,M
Boys,109.77,1,Hunter Heins,Burleson,109.41,238.14,142.88,260.82,641.83,Single-ply,SBD,M
Boys,124.74,2,Matt Guerra,Ferris,109.86,256.28,156.49,195.04,607.81,Single-ply,SBD,M
Boys,109.77,3,Christopher McCoy,Mansfield Timberview,103.6,249.48,140.61,204.12,594.21,Single-ply,SBD,M
Boys,109.77,4,Andrew Abamu,Cedar Hill,103.51,222.26,113.4,249.48,585.13,Single-ply,SBD,M
Boys,109.77,5,Brandon Saens,Red Oak,106.41,199.58,124.74,199.58,523.9,Single-ply,SBD,M
Boys,109.77,6,Marquez Cruz,Joshua,104.42,197.31,108.86,213.19,519.36,Single-ply,SBD,M
Boys,109.77,7,Nathan Ward,Kennedale,106.68,204.12,117.93,185.97,508.02,Single-ply,SBD,M
Boys,124.74,8,Dana Higginbotham,Burleson,109.95,181.44,113.4,185.97,480.81,Single-ply,SBD,M
Boys,109.77,9,Trey Good,Joshua,102.69,190.51,108.86,174.63,474,Single-ply,SBD,M
Boys,109.77,10,Bijzon Brown,Lewisville The Colony,107.59,181.44,106.59,181.44,469.47,Single-ply,SBD,M
Boys,109.77,11,Alex Canales,Hurst Bell,106.87,179.17,122.47,165.56,467.2,Single-ply,SBD,M
Boys,109.77,12,Tanner Morris,Hurst Bell,105.96,167.83,115.67,167.83,451.32,Single-ply,SBD,M
Boys,109.77,13,William Jones #4,Bishop Lynch,106.68,181.44,86.18,181.44,449.06,Single-ply,SBD,M
Boys,109.77,14,Gil Horn,Dallas Highland Park,103.78,158.76,102.06,158.76,419.57,Single-ply,SBD,M
Boys,109.77,15,Antonio Vargas,Arlington Seguin,104.24,147.42,92.99,170.1,410.5,Single-ply,SBD,M
Boys,109.77,16,Clayton Woods,Dallas Highland Park,103.15,142.88,90.72,136.08,369.68,Single-ply,SBD,M
Boys,109.77,DQ,Jackson Tittle,Dallas Highland Park,101.06,,,,,Single-ply,SBD,M
Boys,109.77,DQ,Felipe Aguiniga,Everman,105.96,,,,,Single-ply,SBD,M
Boys,109.77,DQ,Austin Apari Jr,Lewisville The Colony,105.69,240.4,129.27,,,Single-ply,SBD,M
Boys,109.77,DQ,Koltyn Davis,Kennedale,107.14,,,,,Single-ply,SBD,M
Boys,109.77,DQ,Yoojin Park,Bishop Lynch,109.77,181.44,88.45,,,Single-ply,SBD,M
Boys,109.77,DQ,Thomas Marek,Red Oak,108.14,,,,,Single-ply,SBD,M
Boys,109.77,DQ,Josh Ashlock,Maypearl,102.69,,,,,Single-ply,SBD,M
Boys,109.77,DQ,Keanu Johnson,Cedar Hill,107.5,,,,,Single-ply,SBD,M
Boys,124.74,1,Jaleil Davis,Cedar Hill,121.11,226.8,151.95,204.12,582.87,Single-ply,SBD,M
Boys,124.74,2,Marvin Bookman,Cedar Hill,110.95,215.46,124.74,217.72,557.92,Single-ply,SBD,M
Boys,124.74,3,Ethan Jones,Burleson,117.12,226.8,124.74,204.12,555.65,Single-ply,SBD,M
Boys,124.74,4,Jack Howard,Dallas Highland Park,114.67,199.58,115.67,199.58,514.83,Single-ply,SBD,M
Boys,124.74,5,Nick Savala,Bishop Lynch,116.57,231.33,104.33,174.63,510.29,Single-ply,SBD,M
Boys,124.74,6,Austin Crawford,Burleson,115.58,183.7,113.4,181.44,478.54,Single-ply,SBD,M
Boys,124.74,7,Jose Escuadra,Bishop Lynch,116.12,190.51,111.13,167.83,469.47,Single-ply,SBD,M
Boys,124.74,8,Reggie Ellis,Arlington Seguin,112.58,190.51,108.86,154.22,453.59,Single-ply,SBD,M
Boys,124.74,9,Walker Priddy,Burleson,110.95,158.76,108.86,174.63,442.25,Single-ply,SBD,M
Boys,124.74,10,Terik Rabb,Kennedale,118.57,154.22,106.59,181.44,442.25,Single-ply,SBD,M
Boys,124.74,11,Quinton Polk,Arlington Seguin,114.12,147.42,90.72,170.1,408.23,Single-ply,SBD,M
Boys,124.74,DQ,Brent Reed,Kennedale,117.57,190.51,,,,Single-ply,SBD,M
Boys,124.74,DQ,Ronald Richardson,Mansfield Timberview,111.13,181.44,,,,Single-ply,SBD,M
Boys,124.74,DQ,Jared Hughes,Plano John Paul II,117.21,190.51,,,,Single-ply,SBD,M
Boys,124.74+,1,Aderius Epps,Cedar Hill,147.6,294.84,167.83,235.87,698.53,Single-ply,SBD,M
Boys,124.74+,2,Nate Brown,Kennedale,141.52,278.96,145.15,244.94,669.05,Single-ply,SBD,M
Boys,124.74+,3,Steven Patton,Red Oak,141.52,249.48,140.61,210.92,601.01,Single-ply,SBD,M
Boys,124.74+,4,Anthony Zapata,Everman,126.01,249.48,115.67,219.99,585.13,Single-ply,SBD,M
Boys,124.74+,5,Daniel Kim,Lewisville The Colony,126.78,238.14,142.88,199.58,580.6,Single-ply,SBD,M
Boys,124.74+,6,Kyle Green,Joshua,154.22,188.24,136.08,181.44,505.76,Single-ply,SBD,M
Boys,124.74+,7,Chris Hinton,Midlothian,132.27,201.85,106.59,181.44,489.88,Single-ply,SBD,M
Boys,124.74+,8,Joey Stephens,Everman,135.17,201.85,92.99,161.03,455.86,Single-ply,SBD,M
Boys,124.74+,9,Rodney Allen,Mansfield Timberview,125.37,147.42,92.99,151.95,392.36,Single-ply,SBD,M
Boys,124.74+,DQ,Michael Sottilotto,Kennedale,125.92,192.78,113.4,,,Single-ply,SBD,M
Boys,124.74+,DQ,Josue Vargas,Ferris,155.95,263.08,106.59,,,Single-ply,SBD,M
