﻿KOMUNIKAT KOŃCOWY,,,,,,,,,,,,,,,,,,,
AKADEMICKIE MISTRZOSTWA POLSKI W TRÓJBOJU SIŁOWYM KLASYCZNYM,,,,,,,,,,,,,,,,,,,
"KATOWICE, 05-07.05.2023",,,,,,,,,,,,,,,,,,,
,,,,,,,,,,,,,,,,,,,
WYNIKI KOBIET,,,,,,,,,,,,,,,,,,,
,,,,,,,,,,,,,,,,,,,
ORGANIZATOR:,,,,,,,,,,,,,,,,,,,
AZS Uniwersytetu Śląskiego,,,,,,,,,,,,,,,,,,,
"ul. Bankowa 12, 40-007 Katowice",,,,,,,,,,,,,,,,,,,
tel. 509-407-288,,,,,,,,,,,,,,,,,,,
https://azsus.pl/amp-trojboj-silowy-2023,,,,,,,,,,,,,,,,,,,
https://www.facebook.com/amp.trojboj.silowy,,,,,,,,,,,,,,,,,,,
,,,,,,,,,,,,,,,,,,,
KLASYFIKACJA INDYWIDUALNA KOBIET,,,,,,,,,,,,,,,,,,,
,,,,,,,,,,,,,,,,,,,
,,,,,,,,,Przysiady,,,Wyciskanie leżąc,,,Martwy ciąg,,,,
,Nazwisko i imię,Uczelnia,,,,,,,,,,,,,,,Wynik,Punkty IPF,Typ
,,,,,,,,,,,,,,,,,,,uczelni
,,,,,,,,1,2,3,1,2,3,1,2,3,,,
,Kategoria 52  [ pkt.IPF GL],,,,,,,,,,,,,,,,,,
1,Aleksandra Blajer,UR Rzeszów,"51,60",52,"0,25420",63,34,130,"-137,5","-137,5",75,"77,5",-80,140,150,155,"362,5","92,145703",UNI
2,Paulina Szymanel,PG Gdańsk,"47,00",52,"0,27720",54,34,105,110,113,73,-76,-76,143,"147,5",-153,"333,5","92,446802",UTE
3,Agata Szewczuk,UPWr Wrocław,"50,90",52,"0,25725",12,34,90,-95,100,60,65,"-67,5",115,120,125,"290,0","74,603718",USP
4,Daria Tylec,UR Rzeszów,"51,75",52,"0,25356",13,34,"-82,5","82,5",85,60,"62,5","67,5",110,115,120,"272,5","69,094352",UNI
5,Weronika Góra,UM Łódź,"51,95",52,"0,25272",62,34,75,80,"-82,5",50,55,"-57,5",115,120,-123,"255,0","64,442661",UME
6,Magdalena Mołoń,AWF Poznań,"50,90",52,"0,25725",6,34,70,80,85,"37,5","42,5",-45,95,110,-120,"237,5","61,097873",UWF
7,Natalia Strzymczok,UŚ Katowice,"50,00",52,"0,26140",56,34,75,"77,5",85,30,-35,"-37,5",80,90,100,"215,0","56,200733",UNI
8,Zuzanna Surowy,UG Gdańsk,"49,70",52,"0,26284",5,34,60,70,80,30,35,"37,5",75,85,90,"207,5","54,538525",UNI
nk,Zuzanna Marczak,AWFiS Gdańsk,"51,55",52,"0,25441",75,34,-110,-110,-110,"52,5",55,0,115,"-122,5",125,"0,0","0,000000",UWF
,Kategoria 57  [ pkt.IPF GL],,,,,,,,,,,,,,,,,,
1,Gabriela Blajer,UR Rzeszów,"56,70",57,"0,23550",30,36,"137,5",142,-143,70,-75,-75,150,160,"162,5","374,5","88,194498",UNI
2,Wiktoria Zapotoczna,AGH Kraków,"56,50",57,"0,23613",21,36,120,"127,5","-132,5",70,-75,75,-155,160,-170,"362,5","85,597396",UTE
3,Agata Markowska,UM Łódź,"55,40",57,"0,23974",25,36,110,115,120,70,"72,5",75,130,"142,5",-150,"337,5","80,911225",UME
4,Sandra Bogucka,UWM Olsztyn,"56,30",57,"0,23677",32,36,100,"107,5","-112,5",60,"62,5",-65,120,"132,5",140,"310,0","73,398532",UNI
5,Magdalena Bielska,PB Białystok,"55,00",57,"0,24111",10,35,115,120,-125,"52,5","57,5",-60,115,"122,5","127,5","305,0","73,537590",UTE
6,Dominika Mazur,GUMed Gdańsk,"56,85",57,"0,23503",75,36,115,-120,-120,65,70,"-72,5",120,-130,-130,"305,0","71,684295",UME
,,,,,,,,,,,,,,,,,,,
7,Gabriela Marchwica,UJ Kraków,"54,75",57,"0,24198",11,36,100,105,-110,"52,5",55,"57,5",125,135,140,"302,5","73,198842",UNI
8,Zuzanna Pawlicz,UEP Poznań,"55,35",57,"0,23991",31,36,100,-110,110,55,"-57,5","57,5",123,"127,5","132,5","300,0","71,971932",USP
9,Andżelika Cyngot,SGGW Warszawa,"55,90",57,"0,23807",50,36,95,105,-110,50,"57,5",-60,118,125,"132,5","295,0","70,230414",USP
10,Patrycja Oniszk,UW Warszawa,"54,80",57,"0,24180",17,36,95,-105,105,45,"47,5",50,115,125,"132,5","287,5","69,518664",UNI
11,Paulina Pizoń,UMCS Lublin,"56,20",57,"0,23709",24,36,-105,105,-110,50,"52,5",-55,130,"-137,5",-138,"287,5","68,163829",UNI
12,Aleksandra Banasiak,AWF Warszawa,"55,75",57,"0,23856",36,36,100,105,-110,55,"57,5",-60,110,115,-120,"277,5","66,201629",UWF
13,Łucja Zajdel,UR Rzeszów,"56,15",57,"0,23725",1,36,95,"102,5","107,5",55,60,-65,100,105,110,"277,5","65,837802",UNI
14,Zuzanna Skrok,AWF w Krakowie,"56,60",57,"0,23581",53,36,"107,5",-110,"112,5",60,"-62,5","-62,5",105,"-107,5",-108,"277,5","65,438422",UWF
15,Patrycja Wdowiak,UM Lublin,"55,50",57,"0,23940",28,35,90,100,105,45,50,55,100,105,110,"270,0","64,637864",UME
16,Monika Garbicz,US Szczecin,"56,25",57,"0,23693",16,36,95,100,105,50,"-52,5","-52,5",100,105,110,"265,0","62,786526",UNI
17,Klaudia Wawrzycka,UPr Lublin,"57,00",57,"0,23457",38,36,85,"92,5","-97,5","47,5",-55,-55,115,"-122,5",125,"265,0","62,159887",USP
18,Małgorzata Kukiełka,PŚ Gliwice,"56,40",57,"0,23645",34,35,"77,5",85,-90,45,"47,5",-50,115,125,"127,5","260,0","61,476788",UTE
19,Kamila Wiatrzyk,KUL Lublin,"55,80",57,"0,23840",17,35,90,-95,-95,40,"42,5",-45,100,105,110,"242,5","57,811726",UNI
20,Monika Winiarska,UR Rzeszów,"54,45",57,"0,24304",19,35,80,85,-90,35,40,"42,5",90,-100,110,"237,5","57,723021",UNI
21,Agnieszka Próchno,UM Lublin,"55,05",57,"0,24093",23,35,80,90,"-92,5",40,"42,5",-45,90,95,100,"232,5","56,017118",UME
22,Zuzanna Kmiecik,UEP Poznań,"56,30",57,"0,23677",9,35,70,-75,75,35,"37,5",-40,-100,"102,5","107,5","220,0","52,089281",USP
23,Weronika Wiatrowska,UEP Poznań,"54,10",57,"0,24431",2,35,-50,-55,55,35,-40,"42,5",-70,"72,5",80,"177,5","43,365175",USP
24,Aleksandra Kubicius,UŚ Katowice,"56,85",57,"0,23503",30,35,"-57,5","57,5","62,5","37,5",40,"42,5",-70,"72,5","-77,5","177,5","41,717909",UNI
25,Dorota Gancarz,UPP Poznań,"55,30",57,"0,24008",42,35,-50,50,55,"27,5",35,"-37,5",65,"72,5",80,"170,0","40,812990",USP
26,Weronika Trenka,UŚ Katowice,"55,00",57,"0,24111",37,35,35,"42,5","47,5",25,"27,5",-30,55,65,-70,"140,0","33,754959",UNI
,,,,,,,,,,,,,,,,,,,
Kategoria 63  [ pkt.IPF GL],,,,,,,,,,,,,,,,,,,
,,,,,,,,,,,,,,,,,,,
1,Patrycja Panasiuk,UJ Kraków,"62,85",63,"0,21912",5,40,125,130,135,65,70,75,170,182,-188,"392,0","85,894977",UNI
2,Michaela Kiełbasa,PG Gdańsk,"62,60",63,"0,21969",22,40,125,130,135,"57,5","62,5",-65,150,160,165,"362,5","79,636437",UTE
3,Patrycja Tomczyk,UO Opole,"61,05",63,"0,22337",43,37,115,120,125,"72,5",75,"77,5",145,"152,5","157,5","360,0","80,413039",UNI
4,Joanna Lenart,UEK Kraków,"61,50",63,"0,22227",40,40,"117,5","122,5",125,"62,5","67,5",-70,145,150,"157,5","350,0","77,794353",USP
5,Julia Broź,UJ Kraków,"59,95",63,"0,22617",16,40,120,"-127,5","127,5","67,5",70,"-72,5",140,150,-155,"347,5","78,594451",UNI
6,Wiktoria Pieniążek,UP Kraków,"60,95",63,"0,22362",72,40,135,140,-145,"57,5",60,"62,5",140,145,-150,"347,5","77,707096",USP
7,Karolina Kulińska,AWF Katowice,"60,50",63,"0,22475",18,40,115,120,"-122,5",75,"-82,5","82,5",120,130,-138,"332,5","74,729324",UWF
8,mgr inż. Katarzyna,PG Gdańsk,"61,10",63,"0,22325",51,40,"122,5",130,-135,55,"62,5",-65,123,130,140,"332,5","74,229310",UTE
,Tessmer,,,,,,,,,,,,,,,,,,
9,Julia Cebula,AWF w Krakowie,"61,95",63,"0,22120",52,39,95,105,115,"47,5",55,"57,5",140,150,155,"327,5","72,441412",UWF
10,Klaudia Wąsacz,PRz Rzeszów,"61,65",63,"0,22191",7,40,"117,5",120,125,50,55,60,130,"137,5",-143,"322,5","71,565536",UTE
11,Nikola Górecka,AWFiS Gdańsk,"59,50",63,"0,22737",44,39,115,-120,120,"-62,5","62,5",-65,120,125,130,"312,5","71,051720",UWF
12,Katarzyna Rzemieniak,WAT Warszawa,"61,30",63,"0,22276",5,40,110,115,-120,60,65,-70,120,130,-135,"310,0","69,054129",USP
13,Paulina Markiewicz,PO Opole,"58,90",63,"0,22900",9,40,100,"102,5",105,"77,5",80,"82,5",110,115,120,"307,5","70,418741",UTE
14,Aleksandra Tkaczyk,UM Łódź,"59,35",63,"0,22777",10,40,100,105,-110,"57,5",60,"62,5",125,"132,5",140,"307,5","70,039318",UME
15,Katarzyna Walczak,PP Poznań,"62,10",63,"0,22084",52,37,105,"112,5",-115,55,"57,5",-60,120,130,"137,5","307,5","67,909084",UTE
16,Kinga Głuchowska,UW Warszawa,"62,45",63,"0,22003",79,40,110,"117,5","-122,5",40,45,0,130,-140,"142,5","305,0","67,109258",UNI
17,Natalia Mazur,PWr Wrocław,"59,50",63,"0,22737",15,39,95,100,105,60,"62,5",-65,110,"117,5","122,5","290,0","65,935996",UTE
18,Dominika Groń,AWF w Krakowie,"61,90",63,"0,22131",63,39,"92,5","97,5","-102,5",50,-55,-55,125,"132,5",-135,"280,0","61,967723",UWF
19,Aleksandra Kukotko,UPP Poznań,"60,90",63,"0,22374",80,40,90,"97,5",105,"42,5","-47,5","47,5",108,115,125,"277,5","62,088412",USP
20,Patrycja Piec,PWr Wrocław,"62,35",63,"0,22026",31,39,80,90,100,-85,-85,85,80,90,-100,"275,0","60,571753",UTE
21,Wiktoria Boba,US Szczecin,"58,95",63,"0,22887",61,39,"92,5","97,5","-102,5","42,5","47,5",-50,115,"122,5",-128,"267,5","61,221504",UNI
,,,,,,,,,,,,,,,,,,,
22,Weronika Borecka,UW Warszawa,"61,80",63,"0,22155",6,39,85,"92,5","97,5",40,"47,5","52,5",110,115,"117,5","267,5","59,264760",UNI
23,Zuzanna Hajnrych,PBŚ Bydgoszcz,"62,25",63,"0,22049",30,39,"87,5","-92,5","92,5",-50,50,"-52,5",113,"117,5",-123,"260,0","57,328095",UTE
24,Laura Konop,ŚUM Katowice,"60,30",63,"0,22526",48,38,75,80,"87,5",35,40,"-42,5",115,"-122,5",125,"252,5","56,878614",UME
25,Julianna Skalska,GUMed Gdańsk,"61,80",63,"0,22155",56,39,85,90,-95,40,-45,45,110,"117,5",-125,"252,5","55,941502",UME
26,Dagmara Walencka,ŚUM Katowice,"59,25",63,"0,22804",14,38,"92,5",-100,-100,45,-50,-50,100,105,110,"247,5","56,440329",UME
27,Zuzanna Zakrzewska,PG Gdańsk,"62,15",63,"0,22073",13,39,75,"82,5","87,5",40,-45,-45,110,"117,5",120,"247,5","54,629592",UTE
28,Krystyna Miklusiak,AGH Kraków,"62,20",63,"0,22061",3,38,75,85,95,"42,5","47,5",50,80,"92,5",100,"245,0","54,049204",UTE
29,Aleksandra Laska,PWr Wrocław,"60,65",63,"0,22437",55,38,75,85,"-92,5",40,-45,-45,90,100,110,"235,0","52,726812",UTE
30,Emilia Matrejek,SGH Warszawa,"57,65",63,"0,23260",12,38,70,"77,5","-82,5",40,"42,5",45,103,"107,5",110,"232,5","54,078616",USP
31,Julia Majak,UMCS Lublin,"62,53",63,"0,21985",2,38,70,75,"77,5","37,5",40,"-42,5",100,105,110,"227,5","50,015137",UNI
32,Alicja Pabis,AGH Kraków,"62,20",63,"0,22061",29,38,70,"77,5","-82,5",-45,45,0,85,"92,5",100,"222,5","49,085502",UTE
33,Aleksandra Adamik,AWF w Krakowie,"61,30",63,"0,22276",18,39,105,110,-120,55,60,-70,-45,45,0,"215,0","47,892380",UWF
34,Marta Pazunczyn,PP Poznań,"60,10",63,"0,22578",51,37,65,"72,5",80,40,-45,-45,75,"87,5","92,5","212,5","47,978106",UTE
35,Karolina Hurek,UO Opole,"60,70",63,"0,22424",44,37,-70,"-72,5","72,5",40,45,"-47,5",75,85,95,"212,5","47,651695",UNI
36,Sylwia Kurzeja,UEK Kraków,"61,95",63,"0,22120",23,38,80,"87,5",-95,"37,5",40,"42,5",75,-80,80,"210,0","46,450982",USP
37,Julia Węgrzyn,UEK Kraków,"59,65",63,"0,22696",69,38,"57,5",-65,65,"42,5","-47,5","-47,5",90,100,-105,"207,5","47,095059",USP
38,Justyna Talaska,ŚUM Katowice,"62,50",63,"0,21992",58,37,-50,50,-60,35,-40,-40,80,"92,5","102,5","187,5","41,234159",UME
39,Sylwia Puzio,UMK Toruń,"61,95",63,"0,22120",1,37,-50,50,-60,40,45,-50,80,90,-100,"185,0","40,921103",UNI
40,Kornelia Janczak,UPP Poznań,"62,55",63,"0,21980",31,37,55,-70,-70,25,-35,-35,50,60,75,"155,0","34,069151",USP
,Aleksandra,,,,,,,,,,,,,,,,,,
41,Rosołowska,ZUT Szczecin,"62,20",63,"0,22061",65,37,45,"52,5",-60,25,30,"-32,5",50,60,70,"152,5","33,642872",UTE
42,Wiktoria Sekta,UŚ Katowice,"60,30",63,"0,21812",47,37,35,"42,5",50,25,"27,5",30,55,65,-75,"145,0","31,627035",UNI
43,Marta Czarnecka,UE Katowice,"61,80",63,"0,22155",53,37,-35,35,-40,25,"-27,5","-27,5",40,50,60,"120,0","26,586061",USP
,,,,,,,,,,,,,,,,,,,
nk,Dominika Trager,PK Kraków,"62,20",63,"0,22061",28,40,90,100,"-102,5",-55,-55,-55,120,130,-140,"0,0","0,000000",UTE
pk,Marta Gorlo,UPr Lublin,"63,70",63,"0,21725",11,37,75,80,-85,45,50,0,110,0,0,"240,0","52,138917",USP
,Kategoria 69  [ pkt.IPF GL],,,,,,,,,,,,,,,,,,
1,Aleksandra Łukasik,AWF w Krakowie,"66,00",69,"0,21256",56,44,130,"137,5","142,5","57,5","62,5",65,163,"167,5","172,5","380,0","80,771061",UWF
2,Julia Bilicka,UG Gdańsk,"68,00",69,"0,20888",37,44,110,"117,5","122,5",65,70,75,150,160,175,"372,5","77,808922",UNI
3,Ewelina Kalinowska,UŁ Łódź,"65,95",69,"0,21265",51,44,125,"132,5","137,5",60,65,"-67,5",160,"167,5","-177,5","370,0","78,681181",UNI
4,Julia Kulczycka,PG Gdańsk,"67,75",69,"0,20932",32,44,"122,5",130,"-137,5","67,5",-70,70,135,145,"152,5","352,5","73,786399",UTE
5,Anna Sikora,UW Warszawa,"66,95",69,"0,21077",11,44,115,120,-125,"67,5",70,"72,5",150,"157,5",-165,"350,0","73,768491",UNI
6,Julia Gejdel,UE Wrocław,"67,40",69,"0,20995",63,41,"112,5","117,5","122,5","57,5",60,"62,5",150,"157,5","162,5","347,5","72,956964",USP
,Weronika,,,,,,,,,,,,,,,,,,
7,Andryskowska,GUMed Gdańsk,"67,70",69,"0,20941",36,44,120,"122,5","-127,5",55,60,"-62,5",140,150,160,"342,5","71,723530",UME
8,Wiktoria Białacka,UMCS Lublin,"67,80",69,"0,20923",35,44,110,"117,5",125,60,65,-70,135,"142,5",150,"340,0","71,139791",UNI
9,Laura Kosel,GUMed Gdańsk,"68,40",69,"0,20819",4,43,115,"122,5",-130,75,80,"-82,5",118,125,130,"332,5","69,223028",UME
10,Kinga Łątkowska,PG Gdańsk,"68,85",69,"0,20742",1,44,105,"112,5","117,5","62,5","67,5",-70,145,-155,-155,"330,0","68,450195",UTE
11,Anna Nalborczyk,PK Kraków,"66,71",69,"0,21121",16,42,105,"112,5",120,"57,5","62,5","-67,5",135,"142,5",-148,"325,0","68,643639",UTE
12,Eliza Fiedorczuk,UG Gdańsk,"67,20",69,"0,21031",69,43,100,110,115,50,"57,5",-65,130,140,"152,5","325,0","68,350728",UNI
13,Magdalena Jagnicka,UG Gdańsk,"66,85",69,"0,21095",20,44,110,"117,5","122,5","57,5",-60,60,135,"-142,5","-142,5","317,5","66,977110",UNI
14,Agnieszka Rojek,UG Gdańsk,"68,25",69,"0,20845",12,43,95,"102,5",-110,65,70,"72,5",115,130,-140,"305,0","63,576662",UNI
15,Weronika Kawa,UJ Kraków,"66,10",69,"0,21236",9,41,100,"107,5","112,5","47,5",50,"-52,5",125,135,140,"302,5","64,239895",UNI
,Aleksandra,,,,,,,,,,,,,,,,,,
16,Orzechowska,PG Gdańsk,"67,85",69,"0,20915",34,43,105,"112,5","-117,5","47,5",50,"-52,5",125,135,140,"302,5","63,266801",UTE
17,Karolina Juszczak,PO Opole,"63,55",69,"0,21757",22,43,"117,5",125,"127,5",65,"-67,5",-70,100,"107,5",-115,"300,0","65,271126",UTE
18,Karolina Warchał,AWSB Dąbrowa,"67,35",69,"0,21004",23,43,"97,5","102,5","107,5","57,5","-62,5","62,5",110,120,130,"300,0","63,011470",WSN
,,Górnicza,,,,,,,,,,,,,,,,,
19,Paulina Kozioł,UO Opole,"67,75",69,"0,20932",48,41,90,"97,5",-105,50,55,"-57,5",120,130,135,"287,5","60,180397",UNI
,,,,,,,,,,,,,,,,,,,
20,Urszula Kurzajewska,UPr Lublin,"68,30",69,"0,20836",18,43,90,"97,5","-102,5",50,"-52,5","-52,5",-135,135,-140,"282,5","58,862180",USP
21,Aneta Sagan,AG Katowice,"67,65",69,"0,20950",33,43,100,"-102,5","102,5",50,55,"57,5",110,120,-130,"280,0","58,660175",WSN
22,Zuzanna Dąbrowska,AWFiS Gdańsk,"68,55",69,"0,20793",26,42,90,100,110,45,50,"52,5",105,115,-125,"277,5","57,701367",UWF
23,Daria Sitarczuk,WAT Warszawa,"65,50",69,"0,21353",8,43,110,120,-125,40,45,-50,110,-120,-120,"275,0","58,720821",USP
24,Julia Ostrowska,SGH Warszawa,"64,95",69,"0,21463",44,42,85,95,100,55,60,"-62,5",105,110,-115,"270,0","57,950239",USP
25,Martyna Uśniacka,UPWr Wrocław,"64,40",69,"0,21576",70,42,-80,80,"87,5","37,5",40,"-42,5",120,125,130,"257,5","55,558473",USP
26,Paulina Zębala,PP Poznań,"64,75",69,"0,21504",57,41,85,"92,5","-97,5",50,"52,5",-55,90,105,0,"250,0","53,759515",UTE
27,Wiktoria Nowogórska,AGH Kraków,"65,65",69,"0,21324",7,42,85,95,100,45,50,"52,5",85,"92,5","97,5","250,0","53,308827",UTE
28,Julia Ziółkowska,UW Warszawa,"63,05",69,"0,21867",24,43,70,80,85,35,"37,5",40,110,115,120,"245,0","53,574520",UNI
29,Dominika Nowak,PP Poznań,"64,40",69,"0,21576",60,41,75,80,"87,5","47,5",50,-55,90,100,"107,5","245,0","52,861459",UTE
30,Gabriela Szejner,PBŚ Bydgoszcz,"64,90",69,"0,21473",27,42,-85,85,-90,40,"42,5",45,110,-115,115,"245,0","52,609346",UTE
31,Paulina Adamska,UO Opole,"66,60",69,"0,21142",111,41,90,"-97,5","-97,5",50,"52,5",-55,90,95,100,"242,5","51,268489",UNI
,Magdalena,,,,,,,,,,,,,,,,,,
32,,PŚ Gliwice,"67,60",69,"0,20959",37,42,65,70,75,55,"-57,5","-57,5",100,105,"112,5","242,5","50,825501",UTE
,Twardowska,,,,,,,,,,,,,,,,,,
33,Anna Koszyk,UW Warszawa,"67,50",69,"0,20977",5,42,80,85,"87,5","37,5",40,"-42,5",100,110,-120,"237,5","49,820012",UNI
34,Agata Kościukiewicz,UAM Poznań,"65,25",69,"0,21403",3,42,"77,5",85,90,"37,5","-42,5","42,5",95,"102,5",-105,"235,0","50,296272",UNI
35,Natalia Bilińska,PWr Wrocław,"64,80",69,"0,21494",36,42,80,-85,"87,5",50,55,-60,85,-90,"-92,5","227,5","48,897893",UTE
36,Karolina Plewik,KUL Lublin,"64,10",69,"0,21639",37,41,80,-90,-90,"-37,5","37,5","-42,5",85,95,105,"222,5","48,146970",UNI
37,Julianna Grzonka,UMG Gdynia,"68,00",69,"0,20888",19,42,60,"67,5",75,"37,5","42,5",45,85,"92,5",100,"220,0","45,954263",USP
38,Alicja Kosakowska,UŚ Katowice,"65,85",69,"0,21285",10,41,45,55,-65,30,35,"37,5",80,90,100,"192,5","40,972736",UNI
39,Martyna Maciejuk,SWPS Poznań,"65,35",69,"0,21383",64,41,40,50,"-62,5",35,"37,5",-40,60,75,90,"177,5","37,954361",WSN
40,Klaudia Żbikowska,UMK Toruń,"65,85",69,"0,21285",71,41,45,50,-60,25,30,-35,60,70,80,"160,0","34,055261",UNI
,,,,,,,,,,,,,,,,,,,
Kategoria 76  [ pkt.IPF GL],,,,,,,,,,,,,,,,,,,
,,,,,,,,,,,,,,,,,,,
1,Joanna Lewandowska,UJ Kraków,"75,80",76,"0,19740",10,46,165,175,180,"92,5","97,5",100,195,-210,210,"490,0","96,726889",UNI
2,Martyna Piątkowska,AWF Warszawa,"73,20",76,"0,20079",9,46,140,150,-155,65,70,"-72,5",150,"162,5",-175,"382,5","76,803427",UWF
3,Justyna Moczadło,UWM Olsztyn,"75,35",76,"0,19796",38,46,"117,5",125,130,65,"67,5",70,140,150,155,"355,0","70,276412",UNI
4,Katarzyna Nowak,UM Lublin,"75,90",76,"0,19728",20,46,115,120,125,65,70,-75,140,145,150,"345,0","68,061205",UME
5,Julianna Łągiewka,UM Łódź,"74,25",76,"0,19938",48,46,100,"107,5",110,"67,5",70,"72,5",145,155,-160,"337,5","67,289800",UME
6,Amelia Borkowska,UG Gdańsk,"75,10",76,"0,19828",7,46,-105,-110,110,70,75,"-77,5",135,"142,5",150,"335,0","66,422967",UNI
7,Magdalena,PWr Wrocław,"75,40",76,"0,19790",25,46,"107,5","112,5","117,5",55,"57,5",60,145,"152,5","157,5","335,0","66,296156",UTE
,Szymkowiak,,,,,,,,,,,,,,,,,,
8,Iga Dobrowolska,UPWr Wrocław,"74,80",76,"0,19866",36,46,105,115,120,50,55,"57,5",130,140,-150,"317,5","63,074868",USP
9,Julia Dyndesz,PG Gdańsk,"74,90",76,"0,19853",67,46,"112,5","117,5","-122,5","57,5",60,"62,5",-130,130,"-132,5","310,0","61,545111",UTE
10,Martyna Sulima,UPr Lublin,"71,40",76,"0,20338",59,46,110,115,"-117,5","57,5",60,"-62,5",125,"132,5","-137,5","307,5","62,539266",USP
11,Weronika Dudziak,PK Kraków,"73,30",76,"0,20066",39,45,90,95,105,50,"57,5",60,-125,135,"142,5","307,5","61,701587",UTE
12,Martyna Macholak,AWF Katowice,"75,65",76,"0,19759",2,46,"92,5",100,-105,-60,60,-65,135,140,"142,5","302,5","59,770142",UWF
13,Agata Stawiarska,PO Opole,"72,65",76,"0,20156",56,45,-95,100,"107,5",50,"52,5",55,110,120,135,"297,5","59,964590",UTE
,Dominika,,,,,,,,,,,,,,,,,,
14,Dzwonkowska,SGGW Warszawa,"72,55",76,"0,20170",2,45,85,95,"102,5",45,50,"-52,5",115,130,135,"287,5","57,989721",USP
15,Anna Iwan,PL Lublin,"75,05",76,"0,19834",53,45,85,-95,95,45,50,"-52,5",125,135,-140,"280,0","55,535503",UTE
16,Martyna Bagińska,PUM w Szczecinie,"70,90",76,"0,20414",51,46,"97,5",105,110,40,-45,"-47,5",100,110,115,"265,0","54,096071",UME
17,Paulina Priebe,GUMed Gdańsk,"70,15",76,"0,20530",12,45,95,100,-105,"42,5",45,"-47,5",103,110,"117,5","262,5","53,892162",UME
18,Anna Grądalska,PK Kraków,"69,20",76,"0,20684",47,45,-80,80,"87,5",40,-45,-45,110,120,"127,5","255,0","52,744472",UTE
19,Dorota Więch,UG Gdańsk,"69,75",76,"0,20594",57,45,"77,5","87,5","-107,5","47,5","52,5","-57,5",90,100,110,"250,0","51,485668",UNI
20,Paulina Borszowska,ŚUM Katowice,"74,20",76,"0,19944",17,45,95,100,-105,"47,5","-52,5","-52,5",95,"102,5",-110,"250,0","49,860787",UME
21,Natalia Bajor,PK Kraków,"69,80",76,"0,20586",28,45,50,65,"72,5",40,-45,-45,80,90,100,"212,5","43,745702",UTE
,,,,,,,,,,,,,,,,,,,
22,Patrycja Muranowicz,SGH Warszawa,"70,00",76,"0,20554",41,45,30,40,60,"37,5","42,5","47,5",75,90,"102,5","210,0","43,163777",USP
23,Karolina Jaźwińska,PBŚ Bydgoszcz,"73,05",76,"0,20100",43,45,45,50,-60,35,"-37,5","-37,5",75,-85,-85,"160,0","32,160156",UTE
nk,Wiktoria Kołodziejczyk,KUL Lublin,"75,40",76,"0,19790",23,45,75,85,-100,-40,-45,-50,90,100,110,"0,0","0,000000",UNI
,Kategoria 84  [ pkt.IPF GL],,,,,,,,,,,,,,,,,,
1,Agata Latocha,AWF Katowice,"82,45",84,"0,19025",29,47,"127,5",135,140,80,"82,5",85,150,"157,5","162,5","387,5","73,723099",UWF
2,Noemi Nogaczewska,PG Gdańsk,"81,35",84,"0,19130",7,47,125,130,"137,5",80,85,"-87,5",145,"152,5","162,5","385,0","73,652204",UTE
3,Victoria Daniels,AWFiS Gdańsk,"80,75",84,"0,19190",17,47,110,"-117,5","-122,5",55,60,"-62,5",160,170,-180,"340,0","65,245307",UWF
,Karolina Błaszczyk-,,,,,,,,,,,,,,,,,,
4,,UG Gdańsk,"81,20",84,"0,19145",55,47,105,115,120,"42,5","47,5",-50,125,140,-150,"307,5","58,871321",UNI
,Lipska,,,,,,,,,,,,,,,,,,
5,Nina Bornus,UWM Olsztyn,"81,15",84,"0,19150",56,47,85,-95,95,45,"47,5",50,120,135,-150,"280,0","53,620185",UNI
6,Natalia Dulko,UMK Toruń,"81,95",84,"0,19073",16,47,-45,-45,45,30,-35,-35,65,75,-80,"150,0","28,608781",UNI
,Kategoria 84+  [ pkt.IPF GL],,,,,,,,,,,,,,,,,,
1,Kinga Świderska,UAM Poznań,"125,20",84+,"0,17027",21,47,150,160,165,80,85,-90,155,160,165,"415,0","70,661063",UNI
2,Agata Kaliciak,WAT Warszawa,"92,45",84+,"0,18252",52,47,130,140,145,"87,5","-92,5","-92,5",130,140,-150,"372,5","67,990346",USP
3,Martyna Król,UMG Gdynia,"93,40",84+,"0,18193",57,47,100,"107,5",115,-40,-40,40,120,130,140,"295,0","53,670084",USP
4,mgr Joanna Piotrowska,UMG Gdynia,"87,35",84+,"0,18609",25,47,70,75,80,35,"37,5",40,95,105,115,"235,0","43,731673",USP
5,Aleksandra Geppert,UE Katowice,"88,15",84+,"0,18549",44,47,-70,-70,70,40,"42,5",45,110,115,120,"235,0","43,589108",USP
6,Aleksandra,UMK Toruń,"98,50",84+,"0,17909",47,47,-70,-70,70,30,35,40,90,100,110,"220,0","39,399021",UNI
,Zawistowska,,,,,,,,,,,,,,,,,,
,,,,,,,,,,,,,,,,,,,
KLASYFIKACJA DRUŻYNOWA KOBIET,,,,,,,,,,,,,,,,,,,
,,,,,,,,,,,,,,,,,,,
Typ,,,,,,,,,,,,,,,,,,,
,Uczelnia,uczelni,PKT IPF GL,,,,,,,,,,,,,,,,
1,UJ Kraków,UNI,"261,216317","96,72688947","85,8949766","78,59445106",,,,,,,,,,,,,
2,UR Rzeszów,UNI,"249,434553","92,14570286","88,194498","69,09435233",,,,,,,,,,,,,
3,PG Gdańsk,UTE,"246,312549","92,44680181","79,6364371","74,2293105",,,,,,,,,,,,,
4,AWF w Krakowie,UWF,"218,650895","80,77106092","72,4414122","65,43842222",,,,,,,,,,,,,
5,UM Łódź,UME,"218,240342","80,91122474","70,0393179","67,28979951",,,,,,,,,,,,,
6,UG Gdańsk,UNI,"213,136761","77,80892212","68,3507284","66,97711008",,,,,,,,,,,,,
7,GUMed Gdańsk,UME,"212,630853","71,72353014","71,684295","69,22302761",,,,,,,,,,,,,
8,UW Warszawa,UNI,"210,396413","73,76849068","69,5186637","67,10925828",,,,,,,,,,,,,
9,AWF Katowice,UWF,"208,222566","74,72932443","73,7230994","59,77014234",,,,,,,,,,,,,
10,UWM Olsztyn,UNI,"197,295129","73,39853188","70,276412","53,62018479",,,,,,,,,,,,,
11,WAT Warszawa,USP,"195,765296","69,05412894","67,9903461","58,72082112",,,,,,,,,,,,,
12,PO Opole,UTE,"195,654457","70,41874067","65,2711264","59,96458969",,,,,,,,,,,,,
13,AWFiS Gdańsk,UWF,"193,998395","71,05171992","65,2453074","57,70136748",,,,,,,,,,,,,
14,UPWr Wrocław,USP,"193,237059","74,60371824","63,0748678","55,5584727",,,,,,,,,,,,,
15,AGH Kraków,UTE,"192,955427","85,59739644","54,0492043","53,30882654",,,,,,,,,,,,,
,,,,,,,,,,,,,,,,,,,
16,PWr Wrocław,UTE,"192,803905","66,29615639","65,9359961","60,57175259",,,,,,,,,,,,,
17,UO Opole,UNI,"191,861925","80,41303888","60,1803966","51,26848944",,,,,,,,,,,,,
18,UMCS Lublin,UNI,"189,318758","71,13979128","68,1638294","50,01513686",,,,,,,,,,,,,
19,UM Lublin,UME,"188,716188","68,06120539","64,6378644","56,01711843",,,,,,,,,,,,,
20,UPr Lublin,USP,"183,561333","62,53926597","62,1598874","58,86217972",,,,,,,,,,,,,
21,PK Kraków,UTE,"183,089698","68,64363873","61,7015872","52,74447175",,,,,,,,,,,,,
22,PP Poznań,UTE,"174,530059","67,90908419","53,759515","52,86145946",,,,,,,,,,,,,
23,ŚUM Katowice,UME,"163,179730","56,8786144","56,4403286","49,86078682",,,,,,,,,,,,,
24,SGH Warszawa,USP,"155,192632","57,95023885","54,0786162","43,16377709",,,,,,,,,,,,,
25,UMG Gdynia,USP,"143,356019","53,67008369","45,9542627","43,73167287",,,,,,,,,,,,,
26,AWF Warszawa,UWF,"143,005055","76,8034266","66,2016287",,,,,,,,,,,,,,
27,PBŚ Bydgoszcz,UTE,"142,097596","57,32809465","52,6093457","32,16015576",,,,,,,,,,,,,
28,UŚ Katowice,UNI,"138,891378","56,20073291","41,7179094","40,97273617",,,,,,,,,,,,,
29,UPP Poznań,USP,"136,970554","62,0884125","40,8129903","34,06915085",,,,,,,,,,,,,
30,SGGW Warszawa,USP,"128,220135","70,23041362","57,9897215",,,,,,,,,,,,,,
31,US Szczecin,UNI,"124,008030","62,78652604","61,2215038",,,,,,,,,,,,,,
32,UAM Poznań,UNI,"120,957335","70,6610628","50,2962718",,,,,,,,,,,,,,
33,UMK Toruń,UNI,"114,375385","40,92110309","39,3990207","34,05526123",,,,,,,,,,,,,
34,PŚ Gliwice,UTE,"112,302289","61,47678816","50,8255011",,,,,,,,,,,,,,
35,KUL Lublin,UNI,"105,958697","57,81172617","48,1469705",,,,,,,,,,,,,,
36,UE Katowice,USP,"70,175169","43,58910824","26,5860606",,,,,,,,,,,,,,
,,,,,,,,,,,,,,,,,,,
,,,,,,,,,,,,,,,,,,,
KOMUNIKAT KOŃCOWY,,,,,,,,,,,,,,,,,,,
AKADEMICKIE MISTRZOSTWA POLSKI W TRÓJBOJU SIŁOWYM KLASYCZNYM,,,,,,,,,,,,,,,,,,,
"KATOWICE, 05-07.05.2023",,,,,,,,,,,,,,,,,,,
,,,,,,,,,,,,,,,,,,,
WYNIKI MĘŻCZYZN,,,,,,,,,,,,,,,,,,,
,,,,,,,,,,,,,,,,,,,
ORGANIZATOR:,,,,,,,,,,,,,,,,,,,
AZS Uniwersytetu Śląskiego,,,,,,,,,,,,,,,,,,,
"ul. Bankowa 12, 40-007 Katowice",,,,,,,,,,,,,,,,,,,
tel. 509-407-288,,,,,,,,,,,,,,,,,,,
https://azsus.pl/amp-trojboj-silowy-2023,,,,,,,,,,,,,,,,,,,
https://www.facebook.com/amp.trojboj.silowy,,,,,,,,,,,,,,,,,,,
,,,,,,,,,,,,,,,,,,,
KLASYFIKACJA INDYWIDUALNA MĘŻCZYZN,,,,,,,,,,,,,,,,,,,
,,,,,,,,,,,,,,,,,,,
,,,,,,,,,Przysiady,,,Wyciskanie leżąc,,,Martwy ciąg,,,,
,Nazwisko i imię,Uczelnia,,,,,,,,,,,,,,,Wynik,Punkty IPF,Typ
,,,,,,,,1,2,3,1,2,3,1,2,3,,,uczelni
,Kategoria 59  [ pkt.IPF GL],,,,,,,,,,,,,,,,,,
1,Patryk Ciesielski,UWM Olsztyn,"57,00",59,"0,16856",60,1,125,135,-140,"87,5",95,-100,165,180,"192,5","422,5","71,216846",UNI
2,Kornel Zych,AWFiS Gdańsk,"58,40",59,"0,16638",18,1,125,130,135,"102,5","107,5","112,5",160,"167,5",175,"422,5","70,296210",UWF
3,Paweł Kaźmierski,PG Gdańsk,"58,50",59,"0,16623",36,1,110,120,125,80,85,"-87,5",160,"172,5",180,"390,0","64,829360",UTE
4,Dawid Leśniak,PO Opole,"58,10",59,"0,16684",16,1,135,-140,-140,85,-90,90,150,155,-160,"380,0","63,399730",UTE
5,Jakub Sikora,PK Kraków,"58,00",59,"0,16700",48,1,125,"132,5",-140,-75,75,-80,160,170,-180,"377,5","63,040809",UTE
6,Mateusz Kaczmarski,PŁ Łódź,"57,75",59,"0,16738",11,1,115,"122,5",130,"72,5","77,5",80,135,145,155,"365,0","61,094690",UTE
7,Modest Ivashchenko,PL Lublin,"58,15",59,"0,16676",31,1,130,140,-150,65,70,-75,140,150,-160,"360,0","60,035217",UTE
8,Radosław,UWM Olsztyn,"58,20",59,"0,16669",4,1,110,-120,120,"72,5","77,5","-82,5",140,-150,-150,"337,5","56,257097",UNI
,Kwiatkowski,,,,,,,,,,,,,,,,,,
9,Jakub Czyżycki,UŚ Katowice,"57,75",59,"0,16738",1,1,95,100,"-107,5",75,-80,-80,120,"122,5",125,"300,0","50,214814",UNI
10,Igor Głogowski,UJ Kraków,"56,30",59,"0,16968",24,1,60,70,80,50,"-57,5","62,5",100,115,125,"267,5","45,390069",UNI
11,Igor Bezak,ANS Tarnów,"58,40",59,"0,16638",2,1,80,-100,-115,40,50,-60,80,100,-120,"230,0","38,267759",USP
,Kategoria 66  [ pkt.IPF GL],,,,,,,,,,,,,,,,,,
1,Michał Jasak,SGH Warszawa,"65,65",66,"0,15632",1,3,"177,5",185,"192,5","127,5","132,5",135,235,245,250,"577,5","90,276778",USP
2,Przemysław Stec,PK Kraków,"64,55",66,"0,15773",38,3,170,180,-190,120,-130,130,240,-255,"257,5","567,5","89,511479",UTE
3,Michał Leończyk,WAT Warszawa,"64,60",66,"0,15766",9,3,165,175,0,110,115,"117,5",190,200,205,"497,5","78,438191",USP
4,Filip Gołębiowski,KUL Lublin,"65,30",66,"0,15677",46,3,170,-180,-180,100,-105,105,205,215,-225,"490,0","76,815604",UNI
,,,,,,,,,,,,,,,,,,,
5,Jakub Knobloch,ŚUM Katowice,"65,15",66,"0,15696",25,3,165,175,-180,100,105,"107,5",185,195,-200,"477,5","74,947281",UME
6,Filip Kania,ANS Tarnów,"63,95",66,"0,15851",32,3,-170,-170,170,90,-100,-100,-200,200,215,"475,0","75,293803",USP
7,Tomasz Nieradzik,UŚ Katowice,"64,95",66,"0,15721",14,2,150,160,170,95,100,-105,160,170,180,"450,0","70,746127",UNI
8,Maciej Martenka,PBŚ Bydgoszcz,"64,00",66,"0,15845",2,3,135,145,-150,105,"112,5",-115,180,-185,-185,"437,5","69,320777",UTE
9,Maciej Nowak,AGH Kraków,"64,10",66,"0,15832",47,3,140,"152,5","-162,5",90,"97,5",-105,-175,175,"187,5","437,5","69,263331",UTE
10,Damian Oracz,PŁ Łódź,"63,85",66,"0,15865",13,2,140,150,155,95,100,-105,170,180,-190,"435,0","69,010611",UTE
11,Dominik Kamecki,AWF Wrocław,"65,90",66,"0,15601",12,3,145,155,-160,"102,5",110,-115,170,-185,-185,"435,0","67,864051",UWF
12,Shamte Ndiaye,AGH Kraków,"64,50",66,"0,15779",10,3,125,140,150,80,90,-100,170,180,"182,5","422,5","66,668106",UTE
13,Szymon Kwiecień,UJK Kielce,"64,90",66,"0,15728",49,3,150,"157,5","-162,5",100,-105,-105,155,"162,5",165,"422,5","66,449875",UNI
14,Łukasz Janik,UŁ Łódź,"64,30",66,"0,15805",36,2,-140,140,150,"87,5","-97,5","-97,5",165,175,180,"417,5","65,987790",UNI
15,Paweł Bożek,UW Warszawa,"65,20",66,"0,15689",54,3,"127,5",135,140,"87,5","92,5","97,5",160,175,180,"417,5","65,503190",UNI
16,Karol Smutek,UPr Lublin,"65,60",66,"0,15639",28,2,125,135,-145,85,90,"-92,5",180,"192,5",-200,"417,5","65,291358",USP
17,Bartłomiej Tempka,AGH Kraków,"64,75",66,"0,15747",2,3,140,150,-155,105,-115,-115,-160,160,-170,"415,0","65,350418",UTE
18,Hubert Kamiński,ANS Tarnów,"63,70",66,"0,15884",62,2,125,130,"-132,5",80,"-82,5","-82,5",175,-180,"-182,5","385,0","61,154726",USP
19,Karol Cioć,PŚk Kielce,"64,60",66,"0,15766",56,2,105,-115,120,"97,5",-105,-105,155,165,-175,"382,5","60,306750",UTE
20,Oskar Paprota,UMCS Lublin,"64,65",66,"0,15760",38,2,100,-110,110,80,85,-90,-100,-120,120,"315,0","49,644005",UNI
21,IHOR KOVALCHUK,KUL Lublin,"64,85",66,"0,15734",45,2,-95,105,-110,70,75,80,110,120,130,"315,0","49,562757",UNI
22,Kacper Skotnicki,UJ Kraków,"63,80",66,"0,15871",6,2,80,90,100,65,75,80,110,125,-140,"305,0","48,406891",UNI
23,Aleksander Tokarek,ANS Konin,"65,45",66,"0,15658",42,2,65,75,95,60,70,-75,100,120,135,"300,0","46,972845",USP
24,Wiktor Pajączkowski,UO Opole,"62,15",66,"0,16094",26,2,60,75,"82,5",60,"72,5",-80,75,85,"92,5","247,5","39,832447",UNI
,,,,,,,,,,,,,,,,,,,
Kategoria 74  [ pkt.IPF GL],,,,,,,,,,,,,,,,,,,
,,,,,,,,,,,,,,,,,,,
1,Kamil Linstedt,PG Gdańsk,"73,20",74,"0,14764",42,8,230,240,250,"122,5","127,5",-130,255,265,270,"647,5","95,597607",UTE
2,Piotr Burzawa,UJK Kielce,"73,40",74,"0,14743",2,8,190,200,"207,5",130,140,-145,220,230,235,"582,5","85,879038",UNI
3,Bartosz Kucharczyk,UJK Kielce,"71,80",74,"0,14913",35,8,190,200,210,125,130,135,-220,220,235,"580,0","86,497625",UNI
4,Igor Tomasik,PK Kraków,"73,40",74,"0,14743",63,8,-180,180,195,135,145,150,220,"227,5",-235,"572,5","84,404720",UTE
5,Błażej Tkacz,UJK Kielce,"73,20",74,"0,14764",30,8,185,195,200,"112,5","117,5","-122,5",210,225,"-227,5","542,5","80,095292",UNI
6,Dominik Nowogórski,UJ Kraków,"74,00",74,"0,14681",52,5,185,-195,195,120,"122,5",125,205,215,"222,5","542,5","79,644346",UNI
7,Jan Kazak,PK Kraków,"73,40",74,"0,14743",37,8,210,-220,-220,110,"117,5",-120,205,"-212,5","212,5","540,0","79,613186",UTE
8,Mariusz Jaroszek,UPr Lublin,"73,80",74,"0,14702",12,8,180,190,200,105,110,-115,215,-230,230,"540,0","79,388755",USP
9,Szymon Miśkowiec,ANS Nowy Sącz,"72,80",74,"0,14806",14,7,160,170,175,"112,5",-118,"117,5",220,230,"237,5","530,0","78,473167",USP
10,Wiktor Borysiewicz,UW Warszawa,"73,30",74,"0,14754",75,8,180,190,195,"102,5","107,5",110,210,"222,5",-230,"527,5","77,825417",UNI
11,Łukasz Darczuk,PL Lublin,"73,20",74,"0,14764",5,7,"177,5",185,-190,-130,130,"-132,5",195,205,210,"525,0","77,511573",UTE
12,Bartłomiej Pomietło,AGH Kraków,"72,50",74,"0,14838",62,7,165,175,180,110,"117,5",-125,210,"217,5","-222,5","515,0","76,416372",UTE
13,Maciej Mitek,ANS Tarnów,"72,80",74,"0,14806",20,6,"167,5",175,-180,"117,5",125,-130,"202,5",210,215,"515,0","76,252228",USP
14,Patryk Kuczek,PRz Rzeszów,"72,40",74,"0,14849",48,6,"162,5",170,175,115,120,-125,200,210,215,"510,0","75,728905",UTE
15,Antoni Winiarek,WAT Warszawa,"73,00",74,"0,14785",13,7,165,"177,5",-185,115,-120,120,200,210,-220,"507,5","75,034555",USP
16,Kacper Bożek,AGH Kraków,"73,10",74,"0,14775",38,7,165,"-172,5","172,5",105,110,"-112,5",210,"217,5",225,"507,5","74,981142",UTE
17,Tomasz Fedoniuk,UPr Lublin,"73,90",74,"0,14691",6,7,"172,5","182,5",190,110,-115,"-117,5",175,195,"207,5","507,5","74,558304",USP
18,Szymon Borowicz,PRz Rzeszów,"71,20",74,"0,14979",16,6,155,165,-170,95,100,"102,5",-220,220,"232,5","500,0","74,894447",UTE
19,Dawid Pesta,UMG Gdynia,"73,50",74,"0,14733",25,5,170,180,"-187,5",-110,-115,115,180,195,205,"500,0","73,663779",USP
20,Mikołaj Jęsiak,AWFiS Gdańsk,"73,50",74,"0,14733",11,6,"167,5",175,"182,5","97,5","102,5",105,195,205,"212,5","500,0","73,663779",UWF
21,Jakub Jaśków,PWr Wrocław,"72,90",74,"0,14796",10,8,-185,-185,185,-100,100,105,190,205,-210,"495,0","73,238634",UTE
,,,,,,,,,,,,,,,,,,,
22,Oskar Swat,UŁ Łódź,"73,00",74,"0,14785",42,7,160,"172,5",-180,105,110,"112,5",190,200,205,"490,0","72,447157",UNI
23,Bartosz Pryka,UE Wrocław,"73,00",74,"0,14785",28,4,150,160,-170,125,-130,-130,175,185,"192,5","477,5","70,599015",USP
24,Patryk Dukalski,UJK Kielce,"72,50",74,"0,14838",26,7,145,-160,160,-105,110,-115,-190,190,205,"475,0","70,481120",UNI
25,Jakub Kopczyński,UE Katowice,"72,60",74,"0,14827",56,7,150,160,-165,125,-130,-130,180,-190,-190,"465,0","68,947788",USP
26,Piotr Jaworski,UAM Poznań,"73,40",74,"0,14743",74,6,155,165,"172,5","92,5","97,5",-100,"182,5",195,"-202,5","465,0","68,555799",UNI
27,Kamil Kochanowicz,UM Łódź,"73,50",74,"0,14733",31,6,130,140,150,110,120,125,170,180,190,"465,0","68,507315",UME
28,Kacper Wach,UWM Olsztyn,"72,50",74,"0,14838",36,6,160,165,-170,110,115,-120,-175,175,-190,"455,0","67,513494",UNI
29,Jakub Wierzchowski,UEK Kraków,"73,10",74,"0,14775",24,6,140,150,-160,110,115,"-117,5",-160,165,180,"445,0","65,747011",USP
30,Jakub Mazur,PRz Rzeszów,"73,30",74,"0,14754",44,6,"142,5",150,160,-90,90,-100,180,-195,195,"445,0","65,653670",UTE
31,Gabriel Dobromilski,PW Warszawa,"73,70",74,"0,14712",60,6,145,150,155,95,100,"-102,5",180,190,-195,"445,0","65,468290",UTE
32,Dominik Mały,WAT Warszawa,"72,30",74,"0,14860",54,8,180,-195,-195,110,-120,-120,150,0,0,"440,0","65,381819",USP
33,Daniel Foks,PŚ Gliwice,"73,30",74,"0,14754",4,5,155,"162,5",-165,110,-115,"-117,5",160,165,-170,"437,5","64,547147",UTE
34,Mateusz Urban,UG Gdańsk,"73,60",74,"0,14722",18,6,120,-140,"142,5",110,-115,-115,180,-200,-200,"432,5","63,674179",UNI
35,Jakub Wełniński,PP Poznań,"70,90",74,"0,15012",57,4,140,150,-160,"107,5","112,5",115,150,160,-170,"425,0","63,800981",UTE
36,Artur Faltyński,PP Poznań,"73,00",74,"0,14785",34,4,140,150,-160,100,-105,-105,170,-180,-180,"420,0","62,097563",UTE
37,Alexander Baldauf,UMG Gdynia,"67,20",74,"0,15441",9,5,130,140,145,95,100,"102,5",160,170,-180,"417,5","64,465096",USP
38,Marcin Lata,UŚ Katowice,"66,70",74,"0,15502",46,4,140,145,-150,90,100,"-102,5",160,"167,5","-172,5","412,5","63,944660",UNI
39,Bartosz Michalik,PM Szczecin,"72,60",74,"0,14827",42,5,120,130,"137,5",95,100,105,150,160,170,"412,5","61,163360",USP
40,Mateusz Wicki,UMG Gdynia,"71,00",74,"0,15001",13,5,125,"132,5",140,100,"107,5","-112,5",140,155,"162,5","410,0","61,503828",USP
41,Sebastian Boratyn,SGGW Warszawa,"73,60",74,"0,14722",7,5,120,125,-135,-80,"-82,5","82,5",170,185,-190,"392,5","57,785237",USP
42,Szymon Więcławski,UWM Olsztyn,"72,70",74,"0,14817",54,5,125,-135,-135,"-92,5","-92,5","92,5",140,"147,5",-155,"365,0","54,081528",UNI
43,Kamil Piotrowski,UR Rzeszów,"71,20",74,"0,14979",27,5,100,110,-120,70,75,-80,130,150,160,"345,0","51,677168",UNI
,,,,,,,,,,,,,,,,,,,
44,Gabriel Rychlewski,PBŚ Bydgoszcz,"70,60",74,"0,15045",59,4,110,"117,5",120,"82,5",85,-90,120,130,"-137,5","335,0","50,401892",UTE
45,Michał Czujkiewicz,SGGW Warszawa,"72,40",74,"0,14849",41,5,115,125,-135,80,-85,-85,110,120,130,"335,0","49,743496",USP
46,Wojciech Bielak,SGGW Warszawa,"70,80",74,"0,15023",21,4,-110,-110,110,95,-100,-100,110,"117,5",125,"330,0","49,576177",USP
47,Kamil Turczynowski,ŚUM Katowice,"72,50",74,"0,14838",11,4,80,90,"97,5",-65,65,75,100,130,140,"312,5","46,369158",UME
48,Mikołaj Różycki,UJ Kraków,"66,50",74,"0,15526",49,4,75,-90,90,55,70,-75,100,110,130,"290,0","45,026409",UNI
49,mgr Arkadiusz Suska,GUMed Gdańsk,"72,60",74,"0,14827",23,4,70,80,85,60,65,"67,5",95,100,"107,5","260,0","38,551451",UME
50,Piotr Depka,UMK Toruń,"66,00",74,"0,15588",33,4,60,70,-85,50,-60,-60,80,90,100,"220,0","34,294529",UNI
nk,Piotr Litwiński,UG Gdańsk,"73,20",74,"0,14764",28,5,140,150,-155,"-117,5",-118,"-117,5",-180,180,-185,"0,0","0,000000",UNI
nk,Adam Kłak,PO Opole,"72,90",74,"0,14796",20,6,"-132,5","-132,5","132,5",-95,-95,-95,0,0,0,"0,0","0,000000",UTE
nk,Michał Koziar,UMCS Lublin,"73,70",74,"0,14712",45,7,160,170,-175,-130,-130,-130,-190,-190,200,"0,0","0,000000",UNI
nk,Bartosz Świstak,AWF Warszawa,"72,60",74,"0,14827",17,8,-200,-200,-200,-115,-115,-115,0,0,0,"0,0","0,000000",UWF
,Kategoria 83  [ pkt.IPF GL],,,,,,,,,,,,,,,,,,
1,Marek Kawczyk,UE Katowice,"81,63",83,"0,13960",51,17,220,230,-235,160,165,"-167,5",240,250,255,"650,0","90,738564",USP
2,Kamil Światły,UAM Poznań,"80,30",83,"0,14077",31,17,"217,5",225,"232,5","137,5","142,5",145,240,250,255,"632,5","89,036079",UNI
3,Karol Budziwół,UR Rzeszów,"82,70",83,"0,13868",34,17,215,225,230,150,155,-160,240,245,-250,"630,0","87,368470",UNI
4,Zhipeng Tan,UAM Poznań,"79,92",83,"0,14111",35,17,215,"227,5",235,115,"122,5","-127,5",235,250,"262,5","620,0","87,487758",UNI
5,Daniel Przybysz,PG Gdańsk,"81,83",83,"0,13942",20,17,225,235,-240,"127,5",135,-140,230,240,"-247,5","610,0","85,049036",UTE
6,Maciej Preinl,UJ CM Kraków,"82,10",83,"0,13919",17,10,205,215,"222,5",135,140,"-142,5",235,"247,5",-260,"610,0","84,907176",UME
7,Ignacy Banaszek,UŁ Łódź,"79,95",83,"0,14108",33,17,-200,210,225,120,"127,5",-130,235,250,255,"607,5","85,707485",UNI
,Przemysław,,,,,,,,,,,,,,,,,,
8,MIlczarczyk,WAT Warszawa,"81,09",83,"0,14007",11,17,210,220,"-222,5",150,-158,-160,235,-250,-250,"605,0","84,741767",USP
9,Piotr Marcisz,AWF Katowice,"79,23",83,"0,14174",8,16,195,"202,5",210,120,-125,-125,260,"272,5",-286,"602,5","85,395581",UWF
10,Paweł Drzyzga,PK Kraków,"82,50",83,"0,13885",12,17,195,"207,5","217,5",125,-133,"-132,5",250,260,-270,"602,5","83,657148",UTE
,,,,,,,,,,,,,,,,,,,
11,Sebastian Komorek,UWM Olsztyn,"80,52",83,"0,14057",4,17,200,215,225,110,120,-125,235,-250,255,"600,0","84,343502",UNI
12,Dawid Kuczkowski,UR Rzeszów,"82,50",83,"0,13885",36,17,215,-230,-230,-120,125,-130,245,255,-260,"595,0","82,615773",UNI
13,Jakub Jamroz,AGH Kraków,"81,49",83,"0,13972",27,16,190,200,-205,-120,130,-135,250,260,-270,"590,0","82,434467",UTE
14,Konrad Mrozowski,PŁ Łódź,"80,74",83,"0,14038",1,17,205,215,-220,135,-140,0,235,-245,-245,"585,0","82,120803",UTE
15,Mateusz Tchorek,ANS Piła,"82,39",83,"0,13894",22,16,200,215,-230,145,150,-155,185,"197,5",215,"580,0","80,587410",USP
16,Piotr Szewczyk,UPr Lublin,"82,95",83,"0,13847",18,16,190,-200,200,"142,5",150,"152,5",215,"227,5","-232,5","580,0","80,311860",USP
17,Krzysztof Kolber,PUM w Szczecinie,"81,30",83,"0,13989",48,15,185,"192,5",200,"122,5",130,0,235,"247,5",-255,"577,5","80,783656",UME
18,Kacper Chmura,PRz Rzeszów,"80,80",83,"0,14032",70,16,200,-210,210,"127,5",-135,135,-225,225,230,"575,0","80,686532",UTE
19,Mariusz Stachowiak,AMW Gdynia,"82,80",83,"0,13860",52,10,180,"192,5",-200,100,125,140,215,230,"242,5","575,0","79,692367",USP
20,Szymon Karpiński,ZUT Szczecin,"79,70",83,"0,14131",71,15,185,200,"207,5","122,5",125,130,225,-235,-235,"562,5","79,485686",UTE
21,Mateusz Okuła,PB Białystok,"81,30",83,"0,13989",1,9,200,210,-220,120,-130,"132,5",-220,220,-240,"562,5","78,685379",UTE
22,Dominik Pierzchała,UEK Kraków,"81,30",83,"0,13989",44,16,190,200,210,110,120,"-122,5",210,220,230,"560,0","78,335666",USP
23,Konrad Piwcewicz,PG Gdańsk,"81,87",83,"0,13939",16,16,190,200,205,115,-123,"-122,5",230,240,-245,"560,0","78,058462",UTE
24,Patryk Jabłoński,PL Lublin,"82,10",83,"0,13919",5,14,175,185,200,115,"122,5","-127,5",210,220,"232,5","555,0","77,251611",UTE
25,Wojciech Łukasik,UJ Kraków,"82,25",83,"0,13906",23,17,"182,5","-192,5","-192,5",115,-120,120,240,"252,5",-260,"555,0","77,180230",UNI
26,Jakub Mońka,AWF w Krakowie,"81,20",83,"0,13997",26,16,185,195,-200,"132,5","137,5",-140,190,205,220,"552,5","77,334858",UWF
27,Karol Kozub,UwB Białystok,"80,00",83,"0,14104",30,10,190,200,-210,-110,110,-115,200,220,240,"550,0","77,570519",UNI
28,Szymon Rogoziński,AWF Katowice,"80,80",83,"0,14032",10,15,180,190,-205,140,-145,-145,220,-230,0,"550,0","77,178422",UWF
29,Kamil Dworaczek,PŚ Gliwice,"81,60",83,"0,13962",9,15,185,"192,5",200,110,"117,5",120,"-227,5","227,5",-240,"547,5","76,444045",UTE
30,Błażej Guzikowski,UJK Kielce,"81,70",83,"0,13954",111,15,180,190,-200,125,130,"132,5",210,225,-230,"547,5","76,396566",UNI
31,Michał Gwoździk,UE Katowice,"81,73",83,"0,13951",69,16,200,210,215,110,"117,5","122,5",-210,210,"-242,5","547,5","76,382342",USP
32,Michał Mazurek,UM Lublin,"80,64",83,"0,14047",3,16,190,200,"-207,5",-115,115,-125,225,-230,-230,"540,0","75,851634",UME
,,,,,,,,,,,,,,,,,,,
33,Dawid Szałas,UJK Kielce,"81,28",83,"0,13990",7,16,"187,5",-195,195,-120,120,125,220,-230,-230,"540,0","75,547403",UNI
34,Patryk Miszke,PG Gdańsk,"81,30",83,"0,13989",60,15,-180,185,195,130,-138,-140,200,210,215,"540,0","75,537964",UTE
35,Konrad Motyl,AWF w Krakowie,"79,50",83,"0,14149",36,15,-175,175,"187,5",125,-133,"-132,5",215,225,"-237,5","537,5","76,050481",UWF
,Mateusz,,,,,,,,,,,,,,,,,,
36,Stermolewski,WSB Poznań,"81,70",83,"0,13954",28,13,190,200,"207,5",110,-115,115,-205,205,215,"537,5","75,001195",WSN
37,Jakub Kopońka,KAAFM Kraków,"80,20",83,"0,14086",34,9,-175,180,200,115,120,"-122,5",210,215,-225,"535,0","75,358981",WSN
38,Mateusz Scharmach,UW Warszawa,"82,25",83,"0,13906",24,16,165,175,185,115,120,-125,215,"222,5",230,"535,0","74,398960",UNI
39,Marcin Orzechowski,UMG Gdynia,"82,95",83,"0,13847",31,13,180,190,200,115,"122,5",130,190,205,-215,"535,0","74,080768",USP
40,Klaudiusz Kwaśnik,SGH Warszawa,"80,50",83,"0,14059",64,15,-185,-195,200,"117,5",125,-130,185,195,205,"530,0","74,512849",USP
41,Michał Chrzanowski,UR Rzeszów,"82,10",83,"0,13919",63,15,180,190,195,120,125,130,190,205,-215,"530,0","73,771809",UNI
42,Daniel Cisowski,PŚk Kielce,"79,70",83,"0,14131",24,9,170,"182,5",195,110,"117,5","-122,5",195,"212,5",-220,"525,0","74,186640",UTE
43,Patryk Kolan,SGH Warszawa,"81,70",83,"0,13954",51,14,150,165,175,130,140,-150,180,190,210,"525,0","73,256981",USP
44,Kacper Madoń,UJ CM Kraków,"81,20",83,"0,13997",32,10,160,170,180,100,110,120,190,205,220,"520,0","72,785749",UME
45,Wojciech Zawadzki,UM Łódź,"81,30",83,"0,13989",37,15,190,200,-205,105,-110,-110,215,-225,-225,"520,0","72,740261",UME
46,Filip Szemraj,PŚk Kielce,"80,60",83,"0,14050",38,9,175,185,-190,110,-118,"117,5",-215,215,-220,"517,5","72,709507",UTE
47,Dawid Gajowiak,PL Lublin,"80,70",83,"0,14041",57,15,170,180,-190,115,125,-130,190,210,-225,"515,0","72,312611",UTE
48,Arkadiusz Rutka,CW Legnica,"81,70",83,"0,13954",9,9,160,170,180,125,-130,130,180,195,205,"515,0","71,861610",USP
49,Jakub Lewandowski,PO Opole,"81,60",83,"0,13962",18,14,160,170,"177,5",115,120,125,200,210,-220,"512,5","71,557211",UTE
50,Maks Betlejewski,PG Gdańsk,"82,30",83,"0,13902",16,14,165,175,"-182,5","102,5","107,5","112,5",215,225,-235,"512,5","71,248107",UTE
51,Bartosz Wachowski,PŚ Gliwice,"80,20",83,"0,14086",72,14,170,-180,180,120,130,-140,-175,180,200,"510,0","71,837534",UTE
52,Paweł Koralewicz,PK Koszalin,"81,60",83,"0,13962",5,15,180,190,-200,-110,110,"-117,5",210,-225,-225,"510,0","71,208152",UTE
53,Wojciech Kuczyński,AWP Lublin,"80,90",83,"0,14024",80,14,150,165,"177,5",110,"112,5",125,190,205,-225,"507,5","71,169853",USP
54,Mikołaj Ryk,UJ CM Kraków,"79,20",83,"0,14176",25,10,165,175,190,95,105,-110,180,195,210,"505,0","71,590236",UME
,,,,,,,,,,,,,,,,,,,
55,Konrad Kabata,PŚk Kielce,"81,70",83,"0,13954",50,10,-175,175,185,120,125,"-127,5",170,180,190,"500,0","69,768553",UTE
56,Oskar Szczerbowski,AWFiS Gdańsk,"81,20",83,"0,13997",50,15,175,180,-185,110,"117,5",-120,200,-210,-210,"497,5","69,636365",UWF
57,Piotr Zybała,UMG Gdynia,"78,50",83,"0,14241",30,12,150,160,165,115,120,-125,185,195,210,"495,0","70,492110",USP
58,Elias Doulan,UEK Kraków,"81,80",83,"0,13945",7,13,160,170,175,110,-120,-120,200,210,"-212,5","495,0","69,028034",USP
59,Krzysztof Żurakowski,AWF Wrocław,"81,80",83,"0,13945",37,15,160,175,185,105,110,-115,170,185,200,"495,0","69,028034",UWF
60,Kamil Łoziński,KAAFM Kraków,"81,90",83,"0,13936",78,9,160,-170,"172,5",110,115,"-117,5",205,-215,"-217,5","492,5","68,636882",WSN
61,Karol Demel,ŚUM Katowice,"82,00",83,"0,13928",40,14,"162,5","-172,5","172,5","-112,5","112,5","117,5","192,5","202,5",-210,"492,5","68,594448",UME
62,Dominik Tumidajski,AG Katowice,"79,20",83,"0,14176",79,14,165,175,180,105,110,-115,190,200,-210,"490,0","69,463794",WSN
63,Maciej Krzemiński,ŚUM Katowice,"81,50",83,"0,13971",5,14,170,180,190,"102,5",-108,"-107,5","187,5","197,5",-200,"490,0","68,458260",UME
64,Jakub Rup,KUL Lublin,"79,80",83,"0,14122",28,9,165,-180,-180,-110,115,120,185,-200,200,"485,0","68,490485",UNI
65,Mateusz Sobiech,SGGW Warszawa,"80,95",83,"0,14019",44,13,170,180,-190,100,105,"-107,5",180,190,200,"485,0","67,993176",USP
66,Kacper Mikółka,ŚUM Katowice,"75,85",83,"0,14495",61,13,150,"162,5","172,5",105,115,-120,175,185,"-187,5","472,5","68,486789",UME
67,Maciej Różański,UMK Toruń,"77,00",83,"0,14383",22,14,130,150,-160,100,"107,5","112,5",190,210,-220,"472,5","67,957716",UNI
68,Mateusz Pisarek,UŚ Katowice,"81,00",83,"0,14015",21,10,160,"172,5","182,5",105,110,"-112,5",170,180,"-187,5","472,5","66,219985",UNI
69,Piotr Strenkowski,UWM Olsztyn,"82,70",83,"0,13868",61,14,"147,5","157,5","162,5",125,130,135,175,-185,-185,"472,5","65,526353",UNI
70,Paweł Zabrocki,UŁ Łódź,"80,35",83,"0,14072",9,13,145,155,-165,130,135,-140,180,"-187,5","-187,5","470,0","66,140222",UNI
71,Antoni Hajdas,ŚUM Katowice,"80,40",83,"0,14068",13,13,-165,"172,5","-177,5",100,105,"107,5",165,180,190,"470,0","66,119269",UME
72,Mikołaj Klim,PBŚ Bydgoszcz,"81,60",83,"0,13962",14,12,145,155,165,90,-105,105,160,180,200,"470,0","65,623199",UTE
73,Mateusz Krupa,PP Poznań,"81,90",83,"0,13936",53,9,150,"162,5",175,"112,5",120,-125,160,170,-180,"465,0","64,804365",UTE
,Kazimierz,,,,,,,,,,,,,,,,,,
74,Daszkiewicz,UMK Toruń,"74,15",83,"0,14666",15,13,170,"-182,5","-182,5",100,-118,"-117,5",190,-210,-210,"460,0","67,461629",UNI
75,Krzysztof Szadkowski,UMP Poznań,"76,50",83,"0,14431",18,13,160,-165,-165,110,115,"-117,5",-180,180,-185,"455,0","65,660643",UME
76,Adrian Wierzchowski,SGGW Warszawa,"81,30",83,"0,13989",63,13,-160,-170,170,100,-105,-105,180,-195,-195,"450,0","62,948303",USP
,,,,,,,,,,,,,,,,,,,
77,Adam Kłopot,UEK Kraków,"78,90",83,"0,14204",49,12,135,"142,5",150,100,110,-115,"167,5",180,"187,5","447,5","63,562114",USP
78,Alexander Stolarczyk,UM Łódź,"79,40",83,"0,14158",56,12,135,145,-155,110,115,"117,5",170,"182,5",185,"447,5","63,357166",UME
,Oleksandr,,,,,,,,,,,,,,,,,,
79,Kucheriavyi,UG Gdańsk,"82,00",83,"0,13928",3,12,160,170,180,"102,5",-108,"-107,5",150,165,-180,"447,5","62,326935",UNI
80,Hubert Przepiórka,UWM Olsztyn,"82,10",83,"0,13919",12,12,110,-125,130,85,95,-100,190,220,0,"445,0","61,940481",UNI
81,Jakub Zuchowicz,US Szczecin,"80,30",83,"0,14077",22,11,145,155,-160,105,"112,5","117,5",160,-170,170,"442,5","62,290063",UNI
82,Mykyta Huzenko,UPP Poznań,"81,20",83,"0,13997",6,13,-140,155,-170,-110,120,"-132,5",140,-160,"162,5","437,5","61,238010",USP
83,Bartosz Strzelecki,PO Opole,"82,00",83,"0,13928",23,12,130,"142,5",155,85,"97,5",-100,160,170,185,"437,5","60,934154",UTE
84,Kacper Sulak,UMK Toruń,"80,00",83,"0,14104",59,12,140,150,-155,110,-115,-115,155,165,175,"435,0","61,351229",UNI
85,Mateusz Hołub,AWFiS Gdańsk,"79,70",83,"0,14131",58,11,145,"152,5",160,90,"97,5","-102,5",150,160,175,"432,5","61,115661",UWF
86,Marcin Ziółkowski,ANS Konin,"76,00",83,"0,14480",19,9,-100,120,-160,100,115,"-122,5",160,180,190,"425,0","61,539094",USP
87,Kacper Rybiński,PK Kraków,"80,30",83,"0,14077",31,11,130,140,150,-100,"102,5",105,150,160,170,"425,0","59,826615",UTE
88,Tomasz Maciejczyk,ŚUM Katowice,"80,90",83,"0,14024",69,12,165,-175,-175,-90,-90,90,165,-175,-175,"420,0","58,899189",UME
89,Antoni Sachajdak,UM Lublin,"82,20",83,"0,13911",48,12,-120,130,-150,-100,100,-105,180,-190,190,"420,0","58,424647",UME
90,Daniel Obłąk,AHE Łódź,"81,20",83,"0,13997",2,11,"127,5",135,"142,5",-70,70,80,175,"182,5",-190,"405,0","56,688900",WSN
91,Kamil Rygielski,PBŚ Bydgoszcz,"79,00",83,"0,14195",1,11,140,-145,145,"82,5",85,90,160,"167,5","-177,5","402,5","57,133361",UTE
92,Kamil Gronek,PRz Rzeszów,"82,20",83,"0,13911",55,12,120,130,-135,-85,85,-100,170,-185,185,"400,0","55,642521",UTE
93,Adrian Rosa,AWF Wrocław,"82,10",83,"0,13919",19,15,190,-200,-200,115,120,"122,5",75,0,0,"387,5","53,936936",UWF
94,Bartosz Prokop,SGH Warszawa,"81,50",83,"0,13971",10,13,145,155,"-162,5",110,-115,115,110,-130,0,"380,0","53,090079",USP
95,Filip Bączek,ANS Tarnów,"80,70",83,"0,14041",11,11,90,100,120,85,100,-105,140,145,150,"370,0","51,952750",USP
96,Paweł Puzio,PP Poznań,"80,70",83,"0,14041",36,9,-90,95,"107,5","77,5",-85,-85,145,165,175,"360,0","50,548621",UTE
97,Arkadiusz Jucha,PRz Rzeszów,"80,90",83,"0,14024",53,11,110,-125,130,-70,-70,70,140,150,160,"360,0","50,485019",UTE
98,Adam Stępień,UJ Kraków,"78,40",83,"0,14250",65,11,105,"-112,5",115,-60,"-62,5","67,5",150,-170,175,"357,5","50,944227",UNI
,,,,,,,,,,,,,,,,,,,
99,Kamil Kaplita,UEP Poznań,"77,70",83,"0,14316",17,11,-90,90,100,-75,80,85,120,140,150,"335,0","47,958063",USP
100,Jakub Radomski,UMK Toruń,"81,20",83,"0,13997",44,10,65,70,80,65,-75,75,95,110,120,"275,0","38,492463",UNI
nk,Łukasz Nawrocki,PP Poznań,"82,00",83,"0,13928",16,9,190,200,-205,-130,-130,-130,235,-250,250,"0,0","0,000000",UTE
nk,Artur Romanek,ANS Tarnów,"82,40",83,"0,13894",47,11,-100,100,110,-90,-90,-90,-140,140,145,"0,0","0,000000",USP
nk,Łukasz Dylewicz,ŚUM Katowice,"78,90",83,"0,14204",4,11,125,130,-135,"-92,5","-92,5","-92,5",-145,-145,-145,"0,0","0,000000",UME
nk,Eryk Bartkowiak,PO Opole,"77,95",83,"0,14292",52,13,150,160,-170,115,-120,-120,-185,-185,-185,"0,0","0,000000",UTE
pk,Jakub Dobrowolski,CMUMK Bydgoszcz,"85,70",83,"0,13622",23,9,180,185,"187,5",-135,135,-140,-220,-220,-220,"0,0","0,000000",UME
pk,Jakub Winiarczyk,AMW Gdynia,"86,10",83,"0,13590",51,10,150,165,180,135,140,-150,170,190,-200,"510,0","69,308549",USP
,Kategoria 93  [ pkt.IPF GL],,,,,,,,,,,,,,,,,,
1,Nikolas Stylianou,AWF Katowice,"92,80",93,"0,13096",7,25,250,"270,5",280,140,"147,5",-155,275,-300,-300,"702,5","91,998449",UWF
2,Bartłomiej Molga,GUMed Gdańsk,"91,68",93,"0,13174",5,24,240,250,260,"137,5",145,-150,260,280,290,"695,0","91,558468",UME
3,Michał Łopata,UW Warszawa,"92,50",93,"0,13117",37,25,225,235,"-242,5","142,5","147,5",150,275,285,-290,"670,0","87,881169",UNI
4,Mikołaj Tyburcy,AWF Wrocław,"92,95",93,"0,13086",36,25,235,245,250,"152,5",160,165,230,245,-255,"660,0","86,364609",UWF
5,Jakub Tempka,ŚUM Katowice,"91,39",93,"0,13194",5,25,230,"-242,5","242,5",150,-160,160,255,"-267,5","-267,5","657,5","86,752952",UME
,Hubert,,,,,,,,,,,,,,,,,,
6,Furmankiewicz,UPP Poznań,"91,67",93,"0,13175",50,25,225,235,"237,5","152,5",-160,160,235,250,-260,"647,5","85,305436",USP
7,Mateusz Gajos,PG Gdańsk,"90,89",93,"0,13230",3,24,"202,5",210,215,135,140,145,"252,5",265,270,"630,0","83,348772",UTE
8,Oskar Hoffmann,PWr Wrocław,"91,37",93,"0,13196",19,24,205,220,-230,130,"137,5","142,5",240,260,265,"627,5","82,803534",UTE
9,Beniamin Duda,UR Rzeszów,"92,69",93,"0,13103",7,24,205,215,225,130,"137,5","-142,5",255,-265,265,"627,5","82,224152",UNI
10,Tomasz Dobras,PWr Wrocław,"91,52",93,"0,13185",3,24,200,210,215,"182,5",-188,"-187,5",210,-220,220,"617,5","81,418411",UTE
11,Grzegorz Wojdała,AWF Katowice,"91,96",200,"0,13154",10,24,200,215,-225,145,150,-155,235,250,-260,"615,0","80,898414",UWF
12,Rafał Bednarczyk,UM Łódź,"90,17",93,"0,13282",31,24,180,"187,5",195,"147,5",155,"-157,5","247,5",255,260,"610,0","81,019323",UME
13,Maciej Merchelski,AWF Warszawa,"90,84",93,"0,13234",32,23,190,200,"207,5",130,140,145,230,240,250,"602,5","79,732098",UWF
,,,,,,,,,,,,,,,,,,,
14,Paweł Bujara,PŚ Gliwice,"87,60",93,"0,13473",22,24,200,210,0,"117,5","122,5","127,5",260,-280,-300,"597,5","80,503417",UTE
15,Grzegorz Paleta,PŚ Gliwice,"92,08",93,"0,13146",16,24,210,215,"-217,5","122,5",-128,"-127,5","257,5","-262,5",-265,"595,0","78,217620",UTE
16,Endri Shameti,UŁ Łódź,"87,57",93,"0,13476",15,21,-180,190,200,130,135,140,230,250,-260,"590,0","79,506458",UNI
17,Mateusz Gałuszka,AWF w Krakowie,"88,25",93,"0,13424",30,23,200,210,220,120,130,"137,5",210,220,230,"587,5","78,865909",UWF
18,Mateusz Szostak,PW Warszawa,"91,78",93,"0,13167",17,25,"212,5",220,-225,135,140,-145,215,225,-230,"585,0","77,026037",UTE
19,Bartosz Laskowski,PŚk Kielce,"89,71",93,"0,13315",12,18,205,"212,5",220,120,130,-135,215,230,-240,"580,0","77,229353",UTE
20,Konrad Nojszewski,PW Warszawa,"91,24",93,"0,13205",21,25,200,210,215,135,140,"142,5",215,"222,5",-225,"580,0","76,589043",UTE
21,Bartosz Rogal,PK Kraków,"91,07",93,"0,13217",22,23,200,-205,0,135,-140,-140,225,"232,5",240,"575,0","75,998367",UTE
22,Sebastian Burczak,PG Gdańsk,"91,97",93,"0,13154",20,23,185,195,205,130,135,140,"207,5","222,5",230,"575,0","75,632702",UTE
23,Michał Śliwa,PRz Rzeszów,"92,73",93,"0,13101",12,24,185,195,205,"127,5",135,"-137,5",235,"-242,5","-242,5","575,0","75,328968",UTE
24,Dawid Banach,PWr Wrocław,"90,21",93,"0,13279",29,24,180,200,-210,-125,-125,125,220,230,240,"565,0","75,026088",UTE
25,Mateusz Marzec,UŚ Katowice,"90,65",93,"0,13247",17,19,190,200,210,130,"137,5",140,205,215,-220,"565,0","74,846555",UNI
26,Kamil Rzóska,UWM Olsztyn,"92,00",93,"0,13151",67,22,-220,220,-225,-120,120,0,215,225,-235,"565,0","74,305484",UNI
27,Piotr Wilczek,UEK Kraków,"91,40",93,"0,13194",60,22,195,"207,5",215,115,-120,125,210,220,-225,"560,0","73,884479",USP
28,Mateusz Dekanowski,UW Warszawa,"89,11",93,"0,13360",4,23,185,"197,5",205,125,130,135,190,205,"217,5","557,5","74,479979",UNI
29,Paweł Królak,UE Katowice,"92,57",93,"0,13112",42,22,185,195,-200,"142,5","147,5",-155,200,215,-225,"557,5","73,097978",USP
30,Hubert Przybył,ANS Piła,"90,73",93,"0,13241",4,23,180,-195,195,135,140,-145,210,-220,220,"555,0","73,489940",USP
31,Emilian Narożny,UWM Olsztyn,"91,12",93,"0,13214",52,22,175,185,"192,5",110,115,"117,5",225,235,245,"555,0","73,335171",UNI
32,Jakub Kołyska,PW Warszawa,"91,76",93,"0,13168",14,25,200,-210,-210,-115,115,120,-235,235,-245,"555,0","73,083788",UTE
33,Filip Kowalczewski,PP Poznań,"85,02",93,"0,13676",28,18,200,210,"217,5","132,5","137,5","-142,5",190,195,0,"550,0","75,218537",UTE
34,Franciszek Witosz,PŚ Gliwice,"89,55",93,"0,13327",12,21,"187,5","197,5","202,5","122,5","127,5",-130,"-217,5",-220,220,"550,0","73,299316",UTE
35,Szymon Karolczyk,PG Gdańsk,"91,25",93,"0,13204",8,22,160,170,180,120,125,-130,220,"232,5",245,"550,0","72,623634",UTE
,,,,,,,,,,,,,,,,,,,
36,Damian Szczygielski,PP Poznań,"91,79",93,"0,13166",41,18,180,190,-200,135,-143,"142,5",205,215,-225,"547,5","72,084622",UTE
37,Piotr Herian,PŚ Gliwice,"89,40",93,"0,13338",9,21,175,185,190,105,115,-120,215,230,240,"545,0","72,693144",UTE
38,Paweł Kaszyński,UWr Wrocław,"90,77",93,"0,13239",6,24,"177,5",195,"-202,5",130,140,"142,5",185,"202,5","-207,5","540,0","71,488227",UNI
39,Łukasz Szulborski,WSR Warszawa,"91,88",93,"0,13160",58,22,180,190,-200,140,145,150,190,200,-210,"540,0","71,063036",WSN
40,Miłosz Falarz,UŚ Katowice,"91,30",93,"0,13201",39,19,155,165,175,"117,5",125,"132,5",210,220,230,"537,5","70,954014",UNI
41,Dawid Kmieć,UEP Poznań,"86,01",93,"0,13597",55,22,180,195,"-202,5",115,125,-135,195,"207,5",215,"535,0","72,744055",USP
42,Patryk Gnat,AGH Kraków,"87,10",93,"0,13512",9,23,170,185,-195,125,-133,"-132,5",210,215,220,"530,0","71,612645",UTE
43,Szymon Zduniak,ANS Piła,"90,28",93,"0,13274",10,22,-190,190,200,125,130,-135,190,200,-210,"530,0","70,351562",USP
,Tomasz,,,,,,,,,,,,,,,,,,
44,Wojciechowski,ANS Konin,"91,00",93,"0,13222",32,18,170,180,-185,130,135,140,200,210,-230,"530,0","70,077138",USP
45,Kacper Urbaniak,UE Wrocław,"88,37",93,"0,13415",47,18,185,195,"202,5",95,"102,5","-107,5",210,220,-230,"525,0","70,428424",USP
46,Konrad Stanibuła,UPr Lublin,"90,65",93,"0,13247",27,22,180,195,200,115,-120,-120,200,210,0,"525,0","69,547684",USP
47,Kacper Kłaptocz,UO Opole,"86,34",93,"0,13571",2,18,185,-200,-200,120,125,-130,210,-225,-225,"520,0","70,569312",UNI
48,Leonard Sulżycki,PBŚ Bydgoszcz,"90,27",93,"0,13275",21,21,170,190,-200,110,"117,5",-125,190,200,210,"517,5","68,696075",UTE
49,Michał Danieluk,AWF Warszawa,"91,47",93,"0,13189",17,22,155,165,175,135,145,-150,195,"-202,5","-202,5","515,0","67,921817",UWF
50,Tomasz Dorniak,US Szczecin,"87,28",93,"0,13498",22,21,165,175,-180,120,-125,-125,200,210,215,"510,0","68,839464",UNI
51,Mateusz Lis,PŚ Gliwice,"89,90",93,"0,13302",18,21,170,185,-195,120,-130,-130,190,"-202,5","202,5","507,5","67,505166",UTE
52,Jakub Pigulski,ANS Konin,"86,57",93,"0,13553",37,18,160,170,175,"112,5","117,5",120,-195,210,-215,"505,0","68,442684",USP
53,Jakub Jarczewski,UJ CM Kraków,"86,92",93,"0,13526",56,18,-185,190,"-197,5","-112,5",-113,"112,5",200,"-212,5","-212,5","502,5","67,966930",UME
54,Dominik Święs,AGH Kraków,"89,63",93,"0,13321",16,23,170,185,195,100,"107,5","-112,5",175,190,200,"502,5","66,939393",UTE
55,Jakub Kutera,SGGW Warszawa,"90,15",93,"0,13283",1,21,160,170,"177,5",115,125,"-132,5",170,185,200,"502,5","66,748625",USP
56,Michał Urban,PRz Rzeszów,"89,55",93,"0,13327",47,20,170,185,200,110,-120,120,170,180,-190,"500,0","66,635741",UTE
57,Bartosz Boć,PŁ Łódź,"89,57",93,"0,13326",44,20,135,145,155,130,135,-140,185,200,210,"500,0","66,628392",UTE
,,,,,,,,,,,,,,,,,,,
58,Mateusz Filipek,CH SGM Warszawa,"91,56",93,"0,13182",25,20,160,180,-200,120,-130,130,160,185,190,"500,0","65,911713",WSN
59,Piotr Fafuła,AWF Wrocław,"92,07",93,"0,13147",11,22,180,190,-195,110,-115,"-117,5",190,200,-210,"500,0","65,732587",UWF
60,Wojciech Czech,UR Rzeszów,"92,84",93,"0,13093",52,21,170,185,-200,110,-120,-120,185,200,205,"500,0","65,465551",UNI
61,Jakub Ciomcia,UR Rzeszów,"91,62",93,"0,13178",41,22,160,175,-180,115,-125,-125,200,"207,5",-215,"497,5","65,561092",UNI
62,Olaf Nowak,UMG Gdynia,"91,93",93,"0,13156",17,20,160,170,180,105,110,"112,5",180,"192,5","202,5","495,0","65,123762",USP
63,Jakub Miotk,UMG Gdynia,"92,01",93,"0,13151",6,21,140,150,160,110,-115,-115,215,-230,-230,"485,0","63,780959",USP
64,Jakub Malczewski,UMG Gdynia,"88,84",93,"0,13380",3,21,150,160,170,"102,5","107,5","112,5",200,"-217,5","-217,5","482,5","64,557140",USP
65,Patryk Formela,UG Gdańsk,"86,76",93,"0,13538",57,20,130,145,"-157,5",120,130,-135,180,200,-205,"475,0","64,306401",UNI
66,KRZYSZTOF KAWA,UM Lublin,"92,12",93,"0,13143",7,20,185,195,"202,5",100,-110,-110,170,-185,-200,"472,5","62,100791",UME
67,Michał Lach,PO Opole,"87,72",93,"0,13464",55,20,165,-175,-180,115,120,-125,175,185,-190,"470,0","63,281775",UTE
68,Mikołaj Paziewski,UEP Poznań,"92,67",93,"0,13105",19,21,155,165,175,110,115,"-122,5",170,180,0,"470,0","61,592708",USP
69,Szymon Kondeja,ANS Piła,"90,67",93,"0,13246",29,20,150,160,165,105,-115,-115,170,180,195,"465,0","61,592692",USP
70,Wojciech Olejarz,PRz Rzeszów,"88,23",93,"0,13425",9,20,-155,"162,5",170,95,100,"-107,5",170,180,190,"460,0","61,757275",UTE
71,Jakub Zborowski,AGH Kraków,"92,39",93,"0,13124",13,23,125,135,"142,5","117,5","122,5","-127,5",170,"177,5","187,5","452,5","59,387111",UTE
72,Jakub Woźniak,UAM Poznań,"86,04",93,"0,13595",16,20,145,155,165,95,"102,5","-107,5",160,175,-180,"442,5","60,156321",UNI
73,Krzysztof Kosmala,UPr Lublin,"90,87",93,"0,13231",48,19,150,160,-165,95,-100,100,170,-180,180,"440,0","58,218138",USP
74,Nikodem Selech,UEP Poznań,"92,18",93,"0,13139",38,19,140,150,160,-100,100,-105,180,-190,-190,"440,0","57,810886",USP
75,Paweł Puczkowski,PBŚ Bydgoszcz,"90,70",93,"0,13244",10,20,"142,5","147,5",0,105,110,-115,170,-180,-180,"427,5","56,616325",UTE
76,Konrad Dziedzic,UPr Lublin,"91,79",93,"0,13166",56,20,140,145,-150,110,115,-120,150,160,165,"425,0","55,956100",USP
77,Dawid Kozar,UAM Poznań,"85,75",93,"0,13618",25,19,125,"132,5",140,"97,5",105,-110,"152,5",165,"172,5","417,5","56,853603",UNI
78,Wiktor Taraszkiewicz,PP Poznań,"87,25",93,"0,13500",43,18,125,140,-155,"97,5","102,5","107,5",150,165,-180,"412,5","55,688510",UTE
79,Piotr Rząca,SGGW Warszawa,"84,12",93,"0,13749",20,19,130,140,150,-100,100,-105,150,-170,-170,"400,0","54,997712",USP
,,,,,,,,,,,,,,,,,,,
80,Piotr Zimmermann,UMK Toruń,"89,79",93,"0,13310",2,19,-120,120,140,90,100,-105,140,150,160,"400,0","53,238194",UNI
81,Miłosz Koźlicki,PP Poznań,"89,41",93,"0,13337",23,18,110,120,-130,100,105,-110,130,145,160,"385,0","51,349199",UTE
82,Konrad Turczynowski,ŚUM Katowice,"87,56",93,"0,13476",51,19,85,100,"112,5",80,-90,90,120,140,150,"352,5","47,504438",UME
83,Kamil Matuszewski,WSB Poznań,"84,18",93,"0,13744",7,19,105,"112,5",120,100,105,-110,110,125,-140,"350,0","48,105735",WSN
84,Krzysztof Stasiewicz,PP Poznań,"91,10",93,"0,13215",56,18,100,"112,5",-130,85,-95,-95,120,130,"142,5","340,0","44,930895",UTE
85,Wojciech Tokarczyk,ŚUM Katowice,"84,92",93,"0,13684",67,19,70,80,0,65,70,0,80,90,0,"240,0","32,842025",UME
,Bartłomiej,,,,,,,,,,,,,,,,,,
DQ,Balawender,WSB Poznań,"92,04",93,"0,13149",3,25,240,255,"262,5",185,-195,-195,255,275,"-282,5","0,0","0,000000",WSN
nk,Kamil Różalski,PŚk Kielce,"91,44",93,"0,13191",57,18,150,160,-165,-115,-120,-120,170,185,200,"0,0","0,000000",UTE
nk,Szymon Wiatrowski,UMG Gdynia,"86,81",93,"0,13534",62,23,200,210,220,"-137,5",-138,"-137,5",220,230,240,"0,0","0,000000",USP
nk,Maciej Skwarek,PL Lublin,"91,96",93,"0,13154",1,23,190,200,"-202,5",-155,-155,-155,230,240,-250,"0,0","0,000000",UTE
,Kategoria 105  [ pkt.IPF GL],,,,,,,,,,,,,,,,,,
1,Łukasz Topór,PP Poznań,"104,28",105,"0,12386",70,26,"247,5","262,5",270,180,190,200,260,280,300,"770,0","95,372809",UTE
2,Marcin Statkiewicz,PG Gdańsk,"97,97",105,"0,12757",38,30,245,255,265,160,170,0,285,300,315,"750,0","95,677941",UTE
3,David Buba,AWF Katowice,"102,55",105,"0,12484",32,30,240,245,250,150,"157,5","162,5",275,290,300,"712,5","88,945073",UWF
4,Patryk Zientarski,WAT Warszawa,"103,70",105,"0,12418",57,30,-250,250,265,150,160,170,250,-270,275,"710,0","88,170672",USP
5,Patryk Zaniewski,PW Warszawa,"103,71",105,"0,12418",34,30,240,250,"257,5",160,"167,5","172,5",255,"267,5",275,"705,0","87,545802",UTE
6,Jakub Pietrzak,WSR Warszawa,"104,00",105,"0,12402",25,30,240,255,-265,140,-150,150,270,285,-295,"690,0","85,571329",WSN
7,Maciej Wiśniewski,PG Gdańsk,"101,75",105,"0,12530",9,30,210,225,235,"167,5",175,"-182,5",240,255,265,"675,0","84,575030",UTE
8,Johannes,GUMed Gdańsk,"103,75",105,"0,12416",12,30,230,240,-250,150,155,-160,270,280,-290,"675,0","83,805329",UME
,Korneliussen,,,,,,,,,,,,,,,,,,
9,Julian Dudek,AWF Warszawa,"98,56",105,"0,12720",38,29,230,-240,240,170,175,180,230,240,250,"670,0","85,227277",UWF
10,Marceli Jerzyński,PP Poznań,"104,44",105,"0,12377",27,26,245,260,-270,145,155,-160,240,"-252,5","252,5","667,5","82,617954",UTE
,,,,,,,,,,,,,,,,,,,
11,Damian Grecki,PK Kraków,"102,75",105,"0,12472",36,29,220,240,-250,120,130,135,260,-275,275,"650,0","81,068624",UTE
12,Adam Hutniczak,AWF w Krakowie,"102,16",105,"0,12506",1,30,205,235,250,-140,145,0,225,240,250,"645,0","80,663153",UWF
13,Rafał Sarnecki,UPr Lublin,"102,67",105,"0,12477",54,30,210,225,240,145,155,165,210,225,240,"645,0","80,474458",USP
14,Krystian Kopka,UWM Olsztyn,"99,01",105,"0,12693",10,29,220,230,-235,145,155,"-157,5",245,-250,0,"630,0","79,965080",UNI
15,Jakub Gąsak,UMCS Lublin,"102,80",105,"0,12469",28,29,220,230,"237,5","127,5",135,"-137,5",230,250,255,"627,5","78,244524",UNI
16,Maciej Igras,UM Łódź,"100,20",105,"0,12621",49,29,190,205,210,160,165,"167,5",225,235,"242,5","620,0","78,249883",UME
17,Emilian Śpiołek,GUMed Gdańsk,"104,51",105,"0,12373",62,29,"192,5","202,5","212,5",135,140,"-142,5",240,"252,5",260,"612,5","75,786796",UME
18,Bartosz Pigułowski,WAT Warszawa,"101,25",105,"0,12559",47,29,210,220,225,-140,145,150,230,-245,-245,"605,0","75,980763",USP
19,Hubert Nowakowski,PP Poznań,"101,21",105,"0,12561",44,26,210,220,-225,140,150,-160,215,230,"-237,5","600,0","75,366894",UTE
20,Mateusz Jankowski,UŚ Katowice,"97,88",105,"0,12763",12,26,-190,200,220,150,"157,5","-162,5",220,-250,-250,"597,5","76,256973",UNI
21,Konrad Serwa,PK Kraków,"98,48",105,"0,12725",5,29,210,220,"-227,5","132,5",140,-145,220,230,"237,5","597,5","76,034407",UTE
22,Łukasz Aleksiejuk,UMB,"98,10",105,"0,12749",18,26,190,"202,5",215,115,125,"-132,5",220,235,250,"590,0","75,218899",UME
23,Dawid Sanecki,UMG Gdynia,"99,41",105,"0,12669",36,28,170,180,190,140,"147,5","152,5",220,240,"-257,5","582,5","73,794102",USP
24,Aleksander Cirocki,UMG Gdynia,"98,66",105,"0,12714",14,29,-205,"207,5",215,"142,5","147,5",-150,-210,215,-225,"577,5","73,425263",USP
25,Grzegorz Brodziński,WSB Poznań,"103,10",105,"0,12452",20,28,"-192,5",-200,200,125,-130,0,225,235,250,"575,0","71,600186",WSN
26,Leonard Drewniak,PW Warszawa,"97,26",105,"0,12802",13,29,180,190,200,135,"142,5",-150,210,"222,5",-230,"565,0","72,329114",UTE
27,Filip Kulesza,WSEiT Poznań,"103,34",105,"0,12439",56,28,-190,195,-200,140,150,"-152,5",200,210,220,"565,0","70,278322",WSN
28,Ignacy Lamperski,PWr Wrocław,"98,94",105,"0,12697",6,29,185,200,"207,5",110,120,-130,205,225,"-232,5","552,5","70,151758",UTE
29,Łukasz Szczepocki,PŁ Łódź,"96,83",105,"0,12829",48,28,190,-200,200,135,140,-145,210,-225,-225,"550,0","70,558903",UTE
30,Michał Zbiegień,PRz Rzeszów,"101,22",105,"0,12561",31,27,180,200,-210,105,115,120,-210,210,230,"550,0","69,083094",UTE
31,Dawid Gierczak,ŚUM Katowice,"102,57",105,"0,12482",11,28,190,200,-205,115,120,"122,5",215,225,-235,"547,5","68,341002",UME
32,Marcin Wojtasik,PŁ Łódź,"94,86",105,"0,12957",18,28,190,200,0,130,135,-140,210,-225,-225,"545,0","70,614485",UTE
,,,,,,,,,,,,,,,,,,,
33,Rafał Czarnecki,PL Lublin,"98,17",105,"0,12745",24,27,185,-195,"202,5",-115,115,125,205,215,-220,"542,5","69,139544",UTE
34,Adam Sawczak,PRz Rzeszów,"97,11",105,"0,12811",1,27,170,180,195,125,130,-135,200,215,-225,"540,0","69,179958",UTE
35,Michał Soboń,UPP Poznań,"98,55",105,"0,12721",26,28,170,-180,-185,160,"167,5",-170,180,190,195,"532,5","67,739887",USP
36,Daniel Kozik,UR Rzeszów,"99,82",105,"0,12644",16,28,180,195,-200,130,"137,5","-142,5",190,200,-205,"532,5","67,327921",UNI
37,Bartosz Stefanowski,PŁ Łódź,"95,58",105,"0,12909",60,28,175,190,-200,120,-125,-125,220,-235,-235,"530,0","68,420235",UTE
38,Kamil Mańczak,GUMed Gdańsk,"97,19",105,"0,12806",35,27,160,170,-175,100,"107,5","112,5",205,215,230,"512,5","65,630947",UME
39,Jakub Tomaszewski,UJ CM Kraków,"98,41",105,"0,12730",8,26,-175,180,190,125,130,"132,5",180,190,-200,"512,5","65,239957",UME
40,Jakub Wieczorek,US Szczecin,"101,16",105,"0,12564",45,28,185,-190,-190,100,105,"-107,5",220,-225,-225,"510,0","64,076824",UNI
41,Damian Ławrynowicz,US Szczecin,"102,31",105,"0,12497",36,27,160,170,"-177,5","107,5","112,5","-117,5","207,5",215,-220,"497,5","62,173979",UNI
42,Hubert Krok,PK Kraków,"102,50",105,"0,12486",20,27,175,"187,5","-202,5",115,"122,5",-130,175,185,-195,"495,0","61,807588",UTE
43,Sebastian Belter,UPP Poznań,"99,51",105,"0,12662",34,27,140,150,165,115,120,125,180,190,200,"490,0","62,046030",USP
44,Oliwier Jabłoński,WSB Poznań,"96,87",105,"0,12826",2,27,-130,140,-165,125,-135,135,190,210,-220,"485,0","62,207770",WSN
45,Adrian Zaradzki,ANS Konin,"97,79",105,"0,12768",26,26,140,-150,150,145,150,-155,165,175,-180,"475,0","60,649413",USP
46,Antoni Zuzański,AWFiS Gdańsk,"96,25",105,"0,12866",4,27,160,170,180,105,"112,5","-117,5",160,180,-200,"472,5","60,792053",UWF
47,Kacper Mazurkiewicz,UR Rzeszów,"104,11",105,"0,12396",17,27,150,160,-165,95,100,"-102,5",200,210,-215,"470,0","58,258937",UNI
48,Kacper Bal,UŚ Katowice,"93,60",105,"0,13041",22,26,135,140,150,135,140,-145,160,170,-180,"460,0","59,989456",UNI
49,Mateusz Mazurek,UPr Lublin,"95,35",105,"0,12925",69,26,150,160,-165,-115,115,-120,160,170,-175,"445,0","57,514110",USP
50,Nikodem Beberok,PP Poznań,"104,25",105,"0,12388",24,26,140,155,-165,90,-103,"-102,5",160,175,185,"430,0","53,267294",UTE
51,Jakub Gontarski,UEP Poznań,"99,90",105,"0,12639",23,27,100,-110,115,85,"92,5",-100,130,-160,170,"377,5","47,711958",USP
nk,Szymon Kubak,KUL Lublin,"103,59",105,"0,12425",16,26,100,-115,-120,-110,-115,-115,-150,-150,-150,"0,0","0,000000",UNI
nk,Grzegorz Jóźwiak,PŁ Łódź,"103,93",105,"0,12406",42,28,180,190,-200,130,135,-140,-210,-210,-210,"0,0","0,000000",UTE
nk,Mikołaj Wilczyński,UG Gdańsk,"102,66",105,"0,12477",46,30,-255,-255,-255,150,-155,-155,270,285,-300,"0,0","0,000000",UNI
,,,,,,,,,,,,,,,,,,,
Kategoria 120  [ pkt.IPF GL],,,,,,,,,,,,,,,,,,,
,,,,,,,,,,,,,,,,,,,
1,Sebastian Stanek,PWr Wrocław,"119,50",120,"0,11646",31,32,280,300,-310,180,190,-195,310,332,-350,"822,0","95,728544",UTE
2,Patryk Siemiątkowski,AWF Wrocław,"119,80",120,"0,11633",1,32,245,260,-270,175,"182,5","187,5",290,305,"317,5","765,0","88,992906",UWF
3,Daniel Jurkowski,AGH Kraków,"112,20",120,"0,11977",25,32,"-252,5",265,275,175,185,"-192,5",275,290,"302,5","762,5","91,321758",UTE
4,Mateusz Kumański,UJK Kielce,"118,70",120,"0,11680",20,32,260,"272,5",280,170,"177,5","-182,5",255,265,275,"732,5","85,556846",UNI
5,Mateusz Koralewicz,UM Łódź,"115,00",120,"0,11845",24,32,230,240,"-247,5",185,-193,"-192,5",290,305,"-327,5","730,0","86,467665",UME
6,Mateusz Raj,PŚ Gliwice,"115,60",120,"0,11817",44,32,260,-275,280,175,185,-195,-250,255,-265,"720,0","85,085745",UTE
7,Kacper Śpiewak,PW Warszawa,"119,20",120,"0,11659",54,32,245,"257,5",265,"152,5",160,"162,5",275,290,"-302,5","717,5","83,650600",UTE
8,Miłosz Wróblewski,PG Gdańsk,"111,10",120,"0,12030",7,32,235,245,"252,5","142,5",150,155,"272,5","-287,5","287,5","695,0","83,609467",UTE
9,Jakub Pałachniak,PŚ Gliwice,"113,60",120,"0,11910",75,32,-250,260,270,165,"172,5",-175,235,245,250,"692,5","82,476514",UTE
10,Krzysztof Stangret,WAT Warszawa,"114,70",120,"0,11859",4,32,235,250,0,"162,5",-168,"-167,5",255,270,"-287,5","682,5","80,935635",USP
11,Bartłomiej Cieciura,WAT Warszawa,"114,40",120,"0,11873",52,32,230,240,"-247,5",160,170,-175,245,260,270,"680,0","80,733593",USP
12,Jan Szopa,UG Gdańsk,"111,10",120,"0,12030",42,32,200,-205,210,145,"152,5",-160,250,265,275,"637,5","76,692137",UNI
13,Dominik Czestkowski,PŁ Łódź,"107,20",120,"0,12228",9,31,210,-225,"232,5",150,-160,-160,250,-265,-265,"632,5","77,344536",UTE
14,Hubert Zając,AGH Kraków,"110,50",120,"0,12060",32,32,220,-240,-240,120,125,130,260,280,-300,"630,0","75,976506",UTE
15,Jakub Szczur,AGH Kraków,"111,10",120,"0,12030",13,32,-210,210,225,-130,130,145,230,245,260,"630,0","75,789877",UTE
16,Paweł Regiewicz,UŚ Katowice,"117,10",120,"0,11750",46,31,"207,5",220,"227,5","117,5",125,-130,"247,5",260,-270,"612,5","71,969450",UNI
17,Filip Kruszewski,PŚ Gliwice,"114,20",120,"0,11882",49,31,205,215,-225,125,-135,135,225,240,250,"600,0","71,291305",UTE
18,Paweł Stupnicki,UZ Zielona Góra,"116,10",120,"0,11795",27,31,190,210,-230,135,150,"157,5",200,215,"232,5","600,0","70,768951",UNI
19,Bartosz Kłonowski,PO Opole,"107,50",120,"0,12213",59,31,170,185,195,125,130,135,215,225,235,"565,0","69,001451",UTE
20,Jakub Jajonek,UŚ Katowice,"119,70",120,"0,11637",33,31,210,225,235,110,120,-125,180,195,210,"565,0","65,750757",UNI
21,Michał Niedźwiecki,AWFiS Gdańsk,"116,30",120,"0,11786",28,31,180,190,195,115,120,-130,215,230,240,"555,0","65,411316",UWF
,,,,,,,,,,,,,,,,,,,
22,Dawid Różański,CW Legnica,"114,70",120,"0,11859",21,31,145,155,170,90,"97,5","-102,5",210,220,230,"497,5","58,997038",USP
23,Denys Korobko,UJ Kraków,"116,50",120,"0,11777",14,31,140,150,155,135,-145,-145,190,200,"-202,5","490,0","57,706568",UNI
24,Ivan Rudiuk,UPr Lublin,"110,30",120,"0,12070",28,31,-165,"172,5",185,105,-115,115,175,"187,5",-200,"487,5","58,839819",USP
25,Patryk Strzałkowski,UM Lublin,"107,00",120,"0,12239",1,31,140,155,-170,-120,-120,120,170,185,200,"475,0","58,134892",UME
,Witold,,,,,,,,,,,,,,,,,,
26,Pietruszkiewicz,UEP Poznań,"107,00",120,"0,12239",41,31,140,150,160,105,-110,-115,180,190,200,"465,0","56,910999",USP
pk,Szymon Sonntag,UŚ Katowice,"103,50",120,"0,12430",23,31,75,105,125,120,130,"132,5",75,125,145,"402,5","50,029263",UNI
pk,Radosław Wójciak,PK Kraków,"103,50",120,"0,12430",11,31,165,180,190,110,120,-125,210,220,-230,"530,0","65,877042",UTE
,Kategoria 120+  [ pkt.IPF GL],,,,,,,,,,,,,,,,,,
1,Maciej Kuźma,AMW Gdynia,"145,20",120+,"0,10746",11,33,240,255,265,215,-225,225,280,295,-300,"785,0","84,357706",USP
2,Jakub Brożek,UW Warszawa,"141,80",120+,"0,10846",42,33,265,280,290,175,185,190,280,-300,300,"780,0","84,598786",UNI
3,Bartłomiej Tuszyński,WAT Warszawa,"161,70",120+,"0,10325",45,33,285,300,310,160,170,0,280,300,"-307,5","780,0","80,536185",USP
4,Jakub Liszcz,PWr Wrocław,"121,50",120+,"0,11562",18,33,250,265,275,160,165,170,275,-290,-300,"720,0","83,246358",UTE
5,Rafał Lebioda,PBŚ Bydgoszcz,"124,40",120+,"0,11445",16,33,-260,260,-280,160,-170,-170,275,290,0,"710,0","81,261063",UTE
6,Jaromir Wysocki,CW Legnica,"136,50",120+,"0,11012",74,33,235,245,250,155,160,"-162,5",280,"-292,5","292,5","702,5","77,358818",USP
7,Filip Potoczny,PŚ Gliwice,"121,90",120+,"0,11546",20,33,225,235,"242,5",155,160,165,255,265,"-272,5","672,5","77,643881",UTE
8,Jakub Węcławik,SGGW Warszawa,"125,00",120+,"0,11422",48,33,180,190,200,"122,5",130,-135,210,220,225,"555,0","63,390631",USP
9,Łukasz Gewont,UJ CM Kraków,"125,00",120+,"0,11422",60,33,170,180,-190,-115,-115,115,170,190,220,"515,0","58,821937",UME
nk,Łukasz Ogiela,PK Kraków,"127,80",120+,"0,11315",36,33,190,-200,210,-100,-105,-105,200,-230,0,"0,0","0,000000",UTE
,,,,,,,,,,,,,,,,,,,
KLASYFIKACJA DRUŻYNOWA MĘŻCZYZN,,,,,,,,,,,,,,,,,,,
,,,,,,,,,,,,,,,,,,,
,Uczelnia,Typ,PKT IPF GL,,,,,,,,,,,,,,,,
,,uczelni,,,,,,,,,,,,,,,,,
1,PG Gdańsk,UTE,"444,509081","95,67794132","95,59760702","85,04904","84,57503","83,609467",,,,,,,,,,,
2,AWF Katowice,UWF,"424,415940","91,99844918","88,94507319","85,39558","80,89841","77,178422",,,,,,,,,,,
3,PK Kraków,UTE,"418,255157","89,51147867","84,40472002","83,65715","81,06862","79,613186",,,,,,,,,,,
4,PWr Wrocław,UTE,"418,222935","95,72854365","83,24635817","82,80353","81,41841","75,026088",,,,,,,,,,,
5,WAT Warszawa,USP,"415,117852","88,17067154","84,74176705","80,93563","80,73359","80,536185",,,,,,,,,,,
6,UJK Kielce,UNI,"414,425368","86,49762545","85,87903828","85,55685","80,09529","76,396566",,,,,,,,,,,
7,PŚ Gliwice,UTE,"403,927178","85,08574451","82,47651402","80,50342","78,21762","77,643881",,,,,,,,,,,
8,AGH Kraków,UTE,"401,938980","91,32175839","82,43446739","76,41637","75,97651","75,789877",,,,,,,,,,,
9,PP Poznań,UTE,"400,660816","95,37280859","82,61795353","75,36689","75,21854","72,084622",,,,,,,,,,,
10,UW Warszawa,UNI,"399,184311","87,88116864","84,59878626","77,82542","74,47998","74,39896",,,,,,,,,,,
11,PW Warszawa,UTE,"397,895270","87,54580169","83,65060001","77,02604","76,58904","73,083788",,,,,,,,,,,
12,UR Rzeszów,UNI,"393,308125","87,36847035","82,61577313","82,22415","73,77181","67,327921",,,,,,,,,,,
13,UM Łódź,UME,"386,984446","86,46766481","81,01932301","78,24988","72,74026","68,507315",,,,,,,,,,,
14,UPr Lublin,USP,"384,281062","80,47445815","80,3118602","79,38876","74,5583","69,547684",,,,,,,,,,,
15,UWM Olsztyn,UNI,"383,166082","84,34350155","79,96508022","74,30548","73,33517","71,216846",,,,,,,,,,,
,,,,,,,,,,,,,,,,,,,
16,AWF Wrocław,UWF,"377,982186","88,99290603","86,36460853","69,02803","67,86405","65,732587",,,,,,,,,,,
17,PRz Rzeszów,UTE,"375,818810","80,68653236","75,72890451","75,32897","74,89445","69,179958",,,,,,,,,,,
18,UŁ Łódź,UNI,"369,789112","85,70748503","79,50645786","72,44716","66,14022","65,98779",,,,,,,,,,,
19,PŁ Łódź,UTE,"369,649338","82,1208027","77,34453583","70,61449","70,5589","69,010611",,,,,,,,,,,
20,ŚUM Katowice,UME,"367,239729","86,75295157","74,94728062","68,59445","68,48679","68,45826",,,,,,,,,,,
21,UMG Gdynia,USP,"365,456021","74,0807676","73,79410152","73,66378","73,42526","70,49211",,,,,,,,,,,
22,UŚ Katowice,UNI,"364,773120","76,25697311","74,84655543","71,96945","70,95401","70,746127",,,,,,,,,,,
23,UJ CM Kraków,UME,"362,490048","84,90717604","72,78574864","71,59024","67,96693","65,239957",,,,,,,,,,,
24,UAM Poznań,UNI,"362,089560","89,03607927","87,48775807","68,5558","60,15632","56,853603",,,,,,,,,,,
25,PL Lublin,UTE,"356,250556","77,51157326","77,25161099","72,31261","69,13954","60,035217",,,,,,,,,,,
26,GUMed Gdańsk,UME,"355,332992","91,55846833","83,80532906","75,7868","65,63095","38,551451",,,,,,,,,,,
27,PŚk Kielce,UTE,"354,200803","77,2293528","74,18664025","72,70951","69,76855","60,30675",,,,,,,,,,,
28,UEK Kraków,USP,"350,557303","78,33566604","73,88447868","69,02803","65,74701","63,562114",,,,,,,,,,,
29,PBŚ Bydgoszcz,UTE,"342,034475","81,26106285","69,32077652","68,69608","65,6232","57,133361",,,,,,,,,,,
30,AWFiS Gdańsk,UWF,"340,123332","73,66377922","70,29621017","69,63637","65,41132","61,115661",,,,,,,,,,,
31,PO Opole,UTE,"328,174320","71,55721115","69,00145065","63,39973","63,28177","60,934154",,,,,,,,,,,
32,SGGW Warszawa,USP,"318,865973","67,9931763","66,74862491","63,39063","62,9483","57,785237",,,,,,,,,,,
33,UJ Kraków,UNI,"313,882262","79,64434642","77,18022968","57,70657","50,94423","48,406891",,,,,,,,,,,
34,AWF w Krakowie,UWF,"312,914401","80,66315285","78,86590946","77,33486","76,05048",,,,,,,,,,,,
35,UE Katowice,USP,"309,166671","90,73856401","76,38234179","73,09798","68,94779",,,,,,,,,,,,
36,ANS Konin,USP,"307,681174","70,07713799","68,44268373","61,53909","60,64941","46,972845",,,,,,,,,,,
37,ANS Tarnów,USP,"302,921266","76,25222807","75,29380266","61,15473","51,95275","38,267759",,,,,,,,,,,
,,,,,,,,,,,,,,,,,,,
38,UEP Poznań,USP,"297,016712","72,74405534","61,59270837","57,81089","56,911","47,958063",,,,,,,,,,,
39,UMK Toruń,UNI,"288,501231","67,95771647","67,46162872","61,35123","53,23819","38,492463",,,,,,,,,,,
40,UPP Poznań,USP,"276,329363","85,30543622","67,73988696","62,04603","61,23801",,,,,,,,,,,,
41,UG Gdańsk,UNI,"266,999651","76,69213726","64,30640051","63,67418","62,32693",,,,,,,,,,,,
42,US Szczecin,UNI,"257,380330","68,83946394","64,07682359","62,29006","62,17398",,,,,,,,,,,,
43,WSB Poznań,WSN,"256,914886","75,00119455","71,60018581","62,20777","48,10574",,,,,,,,,,,,
44,UM Lublin,UME,"254,511964","75,85163403","62,10079119","58,42465","58,13489",,,,,,,,,,,,
45,CW Legnica,USP,"208,217465","77,35881763","71,86160966","58,99704",,,,,,,,,,,,,
,,,,,,,,,,,,,,,,,,,
46,KUL Lublin,UNI,"194,868847","76,81560443","68,49048497","49,56276",,,,,,,,,,,,,
