Place,Name,Sex,BirthDate,Age,Country,State,Equipment,Division,BodyweightKg,WeightClassKg,Squat1Kg,Squat2Kg,Squat3Kg,Squat4Kg,Best3SquatKg,Bench1Kg,Bench2Kg,Bench3Kg,Bench4Kg,Best3BenchKg,Deadlift1Kg,Deadlift2Kg,Deadlift3Kg,Deadlift4Kg,Best3DeadliftKg,TotalKg,Event,Team
1,Mitchell Crawford,M,2009-03-25,15,Australia,TAS,Sleeves,J14-16,71.65,75,135,-145,-145,,135,85,90,92.5,95.5,92.5,180,185,190,,190,417.5,SBD,The Strength Den Burnie
1,Phoenix Newitt,F,2006-01-17,18,Australia,TAS,Sleeves,J17-19,97.85,100,-115,-115,130,,130,50,60,-70,,60,160,170,180,190,180,370,SBD,Slaughterhouse gym Launceston
1,Declan Dullaghan,M,2006-11-21,17,Australia,TAS,Sleeves,J17-19,63.75,67.5,120,130,,,130,70,-75,75,,75,170,-190,-190,,170,375,SBD,
1,Tristan Fawdry,M,2006-07-18,17,Australia,TAS,Sleeves,J17-19,86.7,90,137.5,142.5,150,,150,85,95,100,-103,100,205,215,230,,230,480,SBD,The strength den
1,Jake Quinn,M,2006-05-26,18,Australia,TAS,Sleeves,J17-19,90.45,100,185,195,-202.5,,195,115,-122.5,125,,125,180,200,-220.5,,200,520,SBD,Motivity Fitness
1,Ewan Grierson,M,2005-05-20,19,Australia,TAS,Sleeves,J17-19,102.5,110,210,220,230,,230,135,142.5,-150,,142.5,240,260,272.5,,272.5,645,SBD,Zapfitness Kingston
1,Alex Holtum,M,2005-11-15,18,Australia,TAS,Sleeves,J17-19,98.7,100,,,,,,-115,-115,115,-117.5,115,,,,,,115,B,The Strength Den Elevate fitness
1,Kate Cowen,F,2002-07-30,21,Australia,TAS,Wraps,J20-23,65.2,67.5,80,90,-100,,90,50,55,-57.5,,55,100,-105,105,,105,250,SBD,Home
1,Madison Willis,F,2002-10-14,21,Australia,TAS,Sleeves,J20-23,71.2,75,,,,,,,,,,,150,-163,-163,,150,150,D,Major city strength
1,Christopher Demarte,M,2004-06-15,20,Australia,TAS,Wraps,J20-23,67.1,67.5,142.5,145,150,,150,-80,85,87.5,,87.5,150,160,165,,165,402.5,SBD,Asylum gym
1,Lewis Coull,M,2002-12-20,21,Australia,TAS,Sleeves,J20-23,88.1,90,185,195.5,-200,,195.5,112.5,117.5,-122.5,,117.5,205,220,230,,230,543,SBD,Next Gen Fitness
1,Zac Seadon,M,2003-02-01,21,Australia,TAS,Wraps,J20-23,97.85,100,-270,270,-285,,270,140,-150,150,,150,275,300,320,,320,740,SBD,Slaughterhouse Gym Launceston
1,Sam Dufty,M,2001-11-25,22,Australia,TAS,Wraps,J20-23,105.9,110,305,325,332.5,,332.5,135,142.5,150,,150,290,315,322.5,,322.5,805,SBD,Competitive Edge
1,Rohan Wheeler,M,2000-10-26,23,Australia,TAS,Wraps,J20-23,124,125,135,155,162.5,,162.5,80,90,-95,,90,165,-185,-185,,165,417.5,SBD,Slaughterhouse Launceston
1,Riley Leitch,M,2003-02-26,21,Australia,TAS,Sleeves,J20-23,94,100,,,,,,140,150,160,,160,210,220,240,,240,400,BD,Zap
1,Braydon Hall,M,2002-09-15,21,Australia,TAS,Sleeves,J20-23,108.1,110,,,,,,120,125,130,,130,200,-210,-210,,200,330,BD,Zap Howrah
1,Bryn Chrystie,M,2003-04-06,21,Australia,TAS,Sleeves,J20-23,79.7,82.5,,,,,,-115,115,-120,,115,,,,,,115,B,Anytime
1,Jack Simpson,M,2003-10-16,20,Australia,TAS,Sleeves,J20-23,122.2,125,,,,,,110,115,120,,120,,,,,,120,B,Next Gen
1,Toby Barnett,M,2001-08-24,22,Australia,TAS,Sleeves,J20-23,112.1,125,,,,,,,,,,,320,-340,-340,,320,320,D,Hiper Centre
1,Kelliann Brown,F,1974-08-26,49,Australia,TAS,Sleeves,M40-49,86.9,90,,,,,,70,77.5,80,-81,80,,,,,,80,B,Major City Strength
DQ,Josh Shepherd,M,1978-08-16,45,Australia,TAS,Sleeves,M40-49,80.55,82.5,,,,,,110,117.5,-120,,117.5,-210,-210,,,,,BD,Method + Action
1,Fiona Elliott,F,1972-09-27,51,Australia,TAS,Sleeves,M50-59,81.4,82.5,95,-105,105,,105,50,-53,-53,,50,130,135,-140,,135,290,SBD,Cult Fitness Lauderdale
1,Alison Dann,F,1972-11-14,51,Australia,TAS,Sleeves,M50-59,88.5,90,125,130,140,,140,70,77.5,82.5,,82.5,157.5,165,175,,175,397.5,SBD,Van Demon Fitness
1,Jackelyn Kelly,F,1971-05-01,53,Australia,TAS,Sleeves,M50-59,98.15,100,-105,110,115,117.5,115,-60,-62.5,62.5,-65,62.5,120,130,-135,,130,307.5,SBD,Samson Strength
1,Peter Lee #1,M,1960-12-02,63,Australia,TAS,Wraps,M60-69,109,110,-210,-210,210,,210,127.5,-135,-135,,127.5,210,-220,220,,220,557.5,SBD,Slaughterhouse Launceston
1,Leo O'Dea,M,1960-11-03,63,Australia,TAS,Sleeves,M60-69,71.55,75,,,,,,52.5,-55.5,-55.5,,52.5,125,130,136.5,139,136.5,189,BD,Iron Dragon Gym Burnie
1,Coorinna Burgess,F,1989-12-06,34,Australia,TAS,Wraps,S24-39,59.6,60,135,147.5,160,,160,65,70,75,,75,110,125,140,,140,375,SBD,NA
1,Ebony Jane Brown,F,1993-10-23,30,Australia,TAS,Wraps,S24-39,66.6,67.5,155,-170,-175,,155,75,82.5,90,,90,170,185,-200,,185,430,SBD,Slaughterhouse Gym Launceston
1,Chantelle Gauci,F,,25,Australia,TAS,Wraps,S24-39,74.8,75,-185,192.5,-202.5,,192.5,90,100,-102.5,,100,210,225,-232.5,,225,517.5,SBD,
2,Joannah Kafer,F,1984-07-26,39,Australia,TAS,Sleeves,S24-39,74.3,75,-85,85,-95,,85,40,45,47.5,,47.5,95,100,-110,,100,232.5,SBD,Leviathan Strength
1,Keeta Crisp,F,1994-07-15,29,Australia,TAS,Wraps,S24-39,81.5,82.5,235,-250,250,,250,130,145,-150,,145,235,255,265,272.5,265,660,SBD,ZeroW Southside Brisbane
2,Millie Lamprecht,F,1993-06-20,31,Australia,TAS,Wraps,S24-39,81.5,82.5,160,170,180,,180,80,-85,85,,85,170,180,-190,,180,445,SBD,Atlas Barbell
1,Abby Meyer,F,1998-11-24,25,Australia,TAS,Wraps,S24-39,95.5,100,-120,120,137.5,,137.5,67.5,-75,75,,75,130,150,160,,160,372.5,SBD,Slaughterhouse Gym Launceston
1,Melinda Beers,F,1993-11-15,30,Australia,TAS,Sleeves,S24-39,85,90,,,,,,90,-95,-95,,90,130,140,-150,,140,230,BD,Stone strength
1,Morgan McNair,F,1996-07-16,27,Australia,TAS,Wraps,S24-39,114.1,125,140,150,162.5,,162.5,,,,,,,,,,,162.5,S,Girls Who Lift
1,Morgan McNair,F,1996-07-16,27,Australia,TAS,Sleeves,S24-39,114.1,125,,,,,,75,77.5,-80,,77.5,,,,,,77.5,B,Girls Who Lift
1,Gina Olivieri,F,1986-07-08,38,Australia,TAS,Sleeves,S24-39,100.2,110,,,,,,,,,,,150,160,-170,,160,160,D,Atlas Barbell
1,Josh Wells #4,M,1998-09-25,25,Australia,TAS,Sleeves,S24-39,88,90,165,175,185,,185,-130,135,-142.5,,135,215,225,230,,230,550,SBD,Atlas
2,Jason Ellard,M,2000-05-07,24,Australia,TAS,Sleeves,S24-39,86.05,90,140,150,157.5,,157.5,95,102.5,107.5,,107.5,240,260,275,,275,540,SBD,Zap fitness
1,Tom Major,M,1996-10-24,27,Australia,TAS,Wraps,S24-39,108.8,110,285,-300,300,,300,170,180,-185,,180,290,310,320,,320,800,SBD,Atlas / slaughter house
2,Nathan Stagg,M,1995-11-17,28,Australia,TAS,Wraps,S24-39,107.9,110,185,200,205,,205,112.5,115,-120,,115,-220,235,-242.5,,235,555,SBD,HiPer Centre
DQ,Rhys Evans,M,1993-07-09,31,Australia,TAS,Sleeves,S24-39,122.15,125,-260,-260,,,,,,,,,,,,,,,SBD,Whittaker strength
1,Jake Wells,M,1989-08-02,34,Australia,TAS,Wraps,S24-39,162.4,140+,300,320,330,,330,155,165,-185,,165,290,-305,305,,305,800,SBD,Muscle up
1,Sam Boxhall,M,1992-09-12,31,Australia,TAS,Raw,S24-39,123.7,125,,,,,,190,-200,,,190,300,320,-332.5,,320,510,BD,Slaughterhouse Gym Launceston
1,Liam McGuire,M,1993-12-16,30,Australia,TAS,Sleeves,S24-39,132.65,140,,,,,,-210,220,-232.5,,220,370,-387.5,,,370,590,BD,Raw strength
1,Joseph Whittaker,M,1985-10-20,38,Australia,TAS,Sleeves,S24-39,148.2,140+,,,,,,245,257.5,268.5,-278,268.5,,,,,,268.5,B,Girls who lift
1,Luke Mason,M,1993-11-13,30,Australia,TAS,Sleeves,S24-39,85.7,90,,,,,,,,,,,240,255,265,,265,265,D,Zap/Atlas
1,Jacob Langford,M,1985-12-18,38,Australia,TAS,Sleeves,S24-39,98.4,100,,,,,,,,,,,-250,260,-270,,260,260,D,Atlas
1,Alex Gard,M,1987-01-10,37,Australia,TAS,Sleeves,S24-39,129.5,140,,,,,,,,,,,330,,,,330,330,D,Atlas Barbell
