Division,WeightClassKg,Place,Name,Team,BodyweightKg,Best3SquatKg,Best3BenchKg,Best3DeadliftKg,TotalKg,Equipment,Event,Sex
Boys,51.71,1,Diego Gallegos,Alvin,51.71,170.1,106.59,181.44,458.13,Single-ply,SBD,M
Boys,51.71,2,Brendon Jones,Nederland,51.44,176.9,79.38,170.1,426.38,Single-ply,SBD,M
Boys,51.71,3,Alfredo Barron,Splendora,49.8,147.42,68.04,149.69,365.14,Single-ply,SBD,M
Boys,51.71,4,Nathaniel Jimenez,Dayton,51.71,129.27,77.11,136.08,342.46,Single-ply,SBD,M
Boys,51.71,5,Ezekiel Eldridge,Katy Taylor,48.26,131.54,77.11,131.54,340.19,Single-ply,SBD,M
Boys,51.71,6,Nathan Acosta,Pearland Dawson,50.53,136.08,63.5,138.35,337.93,Single-ply,SBD,M
Boys,51.71,7,Jaden Moreno,Clute Brazoswood,51.17,115.67,63.5,136.08,315.25,Single-ply,SBD,M
Boys,51.71,8,Jeremiah Coleman,Dickinson,51.07,117.93,52.16,138.35,308.44,Single-ply,SBD,M
Boys,51.71,9,Royshon Godley,Texas City,51.62,127.01,58.97,115.67,301.64,Single-ply,SBD,M
Boys,51.71,10,Nate Colborn,Montgomery,45,124.74,52.16,120.2,297.1,Single-ply,SBD,M
Boys,51.71,11,Kase Mitchell,Conroe The Woodlands,48.35,113.4,68.04,113.4,294.84,Single-ply,SBD,M
Boys,51.71,12,Ian Alvarez,Conroe The Woodlands,51.07,111.13,54.43,127.01,292.57,Single-ply,SBD,M
Boys,51.71,13,Alec Ohnheiser,Conroe,49.62,113.4,65.77,104.33,283.5,Single-ply,SBD,M
Boys,55.79,1,Matthew Longoria,Alvin,55.79,185.97,136.08,185.97,508.02,Single-ply,SBD,M
Boys,55.79,2,AJ Ono,Conroe The Woodlands,55.16,179.17,99.79,181.44,460.4,Single-ply,SBD,M
Boys,55.79,3,Timothy Le,Port Neches-Groves,55.34,176.9,95.25,176.9,449.06,Single-ply,SBD,M
Boys,55.79,4,Ashton Mashaw,Conroe Caney Creek,55.79,167.83,86.18,183.7,437.72,Single-ply,SBD,M
Boys,55.79,5,Adarius Jones,Manvel,54.52,140.61,92.99,163.29,396.89,Single-ply,SBD,M
Boys,55.79,6,Michael Hushka,Conroe The Woodlands,55.43,142.88,88.45,151.95,383.29,Single-ply,SBD,M
Boys,55.79,7,Daniel Cherry,Nederland,55.61,145.15,81.65,149.69,376.48,Single-ply,SBD,M
Boys,55.79,8,Tien Nguyen,Nederland,54.07,131.54,83.91,158.76,374.21,Single-ply,SBD,M
Boys,55.79,9,Bryson Cauthen,Nederland,55.25,133.81,70.31,149.69,353.8,Single-ply,SBD,M
Boys,55.79,10,Wyatt Dudley,Santa Fe,54.43,136.08,61.23,147.42,344.73,Single-ply,SBD,M
Boys,55.79,DQ,Salvador Bahena,Beaumont Ozen,55.16,120.2,,,,Single-ply,SBD,M
Boys,55.79,DQ,Carlos Salazar,Manvel,55.79,,,,,Single-ply,SBD,M
Boys,59.87,1,Edgar Benegas,Conroe,59.33,192.78,97.52,226.8,517.1,Single-ply,SBD,M
Boys,59.87,2,Qj Domio,Dayton,58.97,163.29,104.33,201.85,469.47,Single-ply,SBD,M
Boys,59.87,3,Anthony Ramirez,Alvin,59.87,172.37,113.4,181.44,467.2,Single-ply,SBD,M
Boys,59.87,4,Weston Tinsley,Lumberton,58.33,188.24,83.91,188.24,460.4,Single-ply,SBD,M
Boys,59.87,5,Kelbe Sylvan,Katy Taylor,57.7,174.63,83.91,192.78,451.32,Single-ply,SBD,M
Boys,59.87,6,Jerell Jones,Conroe Oak Ridge,59.15,174.63,88.45,183.7,446.79,Single-ply,SBD,M
Boys,59.87,7,Jessy Yanez,Channelview,58.15,165.56,90.72,183.7,439.98,Single-ply,SBD,M
Boys,59.87,8,Dion Tran,Nederland,59.6,158.76,81.65,158.76,399.16,Single-ply,SBD,M
Boys,,NS,Marcus Mayorga,Pearland,,,,,,Single-ply,SBD,M
Boys,,NS,Dorian Stanton,Clute Brazoswood,,,,,,Single-ply,SBD,M
Boys,,NS,Phong Nguyen,Clute Brazoswood,,,,,,Single-ply,SBD,M
Boys,,NS,August Williams,Conroe Oak Ridge,,,,,,Single-ply,SBD,M
Boys,67.13,1,Gavin Webster,Conroe The Woodlands,66.68,249.48,158.76,254.01,662.24,Single-ply,SBD,M
Boys,67.13,2,Kenny Bounds,Montgomery,66.77,240.4,151.95,204.12,596.47,Single-ply,SBD,M
Boys,67.13,3,Pablo Cavazos,Dickinson,65.95,254.01,108.86,231.33,594.21,Single-ply,SBD,M
Boys,67.13,4,Gin Ivey,Conroe Oak Ridge,65.95,213.19,122.47,201.85,537.51,Single-ply,SBD,M
Boys,67.13,5,BJ Mottu,Livingston,67.04,185.97,129.27,206.38,521.63,Single-ply,SBD,M
Boys,67.13,6,Charlie Reyes,Tomball,67.04,183.7,99.79,208.65,492.15,Single-ply,SBD,M
Boys,67.13,7,James Traylor,Montgomery,62.32,181.44,95.25,210.92,487.61,Single-ply,SBD,M
Boys,67.13,8,Jacob Jackson,Conroe Woodlands College Park,66.13,197.31,115.67,172.37,485.34,Single-ply,SBD,M
Boys,67.13,9,Nick Provost,Conroe The Woodlands,66.77,188.24,88.45,208.65,485.34,Single-ply,SBD,M
Boys,67.13,10,Santiago Hernandez,Texas City,62.96,174.63,117.93,158.76,451.32,Single-ply,SBD,M
Boys,67.13,DQ,Ivan Fuentes,Willis,67.04,181.44,106.59,,,Single-ply,SBD,M
Boys,67.13,DQ,LaQuentin Cravens,Texas City,65.59,,,,,Single-ply,SBD,M
Boys,74.84,1,Gage Carreon,Port Neches-Groves,74.75,249.48,145.15,278.96,673.58,Single-ply,SBD,M
Boys,74.84,2,Asa Spade,Splendora,72.48,260.82,136.08,226.8,623.69,Single-ply,SBD,M
Boys,74.84,3,Dawson Nobriga,Channelview,74.12,219.99,151.95,217.72,589.67,Single-ply,SBD,M
Boys,74.84,4,Gabriel Gonzalez,Magnolia West,72.21,226.8,136.08,204.12,566.99,Single-ply,SBD,M
Boys,74.84,5,Thomas Bauer,Katy Taylor,73.66,197.31,129.27,238.14,564.72,Single-ply,SBD,M
Boys,74.84,6,Marion Diaz,Dickinson,74.03,233.6,129.27,199.58,562.45,Single-ply,SBD,M
Boys,74.84,7,Angel Navarro,Crosby,74.39,210.92,113.4,215.46,539.77,Single-ply,SBD,M
Boys,74.84,8,Kaku Asare,Conroe Woodlands College Park,70.85,215.46,113.4,192.78,521.63,Single-ply,SBD,M
Boys,74.84,9,Noah Delahoussaye,Montgomery,71.21,206.38,106.59,190.51,503.49,Single-ply,SBD,M
Boys,74.84,10,Ryan Hoffart,Splendora,72.76,174.63,120.2,204.12,498.95,Single-ply,SBD,M
Boys,,NS,Justin Daffin,Beaumont West Brook,,,,,,Single-ply,SBD,M
Boys,74.84,DQ,Jared Hernandez,Texas City,74.39,,,,,Single-ply,SBD,M
Boys,82.1,1,Mason Rey,Conroe,78.65,249.48,131.54,217.72,598.74,Single-ply,SBD,M
Boys,82.1,2,Triston Amason,Dickinson,79.38,213.19,129.27,244.94,587.4,Single-ply,SBD,M
Boys,82.1,3,Beau Ramos,Texas City,76.84,249.48,122.47,213.19,585.13,Single-ply,SBD,M
Boys,82.1,4,Nicholas Werner,Port Neches-Groves,78.11,231.33,154.22,199.58,585.13,Single-ply,SBD,M
Boys,82.1,5,Cedric Lee,Port Arthur Memorial,79.11,197.31,129.27,238.14,564.72,Single-ply,SBD,M
Boys,82.1,6,Michael Morris #2,Splendora,77.02,206.38,133.81,222.26,562.45,Single-ply,SBD,M
Boys,82.1,7,Dalton Reichardt,Friendswood Clear Brook,79.02,208.65,127.01,208.65,544.31,Single-ply,SBD,M
Boys,82.1,8,Colby Mouton,Dickinson,78.38,215.46,124.74,190.51,530.7,Single-ply,SBD,M
Boys,82.1,9,Colton Canada,Montgomery,81.37,199.58,129.27,199.58,528.44,Single-ply,SBD,M
Boys,82.1,10,Anthony Lindsey,Manvel,80.74,204.12,117.93,204.12,526.17,Single-ply,SBD,M
Boys,82.1,DQ,Steve Hendrix,Nederland,79.83,213.19,,,,Single-ply,SBD,M
Boys,82.1,DQ,Ian Irby,Conroe The Woodlands,80.47,190.51,,,,Single-ply,SBD,M
Boys,89.81,1,Roy Kelley,Conroe,88.54,308.44,158.76,297.1,764.3,Single-ply,SBD,M
Boys,89.81,2,Caleb Johnson #4,Lumberton,89.72,276.69,176.9,263.08,716.68,Single-ply,SBD,M
Boys,89.81,3,Blake Shafer,Vidor,87.82,283.5,142.88,249.48,675.85,Single-ply,SBD,M
Boys,89.81,4,Jonathan Jones #4,Willis,89.18,229.06,154.22,272.16,655.44,Single-ply,SBD,M
Boys,89.81,5,Ali Jumili,Conroe The Woodlands,89.72,249.48,149.69,256.28,655.44,Single-ply,SBD,M
Boys,89.81,6,Walker Holverson,Tomball,88.36,249.48,136.08,258.55,644.1,Single-ply,SBD,M
Boys,89.81,7,Dustin Tatar,Vidor,88.18,240.4,142.88,256.28,639.57,Single-ply,SBD,M
Boys,89.81,8,Jorge Ochoa,Beaumont West Brook,89.18,251.74,147.42,235.87,635.03,Single-ply,SBD,M
Boys,89.81,9,Dakota Piper,Livingston,88.99,231.33,151.95,222.26,605.55,Single-ply,SBD,M
Boys,89.81,10,Yvan Andrew,Texas City,88.54,222.26,122.47,249.48,594.21,Single-ply,SBD,M
Boys,89.81,DQ,Dylan Bates,Conroe Oak Ridge,88.18,301.64,167.83,,,Single-ply,SBD,M
Boys,89.81,DQ,Sterling Winzor,Beaumont Ozen,86.73,219.99,,,,Single-ply,SBD,M
Boys,99.79,1,Joe Thomas,Beaumont Ozen,98.34,315.25,154.22,285.76,755.23,Single-ply,SBD,M
Boys,99.79,2,Jacob Fussell,Lumberton,96.71,283.5,154.22,251.74,689.46,Single-ply,SBD,M
Boys,99.79,3,Noah Clarkson,Magnolia West,98.7,274.42,167.83,247.21,689.46,Single-ply,SBD,M
Boys,99.79,4,Josh Ferguson,Katy Taylor,90.72,265.35,163.29,251.74,680.39,Single-ply,SBD,M
Boys,99.79,5,Kallen Miller,Montgomery,98.97,272.16,142.88,254.01,669.05,Single-ply,SBD,M
Boys,99.79,6,Jose Rodriguez #6,Dickinson,97.61,260.82,142.88,254.01,657.71,Single-ply,SBD,M
Boys,99.79,7,Daniel Parr,Dickinson,98.43,272.16,142.88,242.67,657.71,Single-ply,SBD,M
Boys,99.79,8,Brandon Diaz,Crosby,94.8,272.16,142.88,224.53,639.57,Single-ply,SBD,M
Boys,99.79,9,Isaac Guinn,Friendswood Clear Brook,94.8,244.94,149.69,222.26,616.89,Single-ply,SBD,M
Boys,99.79,10,Noah Bryson,Magnolia West,95.89,251.74,122.47,242.67,616.89,Single-ply,SBD,M
Boys,99.79,11,Cole Wade,Magnolia West,93.71,249.48,136.08,226.8,612.35,Single-ply,SBD,M
Boys,99.79,DQ,Tony Ciccio,Vidor,93.53,,,,,Single-ply,SBD,M
Boys,109.77,1,Kevin Nguyen #9,Friendswood Clear Brook,108.41,303.91,176.9,267.62,748.43,Single-ply,SBD,M
Boys,109.77,2,Gavin Franklin,Conroe Oak Ridge,107.5,294.84,170.1,272.16,737.09,Single-ply,SBD,M
Boys,109.77,3,Marcus Garza,Conroe Caney Creek,109.77,299.37,167.83,247.21,714.41,Single-ply,SBD,M
Boys,109.77,4,Derek Parish,Pearland,109.04,272.16,204.12,231.33,707.6,Single-ply,SBD,M
Boys,109.77,5,Hunter Grimmett,Montgomery,104.96,274.42,165.56,240.4,680.39,Single-ply,SBD,M
Boys,109.77,6,Josh Costo,Conroe The Woodlands,100.15,263.08,154.22,226.8,644.1,Single-ply,SBD,M
Boys,109.77,7,Logan McDaniel,Vidor,101.6,258.55,136.08,249.48,644.1,Single-ply,SBD,M
Boys,109.77,8,Dylan Weaver,Conroe,108.14,256.28,120.2,265.35,641.83,Single-ply,SBD,M
Boys,109.77,9,Tyler Ray,Santa Fe,104.96,272.16,142.88,219.99,635.03,Single-ply,SBD,M
Boys,109.77,10,Nick Johnston,Conroe,104.96,263.08,161.03,204.12,628.23,Single-ply,SBD,M
Boys,109.77,11,Caleb Diehl,Tomball,109.41,231.33,151.95,235.87,619.15,Single-ply,SBD,M
Boys,109.77,12,Michael Hoy,Dayton,107.05,208.65,142.88,256.28,607.81,Single-ply,SBD,M
Boys,124.74,1,Colby Thomas,Manvel,124.74,260.82,179.17,254.01,694,Single-ply,SBD,M
Boys,124.74,2,Niko Afuhaamango,Pearland,111.67,265.35,179.17,247.21,691.73,Single-ply,SBD,M
Boys,124.74,3,Dalton Poteet,Vidor,113.04,272.16,179.17,204.12,655.44,Single-ply,SBD,M
Boys,124.74,4,Nathaniel Sandoval,Conroe Caney Creek,112.04,244.94,165.56,226.8,637.3,Single-ply,SBD,M
Boys,124.74,5,Jacob Thompson,Conroe,116.39,254.01,145.15,231.33,630.49,Single-ply,SBD,M
Boys,124.74,6,Roberto Torres,Texas City,119.66,240.4,163.29,213.19,616.89,Single-ply,SBD,M
Boys,124.74,7,Brandon Rangel,Dickinson,120.11,272.16,124.74,219.99,616.89,Single-ply,SBD,M
Boys,124.74,8,Aj Maestre,Conroe The Woodlands,115.39,249.48,151.95,210.92,612.35,Single-ply,SBD,M
Boys,124.74,9,Max Joiner,Conroe,117.93,272.16,149.69,190.51,612.35,Single-ply,SBD,M
Boys,124.74,10,Manuel Alamanza,New Caney,118.3,235.87,138.35,231.33,605.55,Single-ply,SBD,M
Boys,124.74,11,Jason Vargas,Willis,117.3,238.14,124.74,204.12,566.99,Single-ply,SBD,M
Boys,124.74,DQ,Kainen Collins,Port Arthur Memorial,124.74,242.67,151.95,,,Single-ply,SBD,M
Boys,124.74+,1,Terry Carter,Livingston,157.94,340.19,174.63,317.51,832.34,Single-ply,SBD,M
Boys,124.74+,2,Max Balette,Pearland Dawson,137.44,294.84,172.37,260.82,728.02,Single-ply,SBD,M
Boys,124.74+,3,Jimmy White,Willis,134.17,303.91,174.63,247.21,725.75,Single-ply,SBD,M
Boys,124.74+,4,Bernard Childs,Channelview,146.15,274.42,147.42,254.01,675.85,Single-ply,SBD,M
Boys,124.74+,5,Ronald Williams,Texas City,131,290.3,145.15,235.87,671.32,Single-ply,SBD,M
Boys,124.74+,6,Brent Holmes,Conroe Caney Creek,131.27,272.16,156.49,240.4,669.05,Single-ply,SBD,M
Boys,,NS,Christian Shanahan,Magnolia,,,,,,Single-ply,SBD,M
Boys,,NS,Bryan Hayes,La Porte,,,,,,Single-ply,SBD,M
Boys,,NS,Jordan Crawford,Pearland,,,,,,Single-ply,SBD,M
Boys,124.74+,DQ,Bayden Pethtel,Texas City,140.98,290.3,188.24,,,Single-ply,SBD,M
Boys,124.74+,DQ,Hunter Crooks,Dayton,136.35,283.5,170.1,,,Single-ply,SBD,M
Boys,124.74+,DQ,Thomas Ratka,Alvin,128,,,,,Single-ply,SBD,M
