234127 419687 449
986275 278905 525
256584 429691 449
826846 381730 509
624515 815551 509
490570 468572 413
552736 815053 509
192512 890727 525
611441 122223 470
325583 986326 525
364466 322455 441
25197 821322 509
748662 719957 424
873672 59956 525
439215 332312 449
524359 730724 509
648502 247908 509
899347 953593 507
798890 173285 509
722651 302395 509
393284 948489 525
573925 743751 509
741359 558611 509
778661 137391 509
333230 741984 509
801908 272309 509
160962 889480 525
713267 717993 380
847911 295736 525
602938 544740 452
476087 250905 449
452265 502214 444
627117 489004 509
52219 870061 525
290303 323197 384
171702 305515 443
276261 937942 525
806559 258013 509
954048 231932 525
500297 257197 449
674298 595861 509
745138 879834 525
491180 735101 509
799 372018 443
367089 872461 525
110425 987288 525
554071 743130 509
873466 150403 525
765712 432847 509
411936 973468 525
954438 185959 525
700 417606 449
428625 293324 449
986946 714082 525
6563 959997 525
78668 416082 449
752873 576779 509
418042 124328 449
289156 238467 407
244340 809037 509
667569 400489 509
812421 713995 468
510776 489312 426
514930 612847 452
942655 562183 525
994057 304699 525
985178 50973 525
18981 442113 449
345559 125636 443
666230 663062 442
700483 448437 509
289983 407238 441
690251 336013 509
571247 70512 470
74592 488314 449
201753 762623 509
636314 858832 525
490799 436667 444
152757 436489 449
12690 173645 383
128540 656424 509
528038 168123 470
199133 228905 386
236772 528407 470
992759 676493 525
281844 361794 441
500821 781904 509
969572 912993 507
560676 596739 434
156774 171985 370
842630 276810 525
432601 804590 509
866946 918510 476
971725 679749 525
611153 993062 525
488999 737582 509
622381 283652 470
52306 358675 443
925574 599497 525
636211 20669 509
766389 731073 424
84419 610067 470
196489 503215 449
607190 833154 509
711325 282311 509
677761 945723 525
895130 8329 525
839192 759646 525
973546 145659 525
339579 702998 509
697809 23032 509
547208 91505 470
737537 703046 504
434470 453935 400
506210 891708 525
369152 647596 509
119142 88888 354
873838 32074 525
48078 965211 525
387005 16026 443
611595 112852 470
347695 488654 449
23341 177285 383
542621 157525 470
191523 593403 470
842884 723169 525
251182 793044 509
925762 751358 525
728074 552610 509
291788 682612 509
928147 89064 525
460755 594734 470
539967 731830 509
331757 666523 509
753032 522291 509
422079 591163 470
495598 277063 449
773532 749619 468
717933 579427 509
150557 422054 449
789236 929144 525
892360 751939 525
705744 453762 509
307809 120518 443
59299 373067 443
661644 406075 509
309650 990299 525
302817 378608 441
161846 280148 443
358562 978246 525
995722 899632 507
747554 321742 509
631353 683697 442
485872 968292 525
898678 201821 525
474 876980 525
842025 683024 525
183268 987505 525
892155 115441 525
805897 273300 509
559753 488813 470
215905 868486 525
75743 619785 470
522161 72239 470
677371 464650 509
980351 160179 525
544301 130850 470
815820 75438 509
237886 695563 509
363700 8123 443
956173 945235 414
142546 385590 443
902794 359170 525
484326 870012 525
678982 887164 525
521245 519527 364
435027 920124 525
471074 505158 426
639448 694159 442
58469 185453 383
755898 570319 509
316803 695453 509
561807 415124 470
429186 484532 444
960495 541402 525
194159 882381 525
320936 355394 441
20136 787437 509
891551 611699 525
636941 988125 525
746761 812268 468
68404 586501 470
233683 640881 509
955870 857484 507
221394 347062 443
318475 539655 470
845684 308505 525
678312 233322 509
299865 703556 509
928709 934517 414
636580 519078 509
507043 167609 449
447101 516061 470
366762 857010 525
151934 739631 509
446965 407370 449
505586 728578 509
675555 215038 509
173113 361986 443
555505 603029 434
846328 721316 525
706338 20404 509
544389 72292 470
564974 940402 525
372363 154145 443
301849 305972 340
523995 503435 470
86026 778629 509
758213 310262 509
497866 792827 509
467376 285234 449
392812 892323 525
336518 863131 525
370728 144823 443
3590 455233 449
835336 555080 509
895121 737108 525
445170 934016 525
29716 734670 509
264934 392090 441
776629 998107 525
143274 464624 449
791553 272339 509
129399 449970 449
978279 38627 525
502775 499651 426
355609 154205 443
854036 898547 445
670337 450166 509
218102 49827 386
661821 827498 504
323145 250047 407
363696 184740 443
671659 367632 509
268190 862550 525
384901 653747 509
699849 803815 504
140598 90202 354
179186 977133 525
437830 502881 444
695992 392326 509
125652 558310 470
18152 350115 443
402124 819761 509
806964 897723 525
674120 57768 509
959454 54001 525
899347 286969 525
691031 564058 509
97214 366189 443
926527 783398 525
772393 999042 525
753282 602971 509
415503 734442 509
261029 554623 470
786654 434390 509
981891 939585 458
443995 871407 525
338694 213920 443
321854 381404 441
556243 500669 470
871454 469361 525
889630 538863 525
748342 604000 509
914927 143480 525
943971 79964 525
596503 923687 525
878495 110472 525
583837 471589 470
463602 759733 509
87488 502520 449
374147 906965 525
525373 842587 525
998489 413321 525
618212 577954 447
927694 322932 525
810946 429691 509
24434 302562 443
793136 476611 509
283791 908390 525
475039 438716 444
644616 242610 509
572986 120596 470
672998 988711 525
216592 39144 386
435075 59187 449
436906 692851 509
379450 915334 525
177996 356020 443
418735 698986 509
