module data-furnishing-tooling

go 1.19

require (
	github.com/moov-io/metro2 v0.6.1
	github.com/sirupsen/logrus v1.9.3
	github.com/spf13/cobra v1.7.0
)

require (
	github.com/davecgh/go-spew v1.1.1 // indirect
	github.com/go-kit/log v0.2.1 // indirect
	github.com/go-logfmt/logfmt v0.6.0 // indirect
	github.com/inconshreveable/mousetrap v1.1.0 // indirect
	github.com/moov-io/base v0.45.1 // indirect
	github.com/pmezard/go-difflib v1.0.0 // indirect
	github.com/spf13/pflag v1.0.5 // indirect
	github.com/stretchr/objx v0.5.0 // indirect
	github.com/stretchr/testify v1.8.4 // indirect
	go.uber.org/mock v0.2.0 // indirect
	golang.org/x/sys v0.11.0 // indirect
	gopkg.in/yaml.v3 v3.0.1 // indirect
)

replace github.com/moov-io/metro2 => ../metro2
