{
  "swagger": "2.0",
  "info": {
    "title": "Uipath",
    "description": "API for demo.uipath.com",
    "version": "0.0.1"
  },
  "host": "demo.uipath.com",
  "schemes": [
    "https"
  ],
  "paths": {
    "/odata/Queues/UiPathODataSvc.AddQueueItem()": {
      "post": {
        "tags": [
          "Odata"
        ],
        "description": "Add Queue Item",
        "operationId": "Add_Queue_Item",
        "consumes": [
          "application/json"
        ],
        "produces": [
          "application/json"
        ],
        "parameters": [
          {
            "name": "QueueItem",
            "in": "body",
            "description": "Specific Content",
            "required": true,
            "schema": {
              "$ref": "#/definitions/QueueItem"
            }
          }
        ],
        "responses": {
          "200": {
            "description": "OK",
            "schema": {
              "$ref": "#/definitions/QueueItemResponse"
            },
            "examples": {
              "application/json": {
                "@odata.context": "https://demo.uipath.com/odata/$metadata#queueItem/$entity",
                "QueueDefinitionId": 1917,
                "ProcessingExceptionId": null,
                "OutputData": null,
                "Status": "New",
                "ReviewStatus": "None",
                "Key": "5fbaca10-2e9b-4d1f-8f55-82afee493559",
                "Reference": null,
                "ProcessingExceptionType": null,
                "DueDate": null,
                "Priority": "Low",
                "DeferDate": null,
                "StartProcessing": null,
                "EndProcessing": null,
                "SecondsInPreviousAttempts": 0,
                "AncestorId": null,
                "RetryNumber": 0,
                "SpecificData": "{\"DynamicProperties\":{\"myTestValue\":\"Test at 3:35 PM\"}}",
                "CreationTime": "2017-11-03T17:47:35.8964334Z",
                "Progress": null,
                "RowVersion": "AAAAAABUhhI=",
                "Id": 1828715,
                "SpecificContent": {
                  "myTestValue": "Test at 3:35 PM"
                },
                "Output": null
              }
            }
          }
        },
        "security": []
      }
    },
    "/odata/Jobs/UiPath.Server.Configuration.OData.StartJobs": {
      "post": {
        "tags": [
          "Odata"
        ],
        "description": "Jobs",
        "operationId": "StartJobs",
        "consumes": [
          "application/json"
        ],
        "parameters": [
          {
            "name": "StartInfo",
            "in": "body",
            "description": "A Model for StartInfo",
            "required": true,
            "schema": {
              "$ref": "#/definitions/StartJobs"
            }
          }
        ],
        "responses": {
          "200": {
            "description": "OK"
          }
        },
        "security": []
      }
    },
    "/api/account/authenticate": {
      "post": {
        "tags": [],
        "description": "Account Authentication",
        "operationId": "authenticate",
        "consumes": [
          "application/json"
        ],
        "parameters": [
          {
            "name": "AccountDetails",
            "in": "body",
            "description": "A Model for AccountDetails",
            "required": true,
            "schema": {
              "$ref": "#/definitions/AccountDetails"
            }
          }
        ],
        "responses": {
          "200": {
            "description": "OK",
            "schema": {
              "$ref": "#/definitions/AuthenticationResponse"
            }
          }
        },
        "security": []
      }
    }
  },
  "definitions": {
    "AccountDetails": {
      "description": "Model for AccountDetails",
      "required": [
        "tenancyName",
        "usernameOrEmailAddress",
        "password"
      ],
      "properties": {
        "tenancyName": {
          "type": "string",
          "x-example": "K2"
        },
        "usernameOrEmailAddress": {
          "type": "string",
          "x-example": "admin"
        },
        "password": {
          "type": "string",
          "x-example": "K2R0ck5!"
        }
      }
    },
    "AuthenticationResponse": {
      "description": "Model for Authentication Response",
      "properties": {
        "result": {
          "type": "string"
        },
        "targetUrl": {
          "type": "string"
        },
        "success": {
          "type": "boolean"
        },
        "error": {
          "type": "string"
        },
        "unAuthorizedRequest": {
          "type": "boolean"
        },
        "__abp": {
          "type": "boolean"
        }
      }
    },
    "StartInfo": {
      "description": "Model for StartInfo",
      "required": [
        "NoOfRobots"
      ],
      "properties": {
        "NoOfRobots": {
          "type": "integer",
          "format": "int32",
          "x-example": "0"
        },
        "ReleaseKey": {
          "type": "string",
          "x-example": "ebc46c63-042c-4c88-bc86-7462b68970e6"
        },
        "RobotIds": {
          "type": "array",
          "items": {
            "type": "integer",
            "format": "int32"
          },
          "x-example": "[6579]"
        },
        "Strategy": {
          "type": "string",
          "x-example": "Specific"
        }
      }
    },
    "StartJobs": {
      "description": "Model for StartJobs",
      "required": [
        "startInfo"
      ],
      "properties": {
        "startInfo": {
          "$ref": "#/definitions/StartInfo",
          "x-example": "{\n  \"ReleaseKey\": \"ebc46c63-042c-4c88-bc86-7462b68970e6\",\n  \"RobotIds\": [\n    6579\n  ],\n  \"NoOfRobots\": 0,\n  \"Strategy\": \"Specific\"\n}"
        }
      }
    },
    "QueueItemResponse": {
      "description": "Model for QueueItemResponse",
      "required": [
        "AncestorId"
      ],
      "properties": {
        "AncestorId": {
          "type": "string",
          "x-example": ""
        },
        "CreationTime": {
          "type": "string",
          "format": "date-time",
          "x-example": "2017-11-03T17:47:35.8964334Z"
        },
        "DeferDate": {
          "type": "string",
          "x-example": ""
        },
        "DueDate": {
          "type": "string",
          "x-example": ""
        },
        "EndProcessing": {
          "type": "string",
          "x-example": ""
        },
        "Id": {
          "type": "integer",
          "format": "int32",
          "x-example": "1828715"
        },
        "Key": {
          "type": "string",
          "x-example": "5fbaca10-2e9b-4d1f-8f55-82afee493559"
        },
        "Output": {
          "type": "string",
          "x-example": ""
        },
        "OutputData": {
          "type": "string",
          "x-example": ""
        },
        "Priority": {
          "type": "string",
          "x-example": "Low"
        },
        "ProcessingExceptionId": {
          "type": "string",
          "x-example": ""
        },
        "ProcessingExceptionType": {
          "type": "string",
          "x-example": ""
        },
        "Progress": {
          "type": "string",
          "x-example": ""
        },
        "QueueDefinitionId": {
          "type": "integer",
          "format": "int32",
          "x-example": "1917"
        },
        "Reference": {
          "type": "string",
          "x-example": ""
        },
        "RetryNumber": {
          "type": "integer",
          "format": "int32",
          "x-example": "0"
        },
        "ReviewStatus": {
          "type": "string",
          "x-example": "None"
        },
        "RowVersion": {
          "type": "string",
          "x-example": "AAAAAABUhhI="
        },
        "SecondsInPreviousAttempts": {
          "type": "integer",
          "format": "int32",
          "x-example": "0"
        },
        "SpecificContent": {
          "$ref": "#/definitions/SpecificContent",
          "x-example": "{\n  \"myTestValue\": \"Test at 3:35 PM\"\n}"
        },
        "SpecificData": {
          "type": "string",
          "x-example": "{\"DynamicProperties\":{\"myTestValue\":\"Test at 3:35 PM\"}}"
        },
        "StartProcessing": {
          "type": "string",
          "x-example": ""
        },
        "Status": {
          "type": "string",
          "x-example": "New"
        }
      }
    },
    "SpecificContent": {
      "description": "Model for SpecificContent",
      "required": [
        "myTestValue"
      ],
      "properties": {
        "myTestValue": {
          "type": "string",
          "x-example": "Test at 3:35 PM"
        },
        "InputValue1": {
          "type": "string",
          "x-example": "Test Input Value"
        },
        "InputValue2": {
          "type": "string",
          "x-example": "Test Input Value"
        },
        "SerialNumber": {
          "type": "string",
          "x-example": "00_00"
        }
      }
    },
    "ItemData": {
      "description": "Model for ItemData",
      "required": [
        "DeferDate"
      ],
      "properties": {
        "DeferDate": {
          "type": "string",
          "x-example": ""
        },
        "DueDate": {
          "type": "string",
          "x-example": ""
        },
        "Name": {
          "type": "string",
          "x-example": "K2"
        },
        "Priority": {
          "type": "string",
          "x-example": "Low"
        },
        "SpecificContent": {
          "$ref": "#/definitions/SpecificContent",
          "x-example": "{\n  \"myTestValue\": \"Test at 3:35 PM\"\n}"
        }
      }
    },
    "QueueItem": {
      "description": "Model for QueueItem",
      "required": [
        "itemData"
      ],
      "properties": {
        "itemData": {
          "$ref": "#/definitions/ItemData",
          "x-example": "{\r\n  \"Name\": \"K2\",\r\n  \"Priority\": \"Low\",\r\n  \"SpecificContent\": {\r\n    \"myTestValue\": \"Test at 3:35 PM\"\r\n  },\r\n  \"DeferDate\": null,\r\n  \"DueDate\": null\r\n}"
        }
      }
    }
  },
  "securityDefinitions": {},
  "security": [],
  "tags": [
    {
      "name": "Odata",
      "description": "Operations about Odata"
    }
  ]
}