{
  "swagger": "2.0",
  "info": {
    "title": "Graph Api",
    "description": "API for graph.microsoft.com",
    "version": "0.0.0"
  },
  "host": "graph.microsoft.com",
  "basePath": "/beta",
  "schemes": [
    "https"
  ],
  "paths": {
    "/users": {
      "get": {
        "tags": [
          "Users"
        ],
        "description": "Get",
        "operationId": "get",
        "produces": [
          "application/json"
        ],
        "parameters": [
          {
            "name": "$filter",
            "in": "query",
            "description": "$filter",
            "required": true,
            "type": "string",
            "x-example": ""
          },
          {
            "name": "ConsistencyLevel",
            "in": "header",
            "description": "ConsistencyLevel",
            "required": true,
            "type": "string",
            "x-example": ""
          }
        ],
        "responses": {
          "200": {
            "description": "OK",
            "schema": {
              "$ref": "#/definitions/Get"
            },
            "examples": {
              "application/json": {
                "@odata.context": "https://graph.microsoft.com/beta/$metadata#users(userPrincipalName,onPremisesDomainName,onPremisesSamAccountName)",
                "@odata.count": 1,
                "value": [
                  {
                    "userPrincipalName": "Danel@secureflow.co.uk",
                    "onPremisesDomainName": "secureflow.co.uk",
                    "onPremisesSamAccountName": "Danel"
                  }
                ]
              }
            }
          }
        },
        "security": []
      }
    }
  },
  "definitions": {
    "Value": {
      "description": "Model for Value",
      "required": [
        "onPremisesDomainName"
      ],
      "properties": {
        "onPremisesDomainName": {
          "type": "string",
          "x-example": "secureflow.co.uk"
        },
        "onPremisesSamAccountName": {
          "type": "string",
          "x-example": "Danel"
        },
        "userPrincipalName": {
          "type": "string",
          "x-example": "Danel@secureflow.co.uk"
        }
      }
    },
    "Get": {
      "description": "Model for Get",
      "required": [
        "value"
      ],
      "properties": {
        "value": {
          "type": "array",
          "items": {
            "$ref": "#/definitions/Value"
          },
          "x-example": "[\n  {\n    \"userPrincipalName\": \"Danel@secureflow.co.uk\",\n    \"onPremisesDomainName\": \"secureflow.co.uk\",\n    \"onPremisesSamAccountName\": \"Danel\"\n  }\n]"
        }
      }
    }
  },
  "security": [],
  "tags": [
    {
      "name": "Users",
      "description": "Operations about Users"
    }
  ]
}