<?xml version="1.0" encoding="utf-8"?>
<svg version="1.1" id="icons" xmlns="http://www.w3.org/2000/svg" xmlns:xlink="http://www.w3.org/1999/xlink" x="0px" y="0px"
	 viewBox="0 0 45 45" style="enable-background:new 0 0 45 45;" xml:space="preserve" class="gf-svg">
<path class="st0" d="M13.3,7.3v32c-0.1,1.2,0.8,2.2,2,2.2h17.5c1.2-0.1,2.1-1.1,2-2.2v-32c0.1-2-1.4-3.7-3.4-3.8H16.8
	C14.8,3.6,13.2,5.3,13.3,7.3z"/>
<rect x="16" y="8.2" class="st1" width="16.1" height="27.5"/>
<circle class="st1" cx="13.3" cy="27.6" r="11.4"/>
<polyline class="st1" points="5.9,13.8 19,11.1 19,13.7 "/>
<polyline class="st1" points="5.8,35.5 5.8,13.8 22.1,13.8 22.1,34.6 "/>
<path class="st1" d="M17.9,23.7c0.1-2.2-1.7-4-3.9-4.1c-0.6,0-1.1,0.1-1.6,0.4c-1.1,0.6-1.9,1.6-2.2,2.8c-0.1,0.3-0.1,0.6-0.1,0.9"
	/>
<line class="st2" x1="9.4" y1="23.8" x2="18.6" y2="23.8"/>
<circle class="st2" cx="14" cy="18.8" r="0.2"/>
<line class="st2" x1="8.9" y1="28.7" x2="19.1" y2="28.7"/>
<line class="st2" x1="8.9" y1="31.4" x2="19.1" y2="31.4"/>
<line class="st3" x1="24.1" y1="38.5" x2="24.1" y2="38.5"/>
</svg>
