696043 977444
35563 168259
952098 942943
814036 122617
628777 186857
697108 128754
650630 832576
973520 689060
776592 782216
728762 644329
75535 762931
54727 256580
139283 447240
640626 730733
746096 550626
364162 419449
581054 127049
227671 239469
297615 846135
190095 178678
669933 820443
23542 832176
899006 146224
958982 369906
793209 921332
558227 780480
139570 439230
397838 741088
793212 855114
926821 915345
492473 654451
956892 216200
519559 292166
574421 700062
111470 158821
297820 837039
959491 734656
779173 912751
419596 895156
995342 137264
462331 586591
499699 353042
282439 749944
370777 263379
514560 564761
509579 446320
527155 864747
651688 317470
723304 458196
1617 532585
970465 378256
867553 450372
860457 419303
537105 472791
45179 530842
200900 264098
469260 237340
431811 536985
932320 823740
598027 329229
638428 123682
351791 405363
768979 567144
42472 758349
258314 81535
323637 305687
79475 783364
260673 491464
601010 45828
43926 392034
149186 12477
293126 324320
212682 860068
825950 455379
705500 337167
175767 930351
783770 733717
797239 453206
100765 412426
932879 626044
438030 507837
35965 995125
367004 505935
906201 610027
556369 334853
534570 222932
298315 605031
57453 129990
465369 629451
591060 978886
168224 543673
135135 852754
192433 96189
788524 111761
221410 659733
194692 636992
229244 634818
179781 560729
513983 87012
396859 134510
694320 82952
437288 569156
111216 514444
487257 220137
167883 716582
53464 797104
853064 578144
373232 472134
877964 128138
483385 392442
743009 561808
655423 183894
484600 37467
510391 33611
286312 366323
557249 957479
877080 856119
690554 480719
306145 109445
973025 234132
812990 663787
997355 429448
22729 37527
814198 264647
244271 501540
807427 433105
57115 689503
446156 374581
476693 680186
46955 406634
133998 222837
882980 606322
100424 559650
236432 294123
124241 378149
403391 339637
120565 401708
877369 49733
715456 870057
527648 806721
714045 332910
949757 4415
875170 237749
995356 251476
948227 461377
945186 997581
288325 72735
561011 538575
343090 601617
597672 962687
895420 829270
51933 253322
734341 138538
162118 662020
950373 951618
637977 686402
987729 696647
246201 169703
310327 774183
343116 563461
829013 267240
56608 710222
276900 173143
701682 567109
489432 5708
255426 998946
113684 118002
393527 852153
260926 862317
712332 334495
985978 786228
467809 966644
941232 363059
407579 856981
498236 962454
35991 96516
677137 781698
520691 917082
874766 540970
682988 743604
2548 766520
308260 185864
111997 453726
653237 461928
775425 987602
147335 518882
991475 821454
310723 552336
712379 382793
132448 147456
102697 28509
692842 113803
756465 899558
782186 689518
843845 813752
672924 540422
704659 488319
498509 682077
494481 506947
301863 834529
126655 579723
344255 579415
923454 169793
23383 137421
753875 863253
931147 150454
528775 442441
818210 432078
4187 181991
739709 261169
977009 107132
873713 323904
761400 197856
74401 369711
868990 240243
574288 511732
785687 150696
608111 386098
277754 762934
829937 69067
385070 66695
581787 539654
980967 789578
293279 570390
180591 391324
566393 147089
126635 637428
465827 2123
507392 852751
885252 125323
9792 394150
549917 835744
417971 321122
556174 698212
55992 59031
81520 745658
646037 324709
568593 841718
827644 344407
529913 791583
203648 463862
115494 674053
499462 374154
651222 95797
599081 390478
874950 807944
698003 288829
312039 27403
21912 13648
