489541 734914
481514 692704
687173 208166
952602 127091
311699 738994
502770 280664
399412 535550
630851 515753
452913 846527
942202 566901
698802 353025
9749 471838
18161 910806
157649 882625
418331 22103
491944 337204
755824 781855
213967 599557
855283 690913
403297 657368
970153 864938
954798 871790
352992 682932
158256 121474
639787 768629
870599 57068
178000 736851
527773 288149
855720 741313
11105 35367
223010 181033
132420 624869
421086 976097
915367 562394
53719 806617
969979 291093
328315 182333
995618 887274
984884 572947
999896 847936
670352 646477
558665 851830
712066 790151
522944 333802
799541 247016
472094 479396
850912 945325
320360 624379
612376 35058
523320 838464
140677 729442
431233 190479
695625 345134
768992 747155
405816 701551
807823 944503
437365 568709
421386 428877
68395 6259
217379 950452
842423 857753
750434 34965
138188 666562
779741 132394
194448 468503
229714 957902
598049 830321
968880 505130
548974 324212
283677 501649
467917 528560
904404 619059
957978 877641
864193 897259
745836 540894
209051 348563
742460 756361
925635 852767
549151 586010
870527 509043
926368 949603
808831 479442
550099 287833
951599 271570
415969 197708
68786 730255
930000 846463
408815 300763
481143 708552
275757 630426
414564 241711
545625 598924
920787 477277
776834 636729
19824 913502
200027 8289
345426 395904
603704 495557
270015 599960
247275 126455
839592 571084
65742 381474
405044 729578
142152 994032
600978 371252
880249 911089
958759 358926
949077 831913
682840 273013
442844 466687
684712 169724
510758 373163
694812 155399
251863 158641
916235 483861
66810 392983
594676 566490
459194 33673
532394 73403
530199 665702
917960 963673
652846 613678
514642 81197
927311 302318
106857 617784
482561 911290
41467 537045
948094 491015
486539 154214
622406 127815
326912 833498
62783 723597
117270 549517
284268 868078
136963 132121
311696 722362
933644 362656
434395 660711
869245 80838
472614 702147
390251 758642
245407 844320
467222 29118
33766 46864
493294 263141
224453 198633
772535 1430
790192 597421
358640 356632
699641 340506
471903 311166
894031 735297
745946 527159
295213 569615
494725 1035
194660 249950
372166 245305
124060 870878
15773 109959
584760 938034
61552 793612
932947 835558
427398 558470
645725 847563
864312 612749
474166 66500
497415 55412
269188 5053
863187 609864
545800 765475
894924 662212
551789 543242
129652 103835
689143 544625
567347 110265
834195 964030
933614 535717
472612 430126
156167 985678
651235 818608
680082 108579
548288 83885
391411 763538
98942 5970
491345 409169
704073 441032
253778 525950
918781 913507
909439 750487
323038 68067
402406 542792
413091 679820
361296 664562
926191 282879
705829 836468
670805 190209
516762 774115
857105 273476
846864 632688
834720 758879
628482 301200
2575 391430
8629 51712
834603 760417
162590 316237
374650 390450
560317 221319
902231 367899
159634 994857
483530 668678
604953 50611
62623 228504
720864 515640
225687 520797
558804 611555
385856 764787
206769 780692
312642 493421
444232 278406
906918 484574
697298 879586
773629 453395
988913 399529
235861 535551
655275 33928
443893 809740
352761 498279
606675 864213
555881 186901
238696 915892
9537 905152
322493 718276
518743 336831
323294 163280
385133 472389
957299 914202
625531 292675
947609 174808
354298 664701
170120 979594
44411 860607
531746 965380
