743083 867290
483874 814574
988083 903201
683924 321102
43306 966473
287582 377867
917739 961718
792301 113365
812321 867637
915514 387070
611162 525407
479447 706533
429061 951186
264969 741468
2881 382318
731595 176233
126409 785872
609012 94901
646299 458213
640185 169116
80702 703263
911186 25571
949540 603892
946752 418476
231676 385577
25700 139197
444801 116521
310364 502375
890472 301224
709336 945111
986873 390049
383751 986175
18251 465148
531243 106252
16395 586062
425685 802301
871099 740160
272848 264583
359453 733635
667258 297140
965687 134139
348101 198179
811772 96899
116509 319515
800625 378419
677074 387366
755454 557866
474550 218718
43152 581837
221871 729445
256815 902095
719719 228427
574522 440866
428317 444531
514853 226886
6578 442402
298633 539135
510328 666672
920546 229830
310952 758186
868124 424137
358714 757894
495439 388192
994670 706559
337273 510646
533471 848515
86084 451758
338947 248429
563729 602523
332531 243373
310911 930032
456696 82521
567324 234526
314804 859865
658730 115309
337801 486439
558806 663696
714445 381370
779085 517272
764712 694203
763953 18786
311117 905605
898733 878707
303808 914916
648769 127421
148880 753526
114781 716858
818182 952770
880503 906351
781059 350298
906285 784896
786710 18188
258355 376404
963659 423217
715113 267362
769424 34826
950747 105161
297172 719201
536303 648511
357163 582526
264001 248705
102964 809818
629311 679498
95614 307904
425425 144400
922081 514208
992638 804545
504111 651353
555319 999817
23059 407200
194196 521610
12683 456081
736329 711755
973423 206784
228473 826676
518958 497459
917310 336321
809338 265095
431998 37522
981416 914247
32841 546208
348815 982464
872262 789979
92937 775042
739757 993317
900597 105090
842543 729251
648817 874653
807934 436074
527460 193137
566721 962762
804350 589825
259737 347938
737252 897903
967293 725121
916840 522413
210053 653012
647659 56600
915847 382299
724716 760267
447059 994682
975312 465220
807659 228303
518683 756435
58450 654216
968289 436064
918860 603629
22621 982832
3160 545727
952690 776047
246325 981885
118814 883290
95138 225198
76899 355201
370019 477038
191272 667416
40506 283783
489464 932764
857189 580663
466870 768022
862291 198538
537346 581490
214765 646353
438299 103825
195898 397031
340905 503163
762415 825426
87889 767924
798317 813262
349514 672439
765579 841384
728962 791677
498114 84428
664464 785777
160764 337963
350793 687772
478318 610289
457075 865758
309847 768812
467669 260351
793434 771310
250333 294816
210905 667228
226360 232607
591788 224329
329052 336185
472816 628372
854771 768355
849300 274977
804919 857873
227902 800012
463671 964875
46789 429123
80162 687719
888371 629910
874994 346691
576062 670151
167499 312066
753515 820055
293126 934093
882229 292447
412347 89481
447698 612796
388585 221740
295232 492201
324651 473388
696633 654421
889906 657440
477802 455701
