592010 168977 470
355500 48912 443
296287 982126 525
188624 271494 443
420545 993573 525
131888 658239 509
557687 947469 525
349455 245021 441
825062 479143 509
65777 468109 449
654342 511262 509
415610 348163 449
972487 394007 525
858789 485374 525
927512 694010 525
37554 352066 443
655092 403444 509
91600 783865 509
659206 195171 509
105934 92469 341
908463 214413 525
256753 854909 525
919531 493491 525
894194 553971 525
981447 273680 525
853297 127281 525
643237 280049 509
844770 936430 476
544067 488205 470
532521 490761 470
462973 805884 509
637215 800531 504
891399 38475 525
340250 525771 470
197656 161474 365
9071 695244 509
624096 834630 509
362621 296450 441
611710 75134 470
177884 246899 443
884564 142301 525
170952 259679 443
945540 627229 525
394138 491730 449
793623 307080 509
691867 21814 509
440918 424903 400
900323 767798 525
610245 240615 470
887713 465151 525
693701 281008 509
267641 671615 509
162337 481368 449
132127 779329 509
402927 731316 509
287314 711166 509
823446 366922 509
358862 677606 509
680045 246114 509
493921 736288 509
92407 840352 525
961907 840615 507
960968 184700 525
797373 179249 509
297865 947784 525
476804 717990 509
821983 645291 504
122423 3026 354
28626 257160 443
910554 1762 525
912577 336767 525
465996 383177 449
354222 371934 410
952372 203292 525
588903 438831 470
548968 887183 525
512503 827680 509
189983 140891 383
426158 19903 449
815098 431676 509
150913 957189 525
842048 628469 525
330395 444487 449
217817 737793 509
1576 673719 509
517506 92888 470
58164 656983 509
92095 773472 509
781372 590094 509
91050 236007 443
635141 565526 509
169707 806539 509
247271 544279 470
228828 682828 509
431444 141835 449
356109 980950 525
202744 876056 525
691841 990672 525
975745 425556 525
548992 163668 470
61707 944197 525
379178 459886 449
985002 669920 525
88615 16041 351
745001 152765 509
166798 392373 443
830943 808375 450
878976 176868 525
655973 804166 504
548784 697935 509
785459 357342 509
568858 402604 470
60621 436518 449
395495 460264 449
611331 746748 509
650943 995919 525
269155 225269 443
493038 126226 449
333730 832583 509
794371 176340 509
73983 70117 325
78169 151638 375
988456 400152 525
781025 9736 509
786105 58961 509
312987 49793 443
514582 440591 470
22680 410208 449
54466 793386 509
765729 83340 509
603300 926594 525
392769 467486 449
590702 838242 525
225386 434318 449
269911 801531 509
358487 386955 423
388411 684972 509
938580 807176 525
744815 115348 509
433526 572854 470
7894 96943 351
917562 212133 525
697510 967418 525
434646 588190 470
566028 765769 509
123491 502381 449
31594 733647 509
670594 764027 504
119841 456485 449
456110 755344 509
339247 572128 470
191757 227565 386
832013 612545 509
796232 457701 509
539134 446500 470
490974 41378 449
486792 98239 449
495044 505411 426
767788 502994 509
909846 962952 507
600243 374037 470
11879 857699 525
426801 808531 509
614627 151782 470
278525 298086 389
537586 486341 470
573725 124272 470
706268 434050 509
314532 414904 449
561687 394139 470
440712 415840 418
569025 926793 525
46240 109038 354
309569 679717 509
466784 63441 449
954515 528826 525
39862 501352 449
825570 724263 468
804425 890206 525
366632 583530 470
588118 486786 470
288738 203609 443
178410 301688 443
291413 466266 449
758023 763970 380
889442 584993 525
263573 499397 449
232054 594183 470
288292 876932 525
573014 444667 470
147418 941299 525
452120 209454 449
500592 194191 449
10996 699597 509
982650 271494 525
778599 915221 525
251275 642399 509
181332 323240 443
362048 512089 470
440366 569567 470
811694 504180 509
883922 902043 445
191647 698346 509
306795 983850 525
727776 851145 525
3935 965311 525
194094 985794 525
543609 610615 452
499256 880189 525
324688 223795 443
805088 741095 468
272445 747007 509
570339 532695 452
444308 849423 525
579701 638209 509
762264 330522 509
321091 641846 509
238540 925790 525
851149 34654 525
421988 809018 509
532950 638263 509
198963 690670 509
839889 639799 525
718588 87346 509
98844 624781 470
134247 196902 383
170378 841664 525
896439 941490 507
251281 575256 470
790395 614832 509
734784 395919 509
14849 515541 470
917472 149354 525
794602 800785 468
825692 693666 504
432899 443798 400
618151 313903 470
428408 673306 509
317025 252498 407
98611 377530 443
8706 383342 443
403006 813361 509
780702 946873 525
228821 471137 449
919114 648461 525
977825 773157 525
581877 581496 297
332270 75602 443
95819 921094 525
208907 47756 383
