527046 856139 525
866344 436949 525
165803 163366 334
174598 596264 470
181632 573800 470
772736 640777 504
335949 322100 384
851619 694492 525
749051 821955 468
379610 259715 441
445519 398839 449
979615 894834 507
200085 67906 383
703484 130604 509
540916 8334 470
904700 958327 507
490874 300471 449
731651 127509 509
29541 184890 383
352936 31315 443
896605 740997 525
549409 396119 470
825382 949619 525
339205 243676 407
425421 109389 449
183085 8177 383
250559 290615 407
201000 984859 525
936281 170532 525
868131 563831 525
665718 145383 509
513481 838834 525
669540 143624 509
775315 655045 504
705356 236587 509
570856 135027 470
237696 153279 443
365639 347346 410
771906 868697 525
781754 451004 509
21266 412865 449
765707 179525 509
74391 715305 509
219675 331303 443
726501 562195 509
142067 762913 509
574632 861989 525
552716 979497 525
387723 524749 470
720169 484101 509
851976 357561 525
337645 704697 509
989576 8921 525
299252 349502 441
427904 382481 449
573461 183896 470
996512 773713 525
570981 479453 470
281597 270966 389
961991 703791 525
369843 540720 470
136908 926749 525
733956 677668 504
860757 858269 370
392037 948147 525
49487 400154 443
871266 192610 525
130070 610053 470
672062 128490 509
761015 856724 525
505672 442877 444
272964 802195 509
605346 715370 509
222140 852201 525
916314 615707 525
590191 121973 470
752383 442319 509
879357 953146 507
186472 8365 383
834070 994923 525
669992 728599 504
55540 829630 509
233762 681516 509
982676 254979 525
902766 61024 525
55322 556849 470
312081 290345 371
804288 698068 504
881415 142370 525
255482 942646 525
27338 958527 525
885909 37773 525
124722 447308 449
11233 611367 470
366676 855589 525
332203 119744 443
498670 251602 449
477353 947355 525
419136 235938 449
300859 932144 525
310589 123264 443
654668 73940 509
35030 894508 525
464483 552596 470
635236 178434 509
79714 337780 443
285223 503144 449
362719 468983 449
243623 918189 525
761833 57662 509
874506 247355 525
912265 988702 507
936323 663223 525
294365 80360 443
38607 414894 449
659496 610197 509
689240 568067 509
811758 395424 509
738129 592754 509
765957 678942 504
373066 852985 525
545682 208708 470
674918 160645 509
742857 842410 525
275628 23824 443
400134 455413 449
820100 345569 509
125231 318352 443
428346 440307 400
924401 634548 525
605806 234082 470
717514 9821 509
821953 391937 509
830334 989789 525
457547 466945 444
269771 903295 525
114554 54420 354
56028 575520 470
854025 931654 476
462255 846230 525
610317 858866 525
741223 986916 525
932033 506784 525
960919 930000 507
990058 359743 525
39023 801997 509
872452 512970 525
631793 318819 509
27377 70509 340
257931 842484 525
731704 43896 509
87020 433205 449
220463 780807 509
356308 366023 410
685641 963369 525
281159 351896 441
884848 554272 525
266049 778130 509
677556 62871 509
633241 280943 509
458309 419165 418
555010 630824 509
499893 295167 449
188872 715140 509
248156 108099 443
733879 997428 525
724077 50835 509
51345 582563 470
715163 192852 509
50465 568671 470
917908 196902 525
579877 898021 525
738475 349229 509
926408 392367 525
795941 410370 509
278360 449409 449
758468 290349 509
417208 225088 449
908873 574472 525
389096 342022 441
276809 369541 441
410015 502305 444
268396 335606 407
671777 243494 509
995018 924847 507
980287 510139 525
271839 270668 363
86337 75599 351
195404 735436 509
126261 432195 449
68719 215390 383
762298 194770 509
260238 961155 525
83303 838688 525
823555 993771 525
883855 394520 525
153554 615527 470
163200 307170 443
38203 729866 509
631917 809502 504
171974 691257 509
757467 437094 509
852792 174651 525
231294 863085 525
319894 983382 525
910901 657928 525
839672 783800 525
307685 473256 449
518089 431222 470
432599 150024 449
995955 33004 525
735112 191741 509
755592 747221 424
277628 65922 443
696116 991231 525
523752 782731 509
915833 875033 476
378796 291348 441
309872 176353 443
161947 322183 443
593614 655791 509
90486 325878 443
806434 656978 504
259083 723277 509
579007 797618 509
337100 263952 407
656482 799901 504
875606 455968 525
790717 444201 509
327919 433257 449
385374 613460 470
418446 256591 449
853026 665455 525
609872 6126 470
34661 840358 525
743659 936455 525
920316 796755 525
194154 502140 449
35125 576125 470
395149 321201 441
292582 792875 509
967561 304584 525
367080 910638 525
625517 155270 470
391254 565921 470
173344 398055 443
168185 42693 383
6611 966855 525
921058 425218 525
716862 475465 509
40741 52278 314
45130 628419 509
647187 278615 509
38250 507531 449
953939 806625 525
134016 780190 509
79587 710673 509
649907 722219 504
534568 953912 525
790409 59532 509
925547 611988 525
996018 694115 525
963679 486405 525
958095 61950 525
438189 915951 525
602024 701875 509
987911 779456 525
579433 174923 470
314449 350075 441
957937 958075 339
711536 767965 468
475822 289076 449
489601 316297 449
564585 541812 452
406593 176080 443
637430 850774 525
300404 288241 389
487822 898414 525
230769 640998 509
863571 683458 525
984114 578430 525
321892 922594 525
347529 614197 470
253696 156493 443
265030 950841 525
966493 245771 525
749190 92286 509
850212 944225 507
347676 958571 525
280484 385081 441
219559 505326 449
211274 748267 509
565225 790767 509
327534 883293 525
521847 834355 509
446630 441633 356
158584 335240 443
146072 569298 470
80869 799831 509
459471 444809 387
