module gitlab.com/nichego.takogo.azaza/go-parser

go 1.19

require (
	github.com/PuerkitoBio/goquery v1.8.1
	github.com/Valgard/godotenv v0.0.0-20200511222744-8873b92a09c5
	github.com/go-chi/chi/v5 v5.0.10
	github.com/jmoiron/sqlx v1.3.5
	github.com/lib/pq v1.10.9
	github.com/tebeka/selenium v0.9.9
	go.mongodb.org/mongo-driver v1.12.1
)

require (
	github.com/Valgard/go-pcre v0.0.0-20200510215507-235e400e25e9 // indirect
	github.com/andybalholm/cascadia v1.3.1 // indirect
	github.com/blang/semver v3.5.1+incompatible // indirect
	github.com/golang/snappy v0.0.1 // indirect
	github.com/klauspost/compress v1.13.6 // indirect
	github.com/montanaflynn/stats v0.0.0-20171201202039-1bf9dbcd8cbe // indirect
	github.com/xdg-go/pbkdf2 v1.0.0 // indirect
	github.com/xdg-go/scram v1.1.2 // indirect
	github.com/xdg-go/stringprep v1.0.4 // indirect
	github.com/youmark/pkcs8 v0.0.0-20181117223130-1be2e3e5546d // indirect
	golang.org/x/crypto v0.0.0-20220622213112-05595931fe9d // indirect
	golang.org/x/net v0.7.0 // indirect
	golang.org/x/sync v0.0.0-20220722155255-886fb9371eb4 // indirect
	golang.org/x/text v0.7.0 // indirect
)
