{
  "editor.autoClosingBrackets": "always",
  "editor.autoClosingOvertype": "always",
  "editor.bracketPairColorization.enabled": true,
  "editor.cursorBlinking": "smooth",
  "editor.cursorSmoothCaretAnimation": true,
  "editor.cursorStyle": "underline",
  "editor.defaultFormatter": "rvest.vs-code-prettier-eslint",
  "editor.detectIndentation": true,
  "editor.fontFamily": "'Fira Code', 'MesloLGS NF', 'monospace', monospace",
  "editor.fontLigatures": true,
  "editor.fontSize": 13,
  "editor.fontWeight": "400",
  "editor.formatOnSave": true,
  "editor.inlineSuggest.enabled": true,
  "editor.suggestSelection": "first",
  "editor.tabSize": 2,
  "workbench.colorTheme": "Better Solarized Dark",
  "workbench.editor.scrollToSwitchTabs": true,
  "workbench.editorAssociations": {
    "*.ipynb": "jupyter.notebook.ipynb"
  },
  "zenMode.hideTabs": false,
  "window.zoomLevel": -1,
  "vsintellicode.modify.editor.suggestSelection": "automaticallyOverrodeDefaultValue",
  "diffEditor.ignoreTrimWhitespace": false,
  "prettier.eslintIntegration": true,
  "prettier.jsxSingleQuote": true,
  "prettier.singleQuote": true,
  "prettier.trailingComma": "all",
  "javascript.format.insertSpaceAfterOpeningAndBeforeClosingNonemptyBraces": true,
  "javascript.format.insertSpaceAfterOpeningAndBeforeClosingNonemptyParenthesis": true,
  "javascript.format.insertSpaceBeforeFunctionParenthesis": true,
  "javascript.preferences.quoteStyle": "single",
  "typescript.format.insertSpaceAfterOpeningAndBeforeClosingNonemptyBraces": true,
  "typescript.format.insertSpaceAfterOpeningAndBeforeClosingNonemptyParenthesis": true,
  "typescript.format.insertSpaceBeforeFunctionParenthesis": true,
  "typescript.reportStyleChecksAsWarnings": true,
  "typescript.preferences.quoteStyle": "single",
  "typescript.updateImportsOnFileMove.enabled": "always",
  "[typescript]": { "editor.autoClosingBrackets": "always" },
  "python.analysis.completeFunctionParens": true,
  "python.linting.pydocstyleEnabled": false,
  "python.linting.pylintArgs": [
    "--extension-pkg-whitelist=PyQt5",
    "--errors-only"
  ],
  "hediet.vscode-drawio.theme": "atlas",
  "[react]": { "editor.autoClosingBrackets": "always" },
  "tabnine.experimentalAutoImports": true
}
