{
  "medical_director": "FALSE",
  "clinical_director_-_medical": "FALSE",
  "professor": "TRUE",
  "senior_lecturer": "TRUE",
  "consultant": "TRUE",
  "dental_surgeon_acting_as_hospital_consultant": "FALSE",
  "special_salary_scale_in_public_health_medicine": "FALSE",
  "associate_specialist": "FALSE",
  "staff_grade": "FALSE",
  "hospital_practitioner": "FALSE",
  "clinical_assistant": "FALSE",
  "trust_grade_doctor_-_career_grade_level": "FALSE",
  "director_of_public_health": "FALSE",
  "clinical_medical_officer": "FALSE",
  "senior_clinical_medical_officer": "FALSE",
  "'other'_community_health_service": "FALSE",
  "general_dental_practitioner": "FALSE",
  "general_medical_practitioner": "FALSE",
  "salaried_general_practitioner": "FALSE",
  "regional_dental_officer": "FALSE",
  "clinical_director_-_dental": "FALSE",
  "dental_officer": "FALSE",
  "senior_dental_officer": "FALSE",
  "salaried_dental_practitioner": "FALSE",
  "specialty_doctor": "FALSE",
  "foundation_year_1": "FALSE",
  "foundation_year_2": "FALSE",
  "specialty_registrar": "FALSE",
  "medical_student": "FALSE",
  "trust_grade_doctor_-_specialty_registrar": "FALSE",
  "foundation_dentist": "FALSE",
  "associate_postgraduate_dean": "FALSE",
  "trust_grade_doctor_-_foundation_level": "FALSE",
  "gp_senior_partner": "FALSE",
  "gp_partner/provider": "FALSE",
  "gp_retainer": "FALSE",
  "gp_locum": "FALSE",
  "dental_core_trainee": "FALSE",
  "specialist_dentist": "FALSE",
  "student_nurse_-_adult_branch": "FALSE",
  "student_nurse_-_child_branch": "FALSE",
  "student_nurse_-_mental_health_branch": "FALSE",
  "student_nurse_-_learning_disabilities_branch": "FALSE",
  "student_midwife": "FALSE",
  "student_health_visitor": "FALSE",
  "student_district_nurse": "FALSE",
  "student_school_nurse": "FALSE",
  "student_practice_nurse": "FALSE",
  "student_occupational_health_nurse": "FALSE",
  "student_community_children's_nurse": "FALSE",
  "student_mental_health_nurse": "FALSE",
  "student_learning_disabilities_nurse": "FALSE",
  "student_chiropodist": "FALSE",
  "student_dietitian": "FALSE",
  "student_occupational_therapist": "FALSE",
  "student_orthoptist": "FALSE",
  "student_physiotherapist": "FALSE",
  "student_radiographer_-_diagnostic": "FALSE",
  "student_radiographer_-_therapeutic": "FALSE",
  "student_speech_and_language_therapist": "FALSE",
  "art,_music_and_drama_student": "FALSE",
  "student_psychotherapist": "FALSE",
  "student_social_worker": "FALSE",
  "student_paramedic": "FALSE",
  "student_prosthetics_and_orthotics": "FALSE",
  "director_of_nursing": "FALSE",
  "nurse_consultant": "FALSE",
  "nurse_manager": "FALSE",
  "modern_matron": "FALSE",
  "specialist_nurse_practitioner": "FALSE",
  "sister/charge_nurse": "FALSE",
  "staff_nurse": "FALSE",
  "enrolled_nurse": "FALSE",
  "midwife_-_consultant": "FALSE",
  "midwife_-_specialist_practitioner": "FALSE",
  "midwife_-_manager": "FALSE",
  "midwife": "FALSE",
  "community_practitioner": "FALSE",
  "community_nurse": "FALSE",
  "advanced_practitioner": "TRUE",
  "practice_nurse": "FALSE",
  "extended_role_practice_nurse": "FALSE",
  "practice_nurse_partner": "FALSE",
  "practice_research_nurse": "FALSE",
  "practice_nurse_dispenser": "FALSE",
  "art_therapist": "FALSE",
  "art_therapist_consultant": "FALSE",
  "art_therapist_manager": "FALSE",
  "art_therapist_specialist_practitioner": "FALSE",
  "chiropodist/podiatrist": "FALSE",
  "chiropodist/podiatrist_consultant": "FALSE",
  "chiropodist/podiatrist_manager": "FALSE",
  "chiropodist/podiatrist_specialist_practitioner": "FALSE",
  "dietitian": "FALSE",
  "dietitian_consultant": "FALSE",
  "dietitian_manager": "FALSE",
  "dietitian_specialist_practitioner": "FALSE",
  "drama_therapist": "FALSE",
  "drama_therapist_consultant": "FALSE",
  "drama_therapist_manager": "FALSE",
  "drama_therapist_specialist_practitioner": "FALSE",
  "multi_therapist": "FALSE",
  "multi_therapist_consultant": "FALSE",
  "multi_therapist_manager": "FALSE",
  "multi_therapist_specialist_practitioner": "FALSE",
  "music_therapist": "FALSE",
  "music_therapist_consultant": "FALSE",
  "music_therapist_manager": "FALSE",
  "music_therapist_specialist_practitioner": "FALSE",
  "occupational_therapist": "FALSE",
  "occupational_therapist_consultant": "FALSE",
  "occupational_therapist_manager": "FALSE",
  "occupational_therapist_specialist_practitioner": "FALSE",
  "orthoptist": "FALSE",
  "orthoptist_consultant": "FALSE",
  "orthoptist_manager": "FALSE",
  "orthoptist_specialist_practitioner": "FALSE",
  "orthotist": "FALSE",
  "orthotist_consultant": "FALSE",
  "orthotist_manager": "FALSE",
  "orthotist_specialist_practitioner": "FALSE",
  "paramedic": "FALSE",
  "paramedic_consultant": "FALSE",
  "paramedic_manager": "FALSE",
  "paramedic_specialist_practitioner": "FALSE",
  "physiotherapist": "FALSE",
  "physiotherapist_consultant": "FALSE",
  "physiotherapist_manager": "FALSE",
  "physiotherapist_specialist_practitioner": "FALSE",
  "prosthetist": "FALSE",
  "prosthetist_consultant": "FALSE",
  "prosthetist_manager": "FALSE",
  "prosthetist_specialist_practitioner": "FALSE",
  "radiographer_-_diagnostic": "FALSE",
  "radiographer_-_diagnostic,_consultant": "FALSE",
  "radiographer_-_diagnostic,_manager": "FALSE",
  "radiographer_-_diagnostic,_specialist_practitioner": "FALSE",
  "radiographer_-_therapeutic": "FALSE",
  "radiographer_-_therapeutic,_consultant": "FALSE",
  "radiographer_-_therapeutic,_manager": "FALSE",
  "radiographer_-_therapeutic,_specialist_practitioner": "FALSE",
  "speech_and_language_therapist": "FALSE",
  "speech_and_language_therapist_consultant": "FALSE",
  "speech_and_language_therapist_manager": "FALSE",
  "speech_and_language_therapist_specialist_practitioner": "FALSE",
  "emergency_care_practitioner": "FALSE",
  "clinical_director": "FALSE",
  "optometrist": "FALSE",
  "pharmacist": "FALSE",
  "psychotherapist": "FALSE",
  "applied_psychologist_-_clinical": "FALSE",
  "chaplain": "TRUE",
  "social_worker": "FALSE",
  "youth_worker": "TRUE",
  "specialist_practitioner": "TRUE",
  "practitioner": "TRUE",
  "technician": "TRUE",
  "osteopath": "FALSE",
  "high_intensity_therapist": "TRUE",
  "trainee_high_intensity_therapist": "TRUE",
  "physician_associate": "FALSE",
  "operating_department_practitioner": "FALSE",
  "social_care_manager": "FALSE",
  "manager": "TRUE",
  "approved_mental_health_professional": "FALSE",
  "trainee_clinical_psychologist": "FALSE",
  "trainee_counselling_psychologist": "FALSE",
  "trainee_health_psychologist": "FALSE",
  "trainee_other_applied_psychologist": "FALSE",
  "applied_psychologist_-_counselling": "FALSE",
  "applied_psychologist_-_educational": "TRUE",
  "applied_psychologist_-_forensic": "TRUE",
  "applied_psychologist_-_health": "FALSE",
  "applied_psychologist_-_occupational": "FALSE",
  "applied_psychologist_-_sport_and_exercise": "TRUE",
  "applied_psychologist_-_neuropsychologist": "FALSE",
  "counsellor": "TRUE",
  "social_worker_-_psychological_therapist": "FALSE",
  "play_therapist": "TRUE",
  "family_therapist": "TRUE",
  "child_and_adolescent_psychological_therapist_or_psychotherapist": "TRUE",
  "surgical_care_practitioner": "FALSE",
  "consultant_healthcare_scientist": "FALSE",
  "specialist_healthcare_scientist": "FALSE",
  "healthcare_scientist": "FALSE",
  "specialist_healthcare_science_practitioner": "FALSE",
  "healthcare_science_practitioner": "FALSE",
  "health_care_support_worker": "FALSE",
  "social_care_support_worker": "FALSE",
  "home_help": "TRUE",
  "healthcare_assistant": "FALSE",
  "nursery_nurse": "TRUE",
  "play_specialist": "TRUE",
  "technical_instructor": "TRUE",
  "assistant/associate_practitioner": "TRUE",
  "assistant": "TRUE",
  "dental_surgery_assistant": "FALSE",
  "phlebotomist": "FALSE",
  "cytoscreener": "FALSE",
  "student_technician": "TRUE",
  "trainee_scientist": "TRUE",
  "trainee_practitioner": "TRUE",
  "nursing_cadet": "TRUE",
  "healthcare_cadet": "TRUE",
  "pre-reg_pharmacist": "FALSE",
  "assistant_psychologist": "FALSE",
  "assistant_psychotherapist": "FALSE",
  "call_operator": "TRUE",
  "gateway_worker": "TRUE",
  "support,_time,_recovery_worker": "TRUE",
  "psychological_wellbeing_practitioner": "TRUE",
  "trainee_psychological_wellbeing_practitioner": "TRUE",
  "assistant_practitioner_nursing": "FALSE",
  "ambulance_care_assistant/patient_transport_service_driver": "FALSE",
  "emergency_care_assistant": "FALSE",
  "emergency_medical_dispatcher": "FALSE",
  "healthcare_science_associate": "FALSE",
  "healthcare_science_assistant": "FALSE",
  "trainee_healthcare_scientist": "FALSE",
  "trainee_healthcare_science_practitioner": "FALSE",
  "trainee_healthcare_science_associate": "FALSE",
  "analyst": "TRUE",
  "emergency_call_handler": "FALSE",
  "urgent_care_assistant": "FALSE",
  "urgent_care_practitioner": "FALSE",
  "employment_support_worker_or_advisor": "TRUE",
  "nursing_associate": "FALSE",
  "trainee_nursing_associate": "FALSE",
  "social_prescribing_link_worker": "TRUE",
  "peer_support_worker": "TRUE",
  "senior_peer_support_worker": "TRUE",
  "children's_wellbeing_practitioner": "TRUE",
  "trainee_children's_wellbeing_practitioner": "TRUE",
  "education_mental_health_practitioner": "TRUE",
  "trainee_education_mental_health_practitioner": "TRUE",
  "clerical_worker": "TRUE",
  "receptionist": "TRUE",
  "secretary": "TRUE",
  "personal_assistant": "TRUE",
  "medical_secretary": "FALSE",
  "officer": "TRUE",
  "senior_manager": "TRUE",
  "accountant": "TRUE",
  "librarian": "TRUE",
  "interpreter": "TRUE",
  "adviser": "TRUE",
  "researcher": "TRUE",
  "control_assistant": "TRUE",
  "architect": "TRUE",
  "lawyer": "TRUE",
  "surveyor": "TRUE",
  "chair": "TRUE",
  "chief_executive": "TRUE",
  "finance_director": "TRUE",
  "other_executive_director": "TRUE",
  "board_level_director": "TRUE",
  "non-executive_director": "TRUE",
  "childcare_coordinator": "TRUE",
  "non-emergency_call_handler": "TRUE",
  "non-emergency_medical_dispatcher": "TRUE",
  "support_worker": "TRUE",
  "housekeeper": "TRUE",
  "cook": "TRUE",
  "porter": "TRUE",
  "driver": "TRUE",
  "telephonist": "TRUE",
  "gardener/groundsperson": "TRUE",
  "electrician": "TRUE",
  "fitter": "TRUE",
  "labourer": "TRUE",
  "plumber": "TRUE",
  "carpenter": "TRUE",
  "bricklayer": "TRUE",
  "painter/decorator": "TRUE",
  "work_analyst": "TRUE",
  "chargehand": "TRUE",
  "supervisor": "TRUE",
  "engineer": "TRUE",
  "building_officer": "TRUE",
  "maintenance_craftsperson": "TRUE",
  "building_craftsperson": "TRUE",
  "mechanic": "TRUE",
  "cleaner": "TRUE",
  "assessor": "TRUE",
  "clinical_supervisor": "TRUE",
  "educational_supervisor": "TRUE",
  "tutor": "TRUE",
  "job_role_manually_added": "TRUE"
}