{
    "id": "partnerx-idxx-xxxx-xxxx-xxxxxxxxxxxx",
    "firstName": "Jane",
    "lastName": "Smith",
    "dateOfBirth": "2022-11-18",
    "addresses": [
        {
            "id": "c0a80071-8fed-174b-8190-2678fd750141",
            "type": "POSTAL",
            "addressLine1": "Stella House",
            "addressLine2": "Goldcrest Way",
            "townOrCity": "Newcastle upon Tyne",
            "country": "England",
            "postcode": "NE15 8NY",
            "_meta": {
                "channel": "LIS_STAFF",
                "createdTimestamp": "2024-06-17T14:53:01.816762",
                "createdBy": "POSTMAN",
                "updatedTimestamp": "2024-06-17T14:53:01.816762",
                "updatedBy": "POSTMAN"
            },
            "_links": {
                "citizen": {
                    "href": "http://localhost:8500/v1/citizens/partnerx-idxx-xxxx-xxxx-xxxxxxxxxxxx"
                }
            }
        }
    ],
    "emails": [
        {
            "id": "c0a80071-8fed-174b-8190-2678fd7f0142",
            "type": "PERSONAL",
            "emailAddress": "test@test.com",
            "_meta": {
                "channel": "LIS_STAFF",
                "createdTimestamp": "2024-06-17T14:53:01.824186",
                "createdBy": "POSTMAN",
                "updatedTimestamp": "2024-06-17T14:53:01.824186",
                "updatedBy": "POSTMAN"
            },
            "_links": {
                "citizen": {
                    "href": "http://localhost:8500/v1/citizens/partnerx-idxx-xxxx-xxxx-xxxxxxxxxxxx"
                }
            }
        }
    ],
    "_meta": {
        "channel": "LIS_STAFF",
        "createdTimestamp": "2023-01-04T16:35:01.8797647",
        "createdBy": "ABCD",
        "updatedTimestamp": "2023-01-04T16:35:01.8797647",
        "updatedBy": "ABCD"
    },
    "_links": {
        "self": {
            "href": "http://localhost:8500/v1/citizens/partnerx-idxx-xxxx-xxxx-xxxxxxxxxxxx"
        },
        "citizen": {
            "href": "http://localhost:8500/v1/citizens/partnerx-idxx-xxxx-xxxx-xxxxxxxxxxxx"
        },
        "addresses": {
            "href": "http://localhost:8500/v1/citizens/partnerx-idxx-xxxx-xxxx-xxxxxxxxxxxx/addresses"
        },
        "emails": {
            "href": "http://localhost:8500/v1/emails/c0a80071-8fed-174b-8190-2678fd7f0142"
        }
    }
}