{
  "Records": [
    {
      "messageId": "7cb06df8-ed27-4fcb-982f-c49263911b1f",
      "body": "{\"eventType\": \"issue-certificate\",\"citizenId\":\"c0a801c5-9205-1d62-8192-0ef939170009\",\"certificate\":{\"id\":\"c0a801c5-91fa-1bcf-8192-0ef93ced0009\",\"type\":\"LIS_HC2\",\"status\":\"ACTIVE\",\"reference\":\"12345678\",\"startDate\":\"2022-09-14\",\"endDate\":\"2023-09-13\",\"applicationDate\":\"2022-09-01\"},\"lowIncomeScheme\":{\"partnerCitizenId\":\"c0a801c5-9205-1d62-8192-0ef939f9000c\"}}",
      "attributes": {
        "ApproximateReceiveCount": "1",
        "SentTimestamp": "1545082650636",
        "SenderId": "AI*AIENQZJOL*********",
        "ApproximateFirstReceiveTimestamp": "1545082650649"
      },
      "messageAttributes": {
        "eventName": {
          "dataType": "string",
          "stringValue": "certificateStatusChange"
        },
        "source": {
          "dataType": "string",
          "stringValue": "health-charge-exemption-certificate-api"
        },
        "correlationId": {
          "dataType": "string",
          "stringValue": "223fc01c-368c-4636-8d5a-571375e52bec"
        }
      }
    }
  ]
}