{
  "Records": [
    {
      "messageId": "2e1424d4-f796-459a-8184-9c92662be6da",
      "body": "{\"eventType\": \"citizen-update\",\"citizenId\":\"8e3fc01c-368c-4636-8d5a-571375e52bec\",\"channel\":\"LIS_STAFF\"}",
      "attributes": {
        "ApproximateReceiveCount": "1",
        "SentTimestamp": "1545082650636",
        "SenderId": "AI*AIENQZJOL*********",
        "ApproximateFirstReceiveTimestamp": "1545082650649"
      },
      "messageAttributes": {
        "eventName": {
          "dataType": "string",
          "stringValue": "citizenInformationUpdates"
        },
        "source": {
          "dataType": "string",
          "stringValue": "health-charge-exemption-citizen-api"
        },
        "correlationId": {
          "dataType": "string",
          "stringValue": "223fc01c-368c-4636-8d5a-571375e52bec"
        }
      }
    }
  ]
}