{
  "eventType": "issue-certificate",
  "citizenId": "73c088aa-d6d1-4c58-8c2d-bbf361e020b3",
  "certificate": {
    "id": "61777c0c-5f83-49e7-ad6d-7eac9f708e19",
    "type": "LIS_HC3",
    "status": "ACTIVE",
    "reference": "12345678",
    "startDate": "2022-09-14",
    "endDate": "2023-09-13",
    "applicationDate": "2022-09-01"
  },
  "lowIncomeScheme": {
    "excessIncome": 100,
    "partnerCitizenId": "2f096e53-286a-442c-8ecc-144c518af1fd"
  }
}