{
  "Records": [
    {
      "messageId": "7cb06df8-ed27-4fcb-982f-c49263911b1c",
      "body": "{\"eventType\": \"issue-certificate\",\"citizenId\":\"73c088aa-d6d1-4c58-8c2d-bbf361e020b3\",\"certificate\":{\"id\":\"61777c0c-5f83-49e7-ad6d-7eac9f708e19\",\"type\":\"LIS_HC2\",\"status\":\"ACTIVE\",\"reference\":\"12345678\",\"startDate\":\"2022-09-14\",\"endDate\":\"2023-09-13\",\"applicationDate\":\"2022-09-01\"}}",
      "attributes": {
        "ApproximateReceiveCount": "1",
        "SentTimestamp": "1545082650636",
        "SenderId": "AI*AIENQZJOL*********",
        "ApproximateFirstReceiveTimestamp": "1545082650649"
      },
      "messageAttributes": {
        "eventName": {
          "dataType": "string",
          "stringValue": "certificateStatusChange"
        },
        "source": {
          "dataType": "string",
          "stringValue": "health-charge-exemption-certificate-api"
        },
        "correlationId": {
          "dataType": "string",
          "stringValue": "223fc01c-368c-4636-8d5a-571375e52bec"
        }
      }
    }
  ]
}