{
  "exemptions": {
    "hrt-ppcs": [
      {
        "citizens": [
          {
            "addresses": [
              {
                "addressLine1": "Stella House",
                "addressLine2": "Goldcrest Way",
                "country": "England",
                "id": "c0a8012f-852e-13ca-8185-356ab04a009d",
                "postcode": "NE15 8NY",
                "townOrCity": "Newcastle upon Tyne",
                "type": "POSTAL"
              }
            ],
            "certificates": [],
            "dateOfBirth": "1997-03-24",
            "firstName": "john",
            "id": "c0a8012f-852e-13ca-8185-356ab044009c",
            "lastName": "Smith"
          },
          {
            "addresses": [
              {
                "addressLine1": "Stella House",
                "addressLine2": "Goldcrest Way",
                "country": "England",
                "id": "c0a8012f-852e-13ca-8185-356ab53100a0",
                "postcode": "NE15 8NY",
                "townOrCity": "Newcastle upon Tyne",
                "type": "POSTAL"
              }
            ],
            "certificates": [],
            "dateOfBirth": "1997-03-24",
            "firstName": "John",
            "id": "c0a8012f-852e-13ca-8185-356ab531009f",
            "lastName": "smith"
          },
          {
            "addresses": [
              {
                "addressLine1": "Stella House",
                "addressLine2": "Goldcrest Way",
                "country": "England",
                "id": "c0a8012f-852e-13ca-8185-356ab94d00a3",
                "postcode": "NE15 8NY",
                "townOrCity": "Newcastle upon Tyne",
                "type": "POSTAL"
              }
            ],
            "certificates": [],
            "dateOfBirth": "1997-03-24",
            "firstName": "JoHn",
            "id": "c0a8012f-852e-13ca-8185-356ab94d00a2",
            "lastName": "Smith"
          },
          {
            "addresses": [
              {
                "addressLine1": "Stella House",
                "addressLine2": "Goldcrest Way",
                "country": "England",
                "id": "c0a8012f-852e-13ca-8185-356abd3000a6",
                "postcode": "NE15 8NY",
                "townOrCity": "Newcastle upon Tyne",
                "type": "POSTAL"
              }
            ],
            "certificates": [
              {
                "endDate": "2023-12-12",
                "id": "c0a80005-8576-12ed-8185-77be4c060036",
                "reference": "BB1D3E453CE002CC6512",
                "startDate": "2022-12-12",
                "status": "PENDING",
                "type": "HRT_PPC"
              },
              {
                "endDate": "2023-12-12",
                "id": "c0a80005-8576-12ed-8185-77be4f010037",
                "reference": "E2CBB05CF07003447673",
                "startDate": "2022-12-12",
                "status": "PENDING",
                "type": "HRT_PPC"
              }
            ],
            "dateOfBirth": "1997-03-24",
            "firstName": "John",
            "id": "0a004b01-8515-1a6c-8185-1558ae970000",
            "lastName": "SmiTh"
          },
          {
            "addresses": [
              {
                "addressLine1": "Stella House",
                "addressLine2": "Goldcrest Way",
                "country": "England",
                "id": "c0a8012f-852e-13ca-8185-356ac13700a9",
                "postcode": "NE15 8NY",
                "townOrCity": "Newcastle upon Tyne",
                "type": "POSTAL"
              }
            ],
            "certificates": [],
            "dateOfBirth": "1997-03-24",
            "firstName": "JOhn",
            "id": "c0a8012f-852e-13ca-8185-356ab044009c",
            "lastName": "Smith"
          }
        ]
      }
    ],
    "others": [
      {
        "citizens": [
          {
            "certificates": [
              {
                "endDate": "2060-09-11",
                "reference": "12000000069",
                "startDate": "2020-09-11",
                "status": "ACTIVE",
                "type": "MEDICAL"
              },
              {
                "endDate": "2060-09-11",
                "reference": "12000000061",
                "startDate": "2020-09-11",
                "status": "ACTIVE",
                "type": "MEDICAL"
              },
              {
                "endDate": "2060-09-11",
                "reference": "12000000050",
                "startDate": "2020-09-11",
                "status": "ACTIVE",
                "type": "MEDICAL"
              },
              {
                "endDate": "2060-09-11",
                "reference": "12000000041",
                "startDate": "2020-09-11",
                "status": "ACTIVE",
                "type": "MEDICAL"
              },
              {
                "endDate": "2060-09-11",
                "reference": "11000000061",
                "startDate": "2020-09-11",
                "status": "ACTIVE",
                "type": "MATERNITY"
              },
              {
                "endDate": "2060-09-11",
                "reference": "11000000050",
                "startDate": "2020-09-11",
                "status": "ACTIVE",
                "type": "MATERNITY"
              },
              {
                "endDate": "2060-09-11",
                "reference": "11000000041",
                "startDate": "2020-09-11",
                "status": "ACTIVE",
                "type": "MATERNITY"
              },
              {
                "endDate": "2060-09-11",
                "reference": "10000007799",
                "startDate": "2020-09-11",
                "status": "ACTIVE",
                "type": "MATERNITY"
              },
              {
                "endDate": "2060-09-11",
                "reference": "10000007798",
                "startDate": "2020-09-11",
                "status": "ACTIVE",
                "type": "MATERNITY"
              },
              {
                "endDate": "2060-09-11",
                "reference": "10000007797",
                "startDate": "2020-09-11",
                "status": "ACTIVE",
                "type": "MATERNITY"
              },
              {
                "endDate": "2060-09-11",
                "reference": "10000007769",
                "startDate": "2020-09-11",
                "status": "ACTIVE",
                "type": "MATERNITY"
              },
              {
                "endDate": "2060-09-11",
                "reference": "10000007768",
                "startDate": "2020-09-11",
                "status": "ACTIVE",
                "type": "MATERNITY"
              },
              {
                "endDate": "2060-09-11",
                "reference": "10000007767",
                "startDate": "2020-09-11",
                "status": "ACTIVE",
                "type": "MATERNITY"
              }
            ],
            "dateOfBirth": "1997-03-24",
            "firstName": "John",
            "lastName": "Smith"
          }
        ]
      }
    ]
  }
}
