{
  "_embedded": {
    "certificates": []
  },
  "_links": {
    "self": {
      "href": "http://localhost:8090/v1/certificates/search/findByCitizens?citizenIds=c0a8012f-852e-13ca-8185-356ab044009c&page=0&size=20"
    }
  },
  "page": {
    "size": 20,
    "totalElements": 0,
    "totalPages": 0,
    "number": 0
  }
}