{
  "_embedded": {
      "citizens": [
          {
              "id": "ac100a58-8a21-1840-818a-2c5a7c4000be",
              "firstName": "John",
              "lastName": "Smith",
              "dateOfBirth": "1997-03-24",
              "addresses": [
                  {
                      "id": "ac100a58-8a21-1840-818a-2c5a7c4000be",
                      "type": "POSTAL",
                      "addressLine1": "Stella House",
                      "addressLine2": "Goldcrest Way",
                      "townOrCity": "Newcastle upon Tyne",
                      "country": "England",
                      "postcode": "NE15 8NY",
                      "_meta": {
                          "channel": "ONLINE",
                          "createdTimestamp": "2023-01-22T09:00:00.316",
                          "createdBy": "ONLINE",
                          "updatedTimestamp": "2023-01-22T09:00:00.316",
                          "updatedBy": "ONLINE"
                      },
                      "_links": {
                          "citizen": {
                              "href": "http://localhost:8100/v1/citizens/ac100a58-8a21-1840-818a-2c5a7c4000be"
                          }
                      }
                  }
              ],
              "emails": [],
              "_meta": {
                  "channel": "ONLINE",
                  "createdTimestamp": "2023-01-22T09:00:00.316",
                  "createdBy": "ONLINE",
                  "updatedTimestamp": "2023-01-22T09:00:00.316",
                  "updatedBy": "ONLINE"
              },
              "_links": {
                  "self": {
                      "href": "http://localhost:8100/v1/citizens/ac100a58-8a21-1840-818a-2c5a7c4000be"
                  },
                  "citizen": {
                      "href": "http://localhost:8100/v1/citizens/ac100a58-8a21-1840-818a-2c5a7c4000be"
                  }
              }
          },
          {
              "id": "ac100bcf-8a21-1839-818a-2c5a7f4800b1",
              "firstName": "John",
              "lastName": "Smith",
              "dateOfBirth": "1997-03-24",
              "addresses": [
                  {
                      "id": "ac100bcf-8a21-1839-818a-2c5a7f4800b1",
                      "type": "POSTAL",
                      "addressLine1": "Stella House",
                      "addressLine2": "Goldcrest Way",
                      "townOrCity": "Newcastle upon Tyne",
                      "country": "England",
                      "postcode": "NE15 8NY",
                      "_meta": {
                          "channel": "ONLINE",
                          "createdTimestamp": "2023-01-22T09:00:00.316",
                          "createdBy": "ONLINE",
                          "updatedTimestamp": "2023-01-22T09:00:00.316",
                          "updatedBy": "ONLINE"
                      },
                      "_links": {
                          "citizen": {
                              "href": "http://localhost:8100/v1/citizens/ac100bcf-8a21-1839-818a-2c5a7f4800b1"
                          }
                      }
                  }
              ],
              "emails": [],
              "_meta": {
                  "channel": "ONLINE",
                  "createdTimestamp": "2023-01-22T09:00:00.316",
                  "createdBy": "ONLINE",
                  "updatedTimestamp": "2023-01-22T09:00:00.316",
                  "updatedBy": "ONLINE"
              },
              "_links": {
                  "self": {
                      "href": "http://localhost:8100/v1/citizens/ac100bcf-8a21-1839-818a-2c5a7f4800b1"
                  },
                  "citizen": {
                      "href": "http://localhost:8100/v1/citizens/ac100bcf-8a21-1839-818a-2c5a7f4800b1"
                  }
              }
          },
          {
              "id": "ac100a58-8a21-1840-818a-2c5a883800c1",
              "firstName": "John",
              "lastName": "Smith",
              "dateOfBirth": "1997-03-24",
              "addresses": [
                  {
                      "id": "ac100a58-8a21-1840-818a-2c5a883800c1",
                      "type": "POSTAL",
                      "addressLine1": "Stella House",
                      "addressLine2": "Goldcrest Way",
                      "townOrCity": "Newcastle upon Tyne",
                      "country": "England",
                      "postcode": "NE15 8NY",
                      "_meta": {
                          "channel": "ONLINE",
                          "createdTimestamp": "2023-01-22T09:00:00.316",
                          "createdBy": "ONLINE",
                          "updatedTimestamp": "2023-01-22T09:00:00.316",
                          "updatedBy": "ONLINE"
                      },
                      "_links": {
                          "citizen": {
                              "href": "http://localhost:8100/v1/citizens/ac100a58-8a21-1840-818a-2c5a883800c1"
                          }
                      }
                  }
              ],
              "emails": [],
              "_meta": {
                  "channel": "ONLINE",
                  "createdTimestamp": "2023-01-22T09:00:00.316",
                  "createdBy": "ONLINE",
                  "updatedTimestamp": "2023-01-22T09:00:00.316",
                  "updatedBy": "ONLINE"
              },
              "_links": {
                  "self": {
                      "href": "http://localhost:8100/v1/citizens/ac100a58-8a21-1840-818a-2c5a883800c1"
                  },
                  "citizen": {
                      "href": "http://localhost:8100/v1/citizens/ac100a58-8a21-1840-818a-2c5a883800c1"
                  }
              }
          },
          {
              "id": "ac100bcf-8a21-1839-818a-2c5a8c9f00b4",
              "firstName": "John",
              "lastName": "Smith",
              "dateOfBirth": "1997-03-24",
              "addresses": [
                  {
                      "id": "ac100bcf-8a21-1839-818a-2c5a8c9f00b4",
                      "type": "POSTAL",
                      "addressLine1": "Stella House",
                      "addressLine2": "Goldcrest Way",
                      "townOrCity": "Newcastle upon Tyne",
                      "country": "England",
                      "postcode": "NE15 8NY",
                      "_meta": {
                          "channel": "ONLINE",
                          "createdTimestamp": "2023-01-22T09:00:00.316",
                          "createdBy": "ONLINE",
                          "updatedTimestamp": "2023-01-22T09:00:00.316",
                          "updatedBy": "ONLINE"
                      },
                      "_links": {
                          "citizen": {
                              "href": "http://localhost:8100/v1/citizens/ac100bcf-8a21-1839-818a-2c5a8c9f00b4"
                          }
                      }
                  }
              ],
              "emails": [],
              "_meta": {
                  "channel": "ONLINE",
                  "createdTimestamp": "2023-01-22T09:00:00.316",
                  "createdBy": "ONLINE",
                  "updatedTimestamp": "2023-01-22T09:00:00.316",
                  "updatedBy": "ONLINE"
              },
              "_links": {
                  "self": {
                      "href": "http://localhost:8100/v1/citizens/ac100bcf-8a21-1839-818a-2c5a8c9f00b4"
                  },
                  "citizen": {
                      "href": "http://localhost:8100/v1/citizens/ac100bcf-8a21-1839-818a-2c5a8c9f00b4"
                  }
              }
          },
          {
              "id": "ac100bcf-8a21-1839-818a-2c5aa29f00b7",
              "firstName": "John",
              "lastName": "Smith",
              "dateOfBirth": "1997-03-24",
              "addresses": [
                  {
                      "id": "ac100bcf-8a21-1839-818a-2c5aa29f00b7",
                      "type": "POSTAL",
                      "addressLine1": "Stella House",
                      "addressLine2": "Goldcrest Way",
                      "townOrCity": "Newcastle upon Tyne",
                      "country": "England",
                      "postcode": "NE15 8NY",
                      "_meta": {
                          "channel": "ONLINE",
                          "createdTimestamp": "2023-01-22T09:00:00.316",
                          "createdBy": "ONLINE",
                          "updatedTimestamp": "2023-01-22T09:00:00.316",
                          "updatedBy": "ONLINE"
                      },
                      "_links": {
                          "citizen": {
                              "href": "http://localhost:8100/v1/citizens/ac100bcf-8a21-1839-818a-2c5aa29f00b7"
                          }
                      }
                  }
              ],
              "emails": [],
              "_meta": {
                  "channel": "ONLINE",
                  "createdTimestamp": "2023-01-22T09:00:00.316",
                  "createdBy": "ONLINE",
                  "updatedTimestamp": "2023-01-22T09:00:00.316",
                  "updatedBy": "ONLINE"
              },
              "_links": {
                  "self": {
                      "href": "http://localhost:8100/v1/citizens/ac100bcf-8a21-1839-818a-2c5aa29f00b7"
                  },
                  "citizen": {
                      "href": "http://localhost:8100/v1/citizens/ac100bcf-8a21-1839-818a-2c5aa29f00b7"
                  }
              }
          },
          {
              "id": "ac100a58-8a21-1840-818a-2c5aa44400c4",
              "firstName": "John",
              "lastName": "Smith",
              "dateOfBirth": "1997-03-24",
              "addresses": [
                  {
                      "id": "ac100a58-8a21-1840-818a-2c5aa44400c4",
                      "type": "POSTAL",
                      "addressLine1": "Stella House",
                      "addressLine2": "Goldcrest Way",
                      "townOrCity": "Newcastle upon Tyne",
                      "country": "England",
                      "postcode": "NE15 8NY",
                      "_meta": {
                          "channel": "ONLINE",
                          "createdTimestamp": "2023-01-22T09:00:00.316",
                          "createdBy": "ONLINE",
                          "updatedTimestamp": "2023-01-22T09:00:00.316",
                          "updatedBy": "ONLINE"
                      },
                      "_links": {
                          "citizen": {
                              "href": "http://localhost:8100/v1/citizens/ac100a58-8a21-1840-818a-2c5aa44400c4"
                          }
                      }
                  }
              ],
              "emails": [],
              "_meta": {
                  "channel": "ONLINE",
                  "createdTimestamp": "2023-01-22T09:00:00.316",
                  "createdBy": "ONLINE",
                  "updatedTimestamp": "2023-01-22T09:00:00.316",
                  "updatedBy": "ONLINE"
              },
              "_links": {
                  "self": {
                      "href": "http://localhost:8100/v1/citizens/ac100a58-8a21-1840-818a-2c5aa44400c4"
                  },
                  "citizen": {
                      "href": "http://localhost:8100/v1/citizens/ac100a58-8a21-1840-818a-2c5aa44400c4"
                  }
              }
          },
          {
              "id": "ac100bcf-8a21-1839-818a-2c5ab0e800ba",
              "firstName": "John",
              "lastName": "Smith",
              "dateOfBirth": "1997-03-24",
              "addresses": [
                  {
                      "id": "ac100bcf-8a21-1839-818a-2c5ab0e800ba",
                      "type": "POSTAL",
                      "addressLine1": "Stella House",
                      "addressLine2": "Goldcrest Way",
                      "townOrCity": "Newcastle upon Tyne",
                      "country": "England",
                      "postcode": "NE15 8NY",
                      "_meta": {
                          "channel": "ONLINE",
                          "createdTimestamp": "2023-01-22T09:00:00.316",
                          "createdBy": "ONLINE",
                          "updatedTimestamp": "2023-01-22T09:00:00.316",
                          "updatedBy": "ONLINE"
                      },
                      "_links": {
                          "citizen": {
                              "href": "http://localhost:8100/v1/citizens/ac100bcf-8a21-1839-818a-2c5ab0e800ba"
                          }
                      }
                  }
              ],
              "emails": [],
              "_meta": {
                  "channel": "ONLINE",
                  "createdTimestamp": "2023-01-22T09:00:00.316",
                  "createdBy": "ONLINE",
                  "updatedTimestamp": "2023-01-22T09:00:00.316",
                  "updatedBy": "ONLINE"
              },
              "_links": {
                  "self": {
                      "href": "http://localhost:8100/v1/citizens/ac100bcf-8a21-1839-818a-2c5ab0e800ba"
                  },
                  "citizen": {
                      "href": "http://localhost:8100/v1/citizens/ac100bcf-8a21-1839-818a-2c5ab0e800ba"
                  }
              }
          },
          {
              "id": "ac100a58-8a21-1840-818a-2c5ad1a900c7",
              "firstName": "John",
              "lastName": "Smith",
              "dateOfBirth": "1997-03-24",
              "addresses": [
                  {
                      "id": "ac100a58-8a21-1840-818a-2c5ad1a900c7",
                      "type": "POSTAL",
                      "addressLine1": "Stella House",
                      "addressLine2": "Goldcrest Way",
                      "townOrCity": "Newcastle upon Tyne",
                      "country": "England",
                      "postcode": "NE15 8NY",
                      "_meta": {
                          "channel": "ONLINE",
                          "createdTimestamp": "2023-01-22T09:00:00.316",
                          "createdBy": "ONLINE",
                          "updatedTimestamp": "2023-01-22T09:00:00.316",
                          "updatedBy": "ONLINE"
                      },
                      "_links": {
                          "citizen": {
                              "href": "http://localhost:8100/v1/citizens/ac100a58-8a21-1840-818a-2c5ad1a900c7"
                          }
                      }
                  }
              ],
              "emails": [],
              "_meta": {
                  "channel": "ONLINE",
                  "createdTimestamp": "2023-01-22T09:00:00.316",
                  "createdBy": "ONLINE",
                  "updatedTimestamp": "2023-01-22T09:00:00.316",
                  "updatedBy": "ONLINE"
              },
              "_links": {
                  "self": {
                      "href": "http://localhost:8100/v1/citizens/ac100a58-8a21-1840-818a-2c5ad1a900c7"
                  },
                  "citizen": {
                      "href": "http://localhost:8100/v1/citizens/ac100a58-8a21-1840-818a-2c5ad1a900c7"
                  }
              }
          },
          {
              "id": "ac100a58-8a21-1840-818a-2c5ae3c400ca",
              "firstName": "John",
              "lastName": "Smith",
              "dateOfBirth": "1997-03-24",
              "addresses": [
                  {
                      "id": "ac100a58-8a21-1840-818a-2c5ae3c400ca",
                      "type": "POSTAL",
                      "addressLine1": "Stella House",
                      "addressLine2": "Goldcrest Way",
                      "townOrCity": "Newcastle upon Tyne",
                      "country": "England",
                      "postcode": "NE15 8NY",
                      "_meta": {
                          "channel": "ONLINE",
                          "createdTimestamp": "2023-01-22T09:00:00.316",
                          "createdBy": "ONLINE",
                          "updatedTimestamp": "2023-01-22T09:00:00.316",
                          "updatedBy": "ONLINE"
                      },
                      "_links": {
                          "citizen": {
                              "href": "http://localhost:8100/v1/citizens/ac100a58-8a21-1840-818a-2c5ae3c400ca"
                          }
                      }
                  }
              ],
              "emails": [],
              "_meta": {
                  "channel": "ONLINE",
                  "createdTimestamp": "2023-01-22T09:00:00.316",
                  "createdBy": "ONLINE",
                  "updatedTimestamp": "2023-01-22T09:00:00.316",
                  "updatedBy": "ONLINE"
              },
              "_links": {
                  "self": {
                      "href": "http://localhost:8100/v1/citizens/ac100a58-8a21-1840-818a-2c5ae3c400ca"
                  },
                  "citizen": {
                      "href": "http://localhost:8100/v1/citizens/ac100a58-8a21-1840-818a-2c5ae3c400ca"
                  }
              }
          },
          {
              "id": "ac100bcf-8a21-1839-818a-2c5afd9200bd",
              "firstName": "John",
              "lastName": "Smith",
              "dateOfBirth": "1997-03-24",
              "addresses": [
                  {
                      "id": "ac100bcf-8a21-1839-818a-2c5afd9200bd",
                      "type": "POSTAL",
                      "addressLine1": "Stella House",
                      "addressLine2": "Goldcrest Way",
                      "townOrCity": "Newcastle upon Tyne",
                      "country": "England",
                      "postcode": "NE15 8NY",
                      "_meta": {
                          "channel": "ONLINE",
                          "createdTimestamp": "2023-01-22T09:00:00.316",
                          "createdBy": "ONLINE",
                          "updatedTimestamp": "2023-01-22T09:00:00.316",
                          "updatedBy": "ONLINE"
                      },
                      "_links": {
                          "citizen": {
                              "href": "http://localhost:8100/v1/citizens/ac100bcf-8a21-1839-818a-2c5afd9200bd"
                          }
                      }
                  }
              ],
              "emails": [],
              "_meta": {
                  "channel": "ONLINE",
                  "createdTimestamp": "2023-01-22T09:00:00.316",
                  "createdBy": "ONLINE",
                  "updatedTimestamp": "2023-01-22T09:00:00.316",
                  "updatedBy": "ONLINE"
              },
              "_links": {
                  "self": {
                      "href": "http://localhost:8100/v1/citizens/ac100bcf-8a21-1839-818a-2c5afd9200bd"
                  },
                  "citizen": {
                      "href": "http://localhost:8100/v1/citizens/ac100bcf-8a21-1839-818a-2c5afd9200bd"
                  }
              }
          },
          {
              "id": "ac100a58-8a21-1840-818a-2c5b02ee00cd",
              "firstName": "John",
              "lastName": "Smith",
              "dateOfBirth": "1997-03-24",
              "addresses": [
                  {
                      "id": "ac100a58-8a21-1840-818a-2c5b02ee00cd",
                      "type": "POSTAL",
                      "addressLine1": "Stella House",
                      "addressLine2": "Goldcrest Way",
                      "townOrCity": "Newcastle upon Tyne",
                      "country": "England",
                      "postcode": "NE15 8NY",
                      "_meta": {
                          "channel": "ONLINE",
                          "createdTimestamp": "2023-01-22T09:00:00.316",
                          "createdBy": "ONLINE",
                          "updatedTimestamp": "2023-01-22T09:00:00.316",
                          "updatedBy": "ONLINE"
                      },
                      "_links": {
                          "citizen": {
                              "href": "http://localhost:8100/v1/citizens/ac100a58-8a21-1840-818a-2c5b02ee00cd"
                          }
                      }
                  }
              ],
              "emails": [],
              "_meta": {
                  "channel": "ONLINE",
                  "createdTimestamp": "2023-01-22T09:00:00.316",
                  "createdBy": "ONLINE",
                  "updatedTimestamp": "2023-01-22T09:00:00.316",
                  "updatedBy": "ONLINE"
              },
              "_links": {
                  "self": {
                      "href": "http://localhost:8100/v1/citizens/ac100a58-8a21-1840-818a-2c5b02ee00cd"
                  },
                  "citizen": {
                      "href": "http://localhost:8100/v1/citizens/ac100a58-8a21-1840-818a-2c5b02ee00cd"
                  }
              }
          },
          {
              "id": "ac100bcf-8a21-1839-818a-2c5b079700c0",
              "firstName": "John",
              "lastName": "Smith",
              "dateOfBirth": "1997-03-24",
              "addresses": [
                  {
                      "id": "ac100bcf-8a21-1839-818a-2c5b079700c0",
                      "type": "POSTAL",
                      "addressLine1": "Stella House",
                      "addressLine2": "Goldcrest Way",
                      "townOrCity": "Newcastle upon Tyne",
                      "country": "England",
                      "postcode": "NE15 8NY",
                      "_meta": {
                          "channel": "ONLINE",
                          "createdTimestamp": "2023-01-22T09:00:00.316",
                          "createdBy": "ONLINE",
                          "updatedTimestamp": "2023-01-22T09:00:00.316",
                          "updatedBy": "ONLINE"
                      },
                      "_links": {
                          "citizen": {
                              "href": "http://localhost:8100/v1/citizens/ac100bcf-8a21-1839-818a-2c5b079700c0"
                          }
                      }
                  }
              ],
              "emails": [],
              "_meta": {
                  "channel": "ONLINE",
                  "createdTimestamp": "2023-01-22T09:00:00.316",
                  "createdBy": "ONLINE",
                  "updatedTimestamp": "2023-01-22T09:00:00.316",
                  "updatedBy": "ONLINE"
              },
              "_links": {
                  "self": {
                      "href": "http://localhost:8100/v1/citizens/ac100bcf-8a21-1839-818a-2c5b079700c0"
                  },
                  "citizen": {
                      "href": "http://localhost:8100/v1/citizens/ac100bcf-8a21-1839-818a-2c5b079700c0"
                  }
              }
          },
          {
              "id": "ac100a58-8a21-1840-818a-2c5b12f000d0",
              "firstName": "John",
              "lastName": "Smith",
              "dateOfBirth": "1997-03-24",
              "addresses": [
                  {
                      "id": "ac100a58-8a21-1840-818a-2c5b12f000d0",
                      "type": "POSTAL",
                      "addressLine1": "Stella House",
                      "addressLine2": "Goldcrest Way",
                      "townOrCity": "Newcastle upon Tyne",
                      "country": "England",
                      "postcode": "NE15 8NY",
                      "_meta": {
                          "channel": "ONLINE",
                          "createdTimestamp": "2023-01-22T09:00:00.316",
                          "createdBy": "ONLINE",
                          "updatedTimestamp": "2023-01-22T09:00:00.316",
                          "updatedBy": "ONLINE"
                      },
                      "_links": {
                          "citizen": {
                              "href": "http://localhost:8100/v1/citizens/ac100a58-8a21-1840-818a-2c5b12f000d0"
                          }
                      }
                  }
              ],
              "emails": [],
              "_meta": {
                  "channel": "ONLINE",
                  "createdTimestamp": "2023-01-22T09:00:00.316",
                  "createdBy": "ONLINE",
                  "updatedTimestamp": "2023-01-22T09:00:00.316",
                  "updatedBy": "ONLINE"
              },
              "_links": {
                  "self": {
                      "href": "http://localhost:8100/v1/citizens/ac100a58-8a21-1840-818a-2c5b12f000d0"
                  },
                  "citizen": {
                      "href": "http://localhost:8100/v1/citizens/ac100a58-8a21-1840-818a-2c5b12f000d0"
                  }
              }
          },
          {
              "id": "ac100bcf-8a21-1839-818a-2c5bcdce00c3",
              "firstName": "John",
              "lastName": "Smith",
              "dateOfBirth": "1997-03-24",
              "addresses": [
                  {
                      "id": "ac100bcf-8a21-1839-818a-2c5bcdce00c3",
                      "type": "POSTAL",
                      "addressLine1": "Stella House",
                      "addressLine2": "Goldcrest Way",
                      "townOrCity": "Newcastle upon Tyne",
                      "country": "England",
                      "postcode": "NE15 8NY",
                      "_meta": {
                          "channel": "ONLINE",
                          "createdTimestamp": "2023-01-22T09:00:00.316",
                          "createdBy": "ONLINE",
                          "updatedTimestamp": "2023-01-22T09:00:00.316",
                          "updatedBy": "ONLINE"
                      },
                      "_links": {
                          "citizen": {
                              "href": "http://localhost:8100/v1/citizens/ac100bcf-8a21-1839-818a-2c5bcdce00c3"
                          }
                      }
                  }
              ],
              "emails": [],
              "_meta": {
                  "channel": "ONLINE",
                  "createdTimestamp": "2023-01-22T09:00:00.316",
                  "createdBy": "ONLINE",
                  "updatedTimestamp": "2023-01-22T09:00:00.316",
                  "updatedBy": "ONLINE"
              },
              "_links": {
                  "self": {
                      "href": "http://localhost:8100/v1/citizens/ac100bcf-8a21-1839-818a-2c5bcdce00c3"
                  },
                  "citizen": {
                      "href": "http://localhost:8100/v1/citizens/ac100bcf-8a21-1839-818a-2c5bcdce00c3"
                  }
              }
          },
          {
              "id": "ac100a58-8a21-1840-818a-2c5c39d500d3",
              "firstName": "John",
              "lastName": "Smith",
              "dateOfBirth": "1997-03-24",
              "addresses": [
                  {
                      "id": "ac100a58-8a21-1840-818a-2c5c39d500d3",
                      "type": "POSTAL",
                      "addressLine1": "Stella House",
                      "addressLine2": "Goldcrest Way",
                      "townOrCity": "Newcastle upon Tyne",
                      "country": "England",
                      "postcode": "NE15 8NY",
                      "_meta": {
                          "channel": "ONLINE",
                          "createdTimestamp": "2023-01-22T09:00:00.316",
                          "createdBy": "ONLINE",
                          "updatedTimestamp": "2023-01-22T09:00:00.316",
                          "updatedBy": "ONLINE"
                      },
                      "_links": {
                          "citizen": {
                              "href": "http://localhost:8100/v1/citizens/ac100a58-8a21-1840-818a-2c5c39d500d3"
                          }
                      }
                  }
              ],
              "emails": [],
              "_meta": {
                  "channel": "ONLINE",
                  "createdTimestamp": "2023-01-22T09:00:00.316",
                  "createdBy": "ONLINE",
                  "updatedTimestamp": "2023-01-22T09:00:00.316",
                  "updatedBy": "ONLINE"
              },
              "_links": {
                  "self": {
                      "href": "http://localhost:8100/v1/citizens/ac100a58-8a21-1840-818a-2c5c39d500d3"
                  },
                  "citizen": {
                      "href": "http://localhost:8100/v1/citizens/ac100a58-8a21-1840-818a-2c5c39d500d3"
                  }
              }
          },
          {
              "id": "ac100bcf-8a21-1839-818a-2c5c3dda00c6",
              "firstName": "John",
              "lastName": "Smith",
              "dateOfBirth": "1997-03-24",
              "addresses": [
                  {
                      "id": "ac100bcf-8a21-1839-818a-2c5c3dda00c6",
                      "type": "POSTAL",
                      "addressLine1": "Stella House",
                      "addressLine2": "Goldcrest Way",
                      "townOrCity": "Newcastle upon Tyne",
                      "country": "England",
                      "postcode": "NE15 8NY",
                      "_meta": {
                          "channel": "ONLINE",
                          "createdTimestamp": "2023-01-22T09:00:00.316",
                          "createdBy": "ONLINE",
                          "updatedTimestamp": "2023-01-22T09:00:00.316",
                          "updatedBy": "ONLINE"
                      },
                      "_links": {
                          "citizen": {
                              "href": "http://localhost:8100/v1/citizens/ac100bcf-8a21-1839-818a-2c5c3dda00c6"
                          }
                      }
                  }
              ],
              "emails": [],
              "_meta": {
                  "channel": "ONLINE",
                  "createdTimestamp": "2023-01-22T09:00:00.316",
                  "createdBy": "ONLINE",
                  "updatedTimestamp": "2023-01-22T09:00:00.316",
                  "updatedBy": "ONLINE"
              },
              "_links": {
                  "self": {
                      "href": "http://localhost:8100/v1/citizens/ac100bcf-8a21-1839-818a-2c5c3dda00c6"
                  },
                  "citizen": {
                      "href": "http://localhost:8100/v1/citizens/ac100bcf-8a21-1839-818a-2c5c3dda00c6"
                  }
              }
          },
          {
              "id": "ac100bcf-8a21-1839-818a-2c5c4b2200c9",
              "firstName": "John",
              "lastName": "Smith",
              "dateOfBirth": "1997-03-24",
              "addresses": [
                  {
                      "id": "ac100bcf-8a21-1839-818a-2c5c4b2200c9",
                      "type": "POSTAL",
                      "addressLine1": "Stella House",
                      "addressLine2": "Goldcrest Way",
                      "townOrCity": "Newcastle upon Tyne",
                      "country": "England",
                      "postcode": "NE15 8NY",
                      "_meta": {
                          "channel": "ONLINE",
                          "createdTimestamp": "2023-01-22T09:00:00.316",
                          "createdBy": "ONLINE",
                          "updatedTimestamp": "2023-01-22T09:00:00.316",
                          "updatedBy": "ONLINE"
                      },
                      "_links": {
                          "citizen": {
                              "href": "http://localhost:8100/v1/citizens/ac100bcf-8a21-1839-818a-2c5c4b2200c9"
                          }
                      }
                  }
              ],
              "emails": [],
              "_meta": {
                  "channel": "ONLINE",
                  "createdTimestamp": "2023-01-22T09:00:00.316",
                  "createdBy": "ONLINE",
                  "updatedTimestamp": "2023-01-22T09:00:00.316",
                  "updatedBy": "ONLINE"
              },
              "_links": {
                  "self": {
                      "href": "http://localhost:8100/v1/citizens/ac100bcf-8a21-1839-818a-2c5c4b2200c9"
                  },
                  "citizen": {
                      "href": "http://localhost:8100/v1/citizens/ac100bcf-8a21-1839-818a-2c5c4b2200c9"
                  }
              }
          },
          {
              "id": "ac100a58-8a21-1840-818a-2c5c591200d6",
              "firstName": "John",
              "lastName": "Smith",
              "dateOfBirth": "1997-03-24",
              "addresses": [
                  {
                      "id": "ac100a58-8a21-1840-818a-2c5c591200d6",
                      "type": "POSTAL",
                      "addressLine1": "Stella House",
                      "addressLine2": "Goldcrest Way",
                      "townOrCity": "Newcastle upon Tyne",
                      "country": "England",
                      "postcode": "NE15 8NY",
                      "_meta": {
                          "channel": "ONLINE",
                          "createdTimestamp": "2023-01-22T09:00:00.316",
                          "createdBy": "ONLINE",
                          "updatedTimestamp": "2023-01-22T09:00:00.316",
                          "updatedBy": "ONLINE"
                      },
                      "_links": {
                          "citizen": {
                              "href": "http://localhost:8100/v1/citizens/ac100a58-8a21-1840-818a-2c5c591200d6"
                          }
                      }
                  }
              ],
              "emails": [],
              "_meta": {
                  "channel": "ONLINE",
                  "createdTimestamp": "2023-01-22T09:00:00.316",
                  "createdBy": "ONLINE",
                  "updatedTimestamp": "2023-01-22T09:00:00.316",
                  "updatedBy": "ONLINE"
              },
              "_links": {
                  "self": {
                      "href": "http://localhost:8100/v1/citizens/ac100a58-8a21-1840-818a-2c5c591200d6"
                  },
                  "citizen": {
                      "href": "http://localhost:8100/v1/citizens/ac100a58-8a21-1840-818a-2c5c591200d6"
                  }
              }
          },
          {
              "id": "ac100a58-8a21-1840-818a-2c5c631000d9",
              "firstName": "John",
              "lastName": "Smith",
              "dateOfBirth": "1997-03-24",
              "addresses": [
                  {
                      "id": "ac100a58-8a21-1840-818a-2c5c631000d9",
                      "type": "POSTAL",
                      "addressLine1": "Stella House",
                      "addressLine2": "Goldcrest Way",
                      "townOrCity": "Newcastle upon Tyne",
                      "country": "England",
                      "postcode": "NE15 8NY",
                      "_meta": {
                          "channel": "ONLINE",
                          "createdTimestamp": "2023-01-22T09:00:00.316",
                          "createdBy": "ONLINE",
                          "updatedTimestamp": "2023-01-22T09:00:00.316",
                          "updatedBy": "ONLINE"
                      },
                      "_links": {
                          "citizen": {
                              "href": "http://localhost:8100/v1/citizens/ac100a58-8a21-1840-818a-2c5c631000d9"
                          }
                      }
                  }
              ],
              "emails": [],
              "_meta": {
                  "channel": "ONLINE",
                  "createdTimestamp": "2023-01-22T09:00:00.316",
                  "createdBy": "ONLINE",
                  "updatedTimestamp": "2023-01-22T09:00:00.316",
                  "updatedBy": "ONLINE"
              },
              "_links": {
                  "self": {
                      "href": "http://localhost:8100/v1/citizens/ac100a58-8a21-1840-818a-2c5c631000d9"
                  },
                  "citizen": {
                      "href": "http://localhost:8100/v1/citizens/ac100a58-8a21-1840-818a-2c5c631000d9"
                  }
              }
          },
          {
              "id": "ac100bcf-8a21-1839-818a-2c5c6a3e00cf",
              "firstName": "John",
              "lastName": "Smith",
              "dateOfBirth": "1997-03-24",
              "addresses": [
                  {
                      "id": "ac100bcf-8a21-1839-818a-2c5c6a3e00cf",
                      "type": "POSTAL",
                      "addressLine1": "Stella House",
                      "addressLine2": "Goldcrest Way",
                      "townOrCity": "Newcastle upon Tyne",
                      "country": "England",
                      "postcode": "NE15 8NY",
                      "_meta": {
                          "channel": "ONLINE",
                          "createdTimestamp": "2023-01-22T09:00:00.316",
                          "createdBy": "ONLINE",
                          "updatedTimestamp": "2023-01-22T09:00:00.316",
                          "updatedBy": "ONLINE"
                      },
                      "_links": {
                          "citizen": {
                              "href": "http://localhost:8100/v1/citizens/ac100bcf-8a21-1839-818a-2c5c6a3e00cf"
                          }
                      }
                  }
              ],
              "emails": [],
              "_meta": {
                  "channel": "ONLINE",
                  "createdTimestamp": "2023-01-22T09:00:00.316",
                  "createdBy": "ONLINE",
                  "updatedTimestamp": "2023-01-22T09:00:00.316",
                  "updatedBy": "ONLINE"
              },
              "_links": {
                  "self": {
                      "href": "http://localhost:8100/v1/citizens/ac100bcf-8a21-1839-818a-2c5c6a3e00cf"
                  },
                  "citizen": {
                      "href": "http://localhost:8100/v1/citizens/ac100bcf-8a21-1839-818a-2c5c6a3e00cf"
                  }
              }
          },
          {
              "id": "ac100a58-8a21-1840-818a-2c5c75f300dc",
              "firstName": "John",
              "lastName": "Smith",
              "dateOfBirth": "1997-03-24",
              "addresses": [
                  {
                      "id": "ac100a58-8a21-1840-818a-2c5c75f300dc",
                      "type": "POSTAL",
                      "addressLine1": "Stella House",
                      "addressLine2": "Goldcrest Way",
                      "townOrCity": "Newcastle upon Tyne",
                      "country": "England",
                      "postcode": "NE15 8NY",
                      "_meta": {
                          "channel": "ONLINE",
                          "createdTimestamp": "2023-01-22T09:00:00.316",
                          "createdBy": "ONLINE",
                          "updatedTimestamp": "2023-01-22T09:00:00.316",
                          "updatedBy": "ONLINE"
                      },
                      "_links": {
                          "citizen": {
                              "href": "http://localhost:8100/v1/citizens/ac100a58-8a21-1840-818a-2c5c75f300dc"
                          }
                      }
                  }
              ],
              "emails": [],
              "_meta": {
                  "channel": "ONLINE",
                  "createdTimestamp": "2023-01-22T09:00:00.316",
                  "createdBy": "ONLINE",
                  "updatedTimestamp": "2023-01-22T09:00:00.316",
                  "updatedBy": "ONLINE"
              },
              "_links": {
                  "self": {
                      "href": "http://localhost:8100/v1/citizens/ac100a58-8a21-1840-818a-2c5c75f300dc"
                  },
                  "citizen": {
                      "href": "http://localhost:8100/v1/citizens/ac100a58-8a21-1840-818a-2c5c75f300dc"
                  }
              }
          },
          {
              "id": "ac100bcf-8a21-1839-818a-2c5c7a5c00d2",
              "firstName": "John",
              "lastName": "Smith",
              "dateOfBirth": "1997-03-24",
              "addresses": [
                  {
                      "id": "ac100bcf-8a21-1839-818a-2c5c7a5c00d2",
                      "type": "POSTAL",
                      "addressLine1": "Stella House",
                      "addressLine2": "Goldcrest Way",
                      "townOrCity": "Newcastle upon Tyne",
                      "country": "England",
                      "postcode": "NE15 8NY",
                      "_meta": {
                          "channel": "ONLINE",
                          "createdTimestamp": "2023-01-22T09:00:00.316",
                          "createdBy": "ONLINE",
                          "updatedTimestamp": "2023-01-22T09:00:00.316",
                          "updatedBy": "ONLINE"
                      },
                      "_links": {
                          "citizen": {
                              "href": "http://localhost:8100/v1/citizens/ac100bcf-8a21-1839-818a-2c5c7a5c00d2"
                          }
                      }
                  }
              ],
              "emails": [],
              "_meta": {
                  "channel": "ONLINE",
                  "createdTimestamp": "2023-01-22T09:00:00.316",
                  "createdBy": "ONLINE",
                  "updatedTimestamp": "2023-01-22T09:00:00.316",
                  "updatedBy": "ONLINE"
              },
              "_links": {
                  "self": {
                      "href": "http://localhost:8100/v1/citizens/ac100bcf-8a21-1839-818a-2c5c7a5c00d2"
                  },
                  "citizen": {
                      "href": "http://localhost:8100/v1/citizens/ac100bcf-8a21-1839-818a-2c5c7a5c00d2"
                  }
              }
          },
          {
              "id": "ac100a58-8a21-1840-818a-2c5c7e5400df",
              "firstName": "John",
              "lastName": "Smith",
              "dateOfBirth": "1997-03-24",
              "addresses": [
                  {
                      "id": "ac100a58-8a21-1840-818a-2c5c7e5400df",
                      "type": "POSTAL",
                      "addressLine1": "Stella House",
                      "addressLine2": "Goldcrest Way",
                      "townOrCity": "Newcastle upon Tyne",
                      "country": "England",
                      "postcode": "NE15 8NY",
                      "_meta": {
                          "channel": "ONLINE",
                          "createdTimestamp": "2023-01-22T09:00:00.316",
                          "createdBy": "ONLINE",
                          "updatedTimestamp": "2023-01-22T09:00:00.316",
                          "updatedBy": "ONLINE"
                      },
                      "_links": {
                          "citizen": {
                              "href": "http://localhost:8100/v1/citizens/ac100a58-8a21-1840-818a-2c5c7e5400df"
                          }
                      }
                  }
              ],
              "emails": [],
              "_meta": {
                  "channel": "ONLINE",
                  "createdTimestamp": "2023-01-22T09:00:00.316",
                  "createdBy": "ONLINE",
                  "updatedTimestamp": "2023-01-22T09:00:00.316",
                  "updatedBy": "ONLINE"
              },
              "_links": {
                  "self": {
                      "href": "http://localhost:8100/v1/citizens/ac100a58-8a21-1840-818a-2c5c7e5400df"
                  },
                  "citizen": {
                      "href": "http://localhost:8100/v1/citizens/ac100a58-8a21-1840-818a-2c5c7e5400df"
                  }
              }
          },
          {
              "id": "ac100bcf-8a21-1839-818a-2c5c826b00d5",
              "firstName": "John",
              "lastName": "Smith",
              "dateOfBirth": "1997-03-24",
              "addresses": [
                  {
                      "id": "ac100bcf-8a21-1839-818a-2c5c826b00d5",
                      "type": "POSTAL",
                      "addressLine1": "Stella House",
                      "addressLine2": "Goldcrest Way",
                      "townOrCity": "Newcastle upon Tyne",
                      "country": "England",
                      "postcode": "NE15 8NY",
                      "_meta": {
                          "channel": "ONLINE",
                          "createdTimestamp": "2023-01-22T09:00:00.316",
                          "createdBy": "ONLINE",
                          "updatedTimestamp": "2023-01-22T09:00:00.316",
                          "updatedBy": "ONLINE"
                      },
                      "_links": {
                          "citizen": {
                              "href": "http://localhost:8100/v1/citizens/ac100bcf-8a21-1839-818a-2c5c826b00d5"
                          }
                      }
                  }
              ],
              "emails": [],
              "_meta": {
                  "channel": "ONLINE",
                  "createdTimestamp": "2023-01-22T09:00:00.316",
                  "createdBy": "ONLINE",
                  "updatedTimestamp": "2023-01-22T09:00:00.316",
                  "updatedBy": "ONLINE"
              },
              "_links": {
                  "self": {
                      "href": "http://localhost:8100/v1/citizens/ac100bcf-8a21-1839-818a-2c5c826b00d5"
                  },
                  "citizen": {
                      "href": "http://localhost:8100/v1/citizens/ac100bcf-8a21-1839-818a-2c5c826b00d5"
                  }
              }
          },
          {
              "id": "ac100a58-8a21-1840-818a-2c5c862700e2",
              "firstName": "John",
              "lastName": "Smith",
              "dateOfBirth": "1997-03-24",
              "addresses": [
                  {
                      "id": "ac100a58-8a21-1840-818a-2c5c862700e2",
                      "type": "POSTAL",
                      "addressLine1": "Stella House",
                      "addressLine2": "Goldcrest Way",
                      "townOrCity": "Newcastle upon Tyne",
                      "country": "England",
                      "postcode": "NE15 8NY",
                      "_meta": {
                          "channel": "ONLINE",
                          "createdTimestamp": "2023-01-22T09:00:00.316",
                          "createdBy": "ONLINE",
                          "updatedTimestamp": "2023-01-22T09:00:00.316",
                          "updatedBy": "ONLINE"
                      },
                      "_links": {
                          "citizen": {
                              "href": "http://localhost:8100/v1/citizens/ac100a58-8a21-1840-818a-2c5c862700e2"
                          }
                      }
                  }
              ],
              "emails": [],
              "_meta": {
                  "channel": "ONLINE",
                  "createdTimestamp": "2023-01-22T09:00:00.316",
                  "createdBy": "ONLINE",
                  "updatedTimestamp": "2023-01-22T09:00:00.316",
                  "updatedBy": "ONLINE"
              },
              "_links": {
                  "self": {
                      "href": "http://localhost:8100/v1/citizens/ac100a58-8a21-1840-818a-2c5c862700e2"
                  },
                  "citizen": {
                      "href": "http://localhost:8100/v1/citizens/ac100a58-8a21-1840-818a-2c5c862700e2"
                  }
              }
          },
          {
              "id": "ac100bcf-8a21-1839-818a-2c5c891200d8",
              "firstName": "John",
              "lastName": "Smith",
              "dateOfBirth": "1997-03-24",
              "addresses": [
                  {
                      "id": "ac100bcf-8a21-1839-818a-2c5c891200d8",
                      "type": "POSTAL",
                      "addressLine1": "Stella House",
                      "addressLine2": "Goldcrest Way",
                      "townOrCity": "Newcastle upon Tyne",
                      "country": "England",
                      "postcode": "NE15 8NY",
                      "_meta": {
                          "channel": "ONLINE",
                          "createdTimestamp": "2023-01-22T09:00:00.316",
                          "createdBy": "ONLINE",
                          "updatedTimestamp": "2023-01-22T09:00:00.316",
                          "updatedBy": "ONLINE"
                      },
                      "_links": {
                          "citizen": {
                              "href": "http://localhost:8100/v1/citizens/ac100bcf-8a21-1839-818a-2c5c891200d8"
                          }
                      }
                  }
              ],
              "emails": [],
              "_meta": {
                  "channel": "ONLINE",
                  "createdTimestamp": "2023-01-22T09:00:00.316",
                  "createdBy": "ONLINE",
                  "updatedTimestamp": "2023-01-22T09:00:00.316",
                  "updatedBy": "ONLINE"
              },
              "_links": {
                  "self": {
                      "href": "http://localhost:8100/v1/citizens/ac100bcf-8a21-1839-818a-2c5c891200d8"
                  },
                  "citizen": {
                      "href": "http://localhost:8100/v1/citizens/ac100bcf-8a21-1839-818a-2c5c891200d8"
                  }
              }
          },
          {
              "id": "ac100a58-8a21-1840-818a-2c5c8ef500e5",
              "firstName": "John",
              "lastName": "Smith",
              "dateOfBirth": "1997-03-24",
              "addresses": [
                  {
                      "id": "ac100a58-8a21-1840-818a-2c5c8ef500e5",
                      "type": "POSTAL",
                      "addressLine1": "Stella House",
                      "addressLine2": "Goldcrest Way",
                      "townOrCity": "Newcastle upon Tyne",
                      "country": "England",
                      "postcode": "NE15 8NY",
                      "_meta": {
                          "channel": "ONLINE",
                          "createdTimestamp": "2023-01-22T09:00:00.316",
                          "createdBy": "ONLINE",
                          "updatedTimestamp": "2023-01-22T09:00:00.316",
                          "updatedBy": "ONLINE"
                      },
                      "_links": {
                          "citizen": {
                              "href": "http://localhost:8100/v1/citizens/ac100a58-8a21-1840-818a-2c5c8ef500e5"
                          }
                      }
                  }
              ],
              "emails": [],
              "_meta": {
                  "channel": "ONLINE",
                  "createdTimestamp": "2023-01-22T09:00:00.316",
                  "createdBy": "ONLINE",
                  "updatedTimestamp": "2023-01-22T09:00:00.316",
                  "updatedBy": "ONLINE"
              },
              "_links": {
                  "self": {
                      "href": "http://localhost:8100/v1/citizens/ac100a58-8a21-1840-818a-2c5c8ef500e5"
                  },
                  "citizen": {
                      "href": "http://localhost:8100/v1/citizens/ac100a58-8a21-1840-818a-2c5c8ef500e5"
                  }
              }
          },
          {
              "id": "ac100bcf-8a21-1839-818a-2c5c930600db",
              "firstName": "John",
              "lastName": "Smith",
              "dateOfBirth": "1997-03-24",
              "addresses": [
                  {
                      "id": "ac100bcf-8a21-1839-818a-2c5c930600db",
                      "type": "POSTAL",
                      "addressLine1": "Stella House",
                      "addressLine2": "Goldcrest Way",
                      "townOrCity": "Newcastle upon Tyne",
                      "country": "England",
                      "postcode": "NE15 8NY",
                      "_meta": {
                          "channel": "ONLINE",
                          "createdTimestamp": "2023-01-22T09:00:00.316",
                          "createdBy": "ONLINE",
                          "updatedTimestamp": "2023-01-22T09:00:00.316",
                          "updatedBy": "ONLINE"
                      },
                      "_links": {
                          "citizen": {
                              "href": "http://localhost:8100/v1/citizens/ac100bcf-8a21-1839-818a-2c5c930600db"
                          }
                      }
                  }
              ],
              "emails": [],
              "_meta": {
                  "channel": "ONLINE",
                  "createdTimestamp": "2023-01-22T09:00:00.316",
                  "createdBy": "ONLINE",
                  "updatedTimestamp": "2023-01-22T09:00:00.316",
                  "updatedBy": "ONLINE"
              },
              "_links": {
                  "self": {
                      "href": "http://localhost:8100/v1/citizens/ac100bcf-8a21-1839-818a-2c5c930600db"
                  },
                  "citizen": {
                      "href": "http://localhost:8100/v1/citizens/ac100bcf-8a21-1839-818a-2c5c930600db"
                  }
              }
          },
          {
              "id": "ac100a58-8a21-1840-818a-2c5ca3f700e8",
              "firstName": "John",
              "lastName": "Smith",
              "dateOfBirth": "1997-03-24",
              "addresses": [
                  {
                      "id": "ac100a58-8a21-1840-818a-2c5ca3f700e8",
                      "type": "POSTAL",
                      "addressLine1": "Stella House",
                      "addressLine2": "Goldcrest Way",
                      "townOrCity": "Newcastle upon Tyne",
                      "country": "England",
                      "postcode": "NE15 8NY",
                      "_meta": {
                          "channel": "ONLINE",
                          "createdTimestamp": "2023-01-22T09:00:00.316",
                          "createdBy": "ONLINE",
                          "updatedTimestamp": "2023-01-22T09:00:00.316",
                          "updatedBy": "ONLINE"
                      },
                      "_links": {
                          "citizen": {
                              "href": "http://localhost:8100/v1/citizens/ac100a58-8a21-1840-818a-2c5ca3f700e8"
                          }
                      }
                  }
              ],
              "emails": [],
              "_meta": {
                  "channel": "ONLINE",
                  "createdTimestamp": "2023-01-22T09:00:00.316",
                  "createdBy": "ONLINE",
                  "updatedTimestamp": "2023-01-22T09:00:00.316",
                  "updatedBy": "ONLINE"
              },
              "_links": {
                  "self": {
                      "href": "http://localhost:8100/v1/citizens/ac100a58-8a21-1840-818a-2c5ca3f700e8"
                  },
                  "citizen": {
                      "href": "http://localhost:8100/v1/citizens/ac100a58-8a21-1840-818a-2c5ca3f700e8"
                  }
              }
          },
          {
              "id": "ac100a58-8a21-1840-818a-2c5ccfe300eb",
              "firstName": "John",
              "lastName": "Smith",
              "dateOfBirth": "1997-03-24",
              "addresses": [
                  {
                      "id": "ac100a58-8a21-1840-818a-2c5ccfe300eb",
                      "type": "POSTAL",
                      "addressLine1": "Stella House",
                      "addressLine2": "Goldcrest Way",
                      "townOrCity": "Newcastle upon Tyne",
                      "country": "England",
                      "postcode": "NE15 8NY",
                      "_meta": {
                          "channel": "ONLINE",
                          "createdTimestamp": "2023-01-22T09:00:00.316",
                          "createdBy": "ONLINE",
                          "updatedTimestamp": "2023-01-22T09:00:00.316",
                          "updatedBy": "ONLINE"
                      },
                      "_links": {
                          "citizen": {
                              "href": "http://localhost:8100/v1/citizens/ac100a58-8a21-1840-818a-2c5ccfe300eb"
                          }
                      }
                  }
              ],
              "emails": [],
              "_meta": {
                  "channel": "ONLINE",
                  "createdTimestamp": "2023-01-22T09:00:00.316",
                  "createdBy": "ONLINE",
                  "updatedTimestamp": "2023-01-22T09:00:00.316",
                  "updatedBy": "ONLINE"
              },
              "_links": {
                  "self": {
                      "href": "http://localhost:8100/v1/citizens/ac100a58-8a21-1840-818a-2c5ccfe300eb"
                  },
                  "citizen": {
                      "href": "http://localhost:8100/v1/citizens/ac100a58-8a21-1840-818a-2c5ccfe300eb"
                  }
              }
          },
          {
              "id": "ac100bcf-8a21-1839-818a-2c5d0cb900de",
              "firstName": "John",
              "lastName": "Smith",
              "dateOfBirth": "1997-03-24",
              "addresses": [
                  {
                      "id": "ac100bcf-8a21-1839-818a-2c5d0cb900de",
                      "type": "POSTAL",
                      "addressLine1": "Stella House",
                      "addressLine2": "Goldcrest Way",
                      "townOrCity": "Newcastle upon Tyne",
                      "country": "England",
                      "postcode": "NE15 8NY",
                      "_meta": {
                          "channel": "ONLINE",
                          "createdTimestamp": "2023-01-22T09:00:00.316",
                          "createdBy": "ONLINE",
                          "updatedTimestamp": "2023-01-22T09:00:00.316",
                          "updatedBy": "ONLINE"
                      },
                      "_links": {
                          "citizen": {
                              "href": "http://localhost:8100/v1/citizens/ac100bcf-8a21-1839-818a-2c5d0cb900de"
                          }
                      }
                  }
              ],
              "emails": [],
              "_meta": {
                  "channel": "ONLINE",
                  "createdTimestamp": "2023-01-22T09:00:00.316",
                  "createdBy": "ONLINE",
                  "updatedTimestamp": "2023-01-22T09:00:00.316",
                  "updatedBy": "ONLINE"
              },
              "_links": {
                  "self": {
                      "href": "http://localhost:8100/v1/citizens/ac100bcf-8a21-1839-818a-2c5d0cb900de"
                  },
                  "citizen": {
                      "href": "http://localhost:8100/v1/citizens/ac100bcf-8a21-1839-818a-2c5d0cb900de"
                  }
              }
          },
          {
              "id": "ac100a58-8a21-1840-818a-2c5d16ee00ee",
              "firstName": "John",
              "lastName": "Smith",
              "dateOfBirth": "1997-03-24",
              "addresses": [
                  {
                      "id": "ac100a58-8a21-1840-818a-2c5d16ee00ee",
                      "type": "POSTAL",
                      "addressLine1": "Stella House",
                      "addressLine2": "Goldcrest Way",
                      "townOrCity": "Newcastle upon Tyne",
                      "country": "England",
                      "postcode": "NE15 8NY",
                      "_meta": {
                          "channel": "ONLINE",
                          "createdTimestamp": "2023-01-22T09:00:00.316",
                          "createdBy": "ONLINE",
                          "updatedTimestamp": "2023-01-22T09:00:00.316",
                          "updatedBy": "ONLINE"
                      },
                      "_links": {
                          "citizen": {
                              "href": "http://localhost:8100/v1/citizens/ac100a58-8a21-1840-818a-2c5d16ee00ee"
                          }
                      }
                  }
              ],
              "emails": [],
              "_meta": {
                  "channel": "ONLINE",
                  "createdTimestamp": "2023-01-22T09:00:00.316",
                  "createdBy": "ONLINE",
                  "updatedTimestamp": "2023-01-22T09:00:00.316",
                  "updatedBy": "ONLINE"
              },
              "_links": {
                  "self": {
                      "href": "http://localhost:8100/v1/citizens/ac100a58-8a21-1840-818a-2c5d16ee00ee"
                  },
                  "citizen": {
                      "href": "http://localhost:8100/v1/citizens/ac100a58-8a21-1840-818a-2c5d16ee00ee"
                  }
              }
          },
          {
              "id": "ac100bcf-8a21-1839-818a-2c5d6e5d00e1",
              "firstName": "John",
              "lastName": "Smith",
              "dateOfBirth": "1997-03-24",
              "addresses": [
                  {
                      "id": "ac100bcf-8a21-1839-818a-2c5d6e5d00e1",
                      "type": "POSTAL",
                      "addressLine1": "Stella House",
                      "addressLine2": "Goldcrest Way",
                      "townOrCity": "Newcastle upon Tyne",
                      "country": "England",
                      "postcode": "NE15 8NY",
                      "_meta": {
                          "channel": "ONLINE",
                          "createdTimestamp": "2023-01-22T09:00:00.316",
                          "createdBy": "ONLINE",
                          "updatedTimestamp": "2023-01-22T09:00:00.316",
                          "updatedBy": "ONLINE"
                      },
                      "_links": {
                          "citizen": {
                              "href": "http://localhost:8100/v1/citizens/ac100bcf-8a21-1839-818a-2c5d6e5d00e1"
                          }
                      }
                  }
              ],
              "emails": [],
              "_meta": {
                  "channel": "ONLINE",
                  "createdTimestamp": "2023-01-22T09:00:00.316",
                  "createdBy": "ONLINE",
                  "updatedTimestamp": "2023-01-22T09:00:00.316",
                  "updatedBy": "ONLINE"
              },
              "_links": {
                  "self": {
                      "href": "http://localhost:8100/v1/citizens/ac100bcf-8a21-1839-818a-2c5d6e5d00e1"
                  },
                  "citizen": {
                      "href": "http://localhost:8100/v1/citizens/ac100bcf-8a21-1839-818a-2c5d6e5d00e1"
                  }
              }
          },
          {
              "id": "ac100a58-8a21-1840-818a-2c5d72ba00f1",
              "firstName": "John",
              "lastName": "Smith",
              "dateOfBirth": "1997-03-24",
              "addresses": [
                  {
                      "id": "ac100a58-8a21-1840-818a-2c5d72ba00f1",
                      "type": "POSTAL",
                      "addressLine1": "Stella House",
                      "addressLine2": "Goldcrest Way",
                      "townOrCity": "Newcastle upon Tyne",
                      "country": "England",
                      "postcode": "NE15 8NY",
                      "_meta": {
                          "channel": "ONLINE",
                          "createdTimestamp": "2023-01-22T09:00:00.316",
                          "createdBy": "ONLINE",
                          "updatedTimestamp": "2023-01-22T09:00:00.316",
                          "updatedBy": "ONLINE"
                      },
                      "_links": {
                          "citizen": {
                              "href": "http://localhost:8100/v1/citizens/ac100a58-8a21-1840-818a-2c5d72ba00f1"
                          }
                      }
                  }
              ],
              "emails": [],
              "_meta": {
                  "channel": "ONLINE",
                  "createdTimestamp": "2023-01-22T09:00:00.316",
                  "createdBy": "ONLINE",
                  "updatedTimestamp": "2023-01-22T09:00:00.316",
                  "updatedBy": "ONLINE"
              },
              "_links": {
                  "self": {
                      "href": "http://localhost:8100/v1/citizens/ac100a58-8a21-1840-818a-2c5d72ba00f1"
                  },
                  "citizen": {
                      "href": "http://localhost:8100/v1/citizens/ac100a58-8a21-1840-818a-2c5d72ba00f1"
                  }
              }
          },
          {
              "id": "ac100a58-8a21-1840-818a-2e031b4806a2",
              "firstName": "John",
              "lastName": "Smith",
              "dateOfBirth": "1997-03-24",
              "addresses": [
                  {
                      "id": "ac100a58-8a21-1840-818a-2e031b4806a2",
                      "type": "POSTAL",
                      "addressLine1": "Stella House",
                      "addressLine2": "Goldcrest Way",
                      "townOrCity": "Newcastle upon Tyne",
                      "country": "England",
                      "postcode": "NE15 8NY",
                      "_meta": {
                          "channel": "ONLINE",
                          "createdTimestamp": "2023-01-22T09:00:00.316",
                          "createdBy": "ONLINE",
                          "updatedTimestamp": "2023-01-22T09:00:00.316",
                          "updatedBy": "ONLINE"
                      },
                      "_links": {
                          "citizen": {
                              "href": "http://localhost:8100/v1/citizens/ac100a58-8a21-1840-818a-2e031b4806a2"
                          }
                      }
                  }
              ],
              "emails": [],
              "_meta": {
                  "channel": "ONLINE",
                  "createdTimestamp": "2023-01-22T09:00:00.316",
                  "createdBy": "ONLINE",
                  "updatedTimestamp": "2023-01-22T09:00:00.316",
                  "updatedBy": "ONLINE"
              },
              "_links": {
                  "self": {
                      "href": "http://localhost:8100/v1/citizens/ac100a58-8a21-1840-818a-2e031b4806a2"
                  },
                  "citizen": {
                      "href": "http://localhost:8100/v1/citizens/ac100a58-8a21-1840-818a-2e031b4806a2"
                  }
              }
          },
          {
              "id": "ac100a58-8a21-1840-818a-2e031d5006a5",
              "firstName": "John",
              "lastName": "Smith",
              "dateOfBirth": "1997-03-24",
              "addresses": [
                  {
                      "id": "ac100a58-8a21-1840-818a-2e031d5006a5",
                      "type": "POSTAL",
                      "addressLine1": "Stella House",
                      "addressLine2": "Goldcrest Way",
                      "townOrCity": "Newcastle upon Tyne",
                      "country": "England",
                      "postcode": "NE15 8NY",
                      "_meta": {
                          "channel": "ONLINE",
                          "createdTimestamp": "2023-01-22T09:00:00.316",
                          "createdBy": "ONLINE",
                          "updatedTimestamp": "2023-01-22T09:00:00.316",
                          "updatedBy": "ONLINE"
                      },
                      "_links": {
                          "citizen": {
                              "href": "http://localhost:8100/v1/citizens/ac100a58-8a21-1840-818a-2e031d5006a5"
                          }
                      }
                  }
              ],
              "emails": [],
              "_meta": {
                  "channel": "ONLINE",
                  "createdTimestamp": "2023-01-22T09:00:00.316",
                  "createdBy": "ONLINE",
                  "updatedTimestamp": "2023-01-22T09:00:00.316",
                  "updatedBy": "ONLINE"
              },
              "_links": {
                  "self": {
                      "href": "http://localhost:8100/v1/citizens/ac100a58-8a21-1840-818a-2e031d5006a5"
                  },
                  "citizen": {
                      "href": "http://localhost:8100/v1/citizens/ac100a58-8a21-1840-818a-2e031d5006a5"
                  }
              }
          },
          {
              "id": "ac100a58-8a21-1840-818a-2e0320e206a8",
              "firstName": "John",
              "lastName": "Smith",
              "dateOfBirth": "1997-03-24",
              "addresses": [
                  {
                      "id": "ac100a58-8a21-1840-818a-2e0320e206a8",
                      "type": "POSTAL",
                      "addressLine1": "Stella House",
                      "addressLine2": "Goldcrest Way",
                      "townOrCity": "Newcastle upon Tyne",
                      "country": "England",
                      "postcode": "NE15 8NY",
                      "_meta": {
                          "channel": "ONLINE",
                          "createdTimestamp": "2023-01-22T09:00:00.316",
                          "createdBy": "ONLINE",
                          "updatedTimestamp": "2023-01-22T09:00:00.316",
                          "updatedBy": "ONLINE"
                      },
                      "_links": {
                          "citizen": {
                              "href": "http://localhost:8100/v1/citizens/ac100a58-8a21-1840-818a-2e0320e206a8"
                          }
                      }
                  }
              ],
              "emails": [],
              "_meta": {
                  "channel": "ONLINE",
                  "createdTimestamp": "2023-01-22T09:00:00.316",
                  "createdBy": "ONLINE",
                  "updatedTimestamp": "2023-01-22T09:00:00.316",
                  "updatedBy": "ONLINE"
              },
              "_links": {
                  "self": {
                      "href": "http://localhost:8100/v1/citizens/ac100a58-8a21-1840-818a-2e0320e206a8"
                  },
                  "citizen": {
                      "href": "http://localhost:8100/v1/citizens/ac100a58-8a21-1840-818a-2e0320e206a8"
                  }
              }
          },
          {
              "id": "ac100a58-8a21-1840-818a-2e05410d06ab",
              "firstName": "John",
              "lastName": "Smith",
              "dateOfBirth": "1997-03-24",
              "addresses": [
                  {
                      "id": "ac100a58-8a21-1840-818a-2e05410d06ab",
                      "type": "POSTAL",
                      "addressLine1": "Stella House",
                      "addressLine2": "Goldcrest Way",
                      "townOrCity": "Newcastle upon Tyne",
                      "country": "England",
                      "postcode": "NE15 8NY",
                      "_meta": {
                          "channel": "ONLINE",
                          "createdTimestamp": "2023-01-22T09:00:00.316",
                          "createdBy": "ONLINE",
                          "updatedTimestamp": "2023-01-22T09:00:00.316",
                          "updatedBy": "ONLINE"
                      },
                      "_links": {
                          "citizen": {
                              "href": "http://localhost:8100/v1/citizens/ac100a58-8a21-1840-818a-2e05410d06ab"
                          }
                      }
                  }
              ],
              "emails": [],
              "_meta": {
                  "channel": "ONLINE",
                  "createdTimestamp": "2023-01-22T09:00:00.316",
                  "createdBy": "ONLINE",
                  "updatedTimestamp": "2023-01-22T09:00:00.316",
                  "updatedBy": "ONLINE"
              },
              "_links": {
                  "self": {
                      "href": "http://localhost:8100/v1/citizens/ac100a58-8a21-1840-818a-2e05410d06ab"
                  },
                  "citizen": {
                      "href": "http://localhost:8100/v1/citizens/ac100a58-8a21-1840-818a-2e05410d06ab"
                  }
              }
          },
          {
              "id": "ac100a58-8a21-1840-818a-2e05457206ae",
              "firstName": "John",
              "lastName": "Smith",
              "dateOfBirth": "1997-03-24",
              "addresses": [
                  {
                      "id": "ac100a58-8a21-1840-818a-2e05457206ae",
                      "type": "POSTAL",
                      "addressLine1": "Stella House",
                      "addressLine2": "Goldcrest Way",
                      "townOrCity": "Newcastle upon Tyne",
                      "country": "England",
                      "postcode": "NE15 8NY",
                      "_meta": {
                          "channel": "ONLINE",
                          "createdTimestamp": "2023-01-22T09:00:00.316",
                          "createdBy": "ONLINE",
                          "updatedTimestamp": "2023-01-22T09:00:00.316",
                          "updatedBy": "ONLINE"
                      },
                      "_links": {
                          "citizen": {
                              "href": "http://localhost:8100/v1/citizens/ac100a58-8a21-1840-818a-2e05457206ae"
                          }
                      }
                  }
              ],
              "emails": [],
              "_meta": {
                  "channel": "ONLINE",
                  "createdTimestamp": "2023-01-22T09:00:00.316",
                  "createdBy": "ONLINE",
                  "updatedTimestamp": "2023-01-22T09:00:00.316",
                  "updatedBy": "ONLINE"
              },
              "_links": {
                  "self": {
                      "href": "http://localhost:8100/v1/citizens/ac100a58-8a21-1840-818a-2e05457206ae"
                  },
                  "citizen": {
                      "href": "http://localhost:8100/v1/citizens/ac100a58-8a21-1840-818a-2e05457206ae"
                  }
              }
          },
          {
              "id": "ac100a58-8a21-1840-818a-2e05478106b1",
              "firstName": "John",
              "lastName": "Smith",
              "dateOfBirth": "1997-03-24",
              "addresses": [
                  {
                      "id": "ac100a58-8a21-1840-818a-2e05478106b1",
                      "type": "POSTAL",
                      "addressLine1": "Stella House",
                      "addressLine2": "Goldcrest Way",
                      "townOrCity": "Newcastle upon Tyne",
                      "country": "England",
                      "postcode": "NE15 8NY",
                      "_meta": {
                          "channel": "ONLINE",
                          "createdTimestamp": "2023-01-22T09:00:00.316",
                          "createdBy": "ONLINE",
                          "updatedTimestamp": "2023-01-22T09:00:00.316",
                          "updatedBy": "ONLINE"
                      },
                      "_links": {
                          "citizen": {
                              "href": "http://localhost:8100/v1/citizens/ac100a58-8a21-1840-818a-2e05478106b1"
                          }
                      }
                  }
              ],
              "emails": [],
              "_meta": {
                  "channel": "ONLINE",
                  "createdTimestamp": "2023-01-22T09:00:00.316",
                  "createdBy": "ONLINE",
                  "updatedTimestamp": "2023-01-22T09:00:00.316",
                  "updatedBy": "ONLINE"
              },
              "_links": {
                  "self": {
                      "href": "http://localhost:8100/v1/citizens/ac100a58-8a21-1840-818a-2e05478106b1"
                  },
                  "citizen": {
                      "href": "http://localhost:8100/v1/citizens/ac100a58-8a21-1840-818a-2e05478106b1"
                  }
              }
          },
          {
              "id": "ac100a58-8a21-1840-818a-2e054b5906b4",
              "firstName": "John",
              "lastName": "Smith",
              "dateOfBirth": "1997-03-24",
              "addresses": [
                  {
                      "id": "ac100a58-8a21-1840-818a-2e054b5906b4",
                      "type": "POSTAL",
                      "addressLine1": "Stella House",
                      "addressLine2": "Goldcrest Way",
                      "townOrCity": "Newcastle upon Tyne",
                      "country": "England",
                      "postcode": "NE15 8NY",
                      "_meta": {
                          "channel": "ONLINE",
                          "createdTimestamp": "2023-01-22T09:00:00.316",
                          "createdBy": "ONLINE",
                          "updatedTimestamp": "2023-01-22T09:00:00.316",
                          "updatedBy": "ONLINE"
                      },
                      "_links": {
                          "citizen": {
                              "href": "http://localhost:8100/v1/citizens/ac100a58-8a21-1840-818a-2e054b5906b4"
                          }
                      }
                  }
              ],
              "emails": [],
              "_meta": {
                  "channel": "ONLINE",
                  "createdTimestamp": "2023-01-22T09:00:00.316",
                  "createdBy": "ONLINE",
                  "updatedTimestamp": "2023-01-22T09:00:00.316",
                  "updatedBy": "ONLINE"
              },
              "_links": {
                  "self": {
                      "href": "http://localhost:8100/v1/citizens/ac100a58-8a21-1840-818a-2e054b5906b4"
                  },
                  "citizen": {
                      "href": "http://localhost:8100/v1/citizens/ac100a58-8a21-1840-818a-2e054b5906b4"
                  }
              }
          },
          {
              "id": "ac100a58-8a21-1840-818a-2e054f7e06b7",
              "firstName": "John",
              "lastName": "Smith",
              "dateOfBirth": "1997-03-24",
              "addresses": [
                  {
                      "id": "ac100a58-8a21-1840-818a-2e054f7e06b7",
                      "type": "POSTAL",
                      "addressLine1": "Stella House",
                      "addressLine2": "Goldcrest Way",
                      "townOrCity": "Newcastle upon Tyne",
                      "country": "England",
                      "postcode": "NE15 8NY",
                      "_meta": {
                          "channel": "ONLINE",
                          "createdTimestamp": "2023-01-22T09:00:00.316",
                          "createdBy": "ONLINE",
                          "updatedTimestamp": "2023-01-22T09:00:00.316",
                          "updatedBy": "ONLINE"
                      },
                      "_links": {
                          "citizen": {
                              "href": "http://localhost:8100/v1/citizens/ac100a58-8a21-1840-818a-2e054f7e06b7"
                          }
                      }
                  }
              ],
              "emails": [],
              "_meta": {
                  "channel": "ONLINE",
                  "createdTimestamp": "2023-01-22T09:00:00.316",
                  "createdBy": "ONLINE",
                  "updatedTimestamp": "2023-01-22T09:00:00.316",
                  "updatedBy": "ONLINE"
              },
              "_links": {
                  "self": {
                      "href": "http://localhost:8100/v1/citizens/ac100a58-8a21-1840-818a-2e054f7e06b7"
                  },
                  "citizen": {
                      "href": "http://localhost:8100/v1/citizens/ac100a58-8a21-1840-818a-2e054f7e06b7"
                  }
              }
          },
          {
              "id": "ac100a58-8a21-1840-818a-2e05555806ba",
              "firstName": "John",
              "lastName": "Smith",
              "dateOfBirth": "1997-03-24",
              "addresses": [
                  {
                      "id": "ac100a58-8a21-1840-818a-2e05555806ba",
                      "type": "POSTAL",
                      "addressLine1": "Stella House",
                      "addressLine2": "Goldcrest Way",
                      "townOrCity": "Newcastle upon Tyne",
                      "country": "England",
                      "postcode": "NE15 8NY",
                      "_meta": {
                          "channel": "ONLINE",
                          "createdTimestamp": "2023-01-22T09:00:00.316",
                          "createdBy": "ONLINE",
                          "updatedTimestamp": "2023-01-22T09:00:00.316",
                          "updatedBy": "ONLINE"
                      },
                      "_links": {
                          "citizen": {
                              "href": "http://localhost:8100/v1/citizens/ac100a58-8a21-1840-818a-2e05555806ba"
                          }
                      }
                  }
              ],
              "emails": [],
              "_meta": {
                  "channel": "ONLINE",
                  "createdTimestamp": "2023-01-22T09:00:00.316",
                  "createdBy": "ONLINE",
                  "updatedTimestamp": "2023-01-22T09:00:00.316",
                  "updatedBy": "ONLINE"
              },
              "_links": {
                  "self": {
                      "href": "http://localhost:8100/v1/citizens/ac100a58-8a21-1840-818a-2e05555806ba"
                  },
                  "citizen": {
                      "href": "http://localhost:8100/v1/citizens/ac100a58-8a21-1840-818a-2e05555806ba"
                  }
              }
          },
          {
              "id": "ac100a58-8a21-1840-818a-2e0557b906bd",
              "firstName": "John",
              "lastName": "Smith",
              "dateOfBirth": "1997-03-24",
              "addresses": [
                  {
                      "id": "ac100a58-8a21-1840-818a-2e0557b906bd",
                      "type": "POSTAL",
                      "addressLine1": "Stella House",
                      "addressLine2": "Goldcrest Way",
                      "townOrCity": "Newcastle upon Tyne",
                      "country": "England",
                      "postcode": "NE15 8NY",
                      "_meta": {
                          "channel": "ONLINE",
                          "createdTimestamp": "2023-01-22T09:00:00.316",
                          "createdBy": "ONLINE",
                          "updatedTimestamp": "2023-01-22T09:00:00.316",
                          "updatedBy": "ONLINE"
                      },
                      "_links": {
                          "citizen": {
                              "href": "http://localhost:8100/v1/citizens/ac100a58-8a21-1840-818a-2e0557b906bd"
                          }
                      }
                  }
              ],
              "emails": [],
              "_meta": {
                  "channel": "ONLINE",
                  "createdTimestamp": "2023-01-22T09:00:00.316",
                  "createdBy": "ONLINE",
                  "updatedTimestamp": "2023-01-22T09:00:00.316",
                  "updatedBy": "ONLINE"
              },
              "_links": {
                  "self": {
                      "href": "http://localhost:8100/v1/citizens/ac100a58-8a21-1840-818a-2e0557b906bd"
                  },
                  "citizen": {
                      "href": "http://localhost:8100/v1/citizens/ac100a58-8a21-1840-818a-2e0557b906bd"
                  }
              }
          },
          {
              "id": "ac100a58-8a21-1840-818a-2e055b7c06c0",
              "firstName": "John",
              "lastName": "Smith",
              "dateOfBirth": "1997-03-24",
              "addresses": [
                  {
                      "id": "ac100a58-8a21-1840-818a-2e055b7c06c0",
                      "type": "POSTAL",
                      "addressLine1": "Stella House",
                      "addressLine2": "Goldcrest Way",
                      "townOrCity": "Newcastle upon Tyne",
                      "country": "England",
                      "postcode": "NE15 8NY",
                      "_meta": {
                          "channel": "ONLINE",
                          "createdTimestamp": "2023-01-22T09:00:00.316",
                          "createdBy": "ONLINE",
                          "updatedTimestamp": "2023-01-22T09:00:00.316",
                          "updatedBy": "ONLINE"
                      },
                      "_links": {
                          "citizen": {
                              "href": "http://localhost:8100/v1/citizens/ac100a58-8a21-1840-818a-2e055b7c06c0"
                          }
                      }
                  }
              ],
              "emails": [],
              "_meta": {
                  "channel": "ONLINE",
                  "createdTimestamp": "2023-01-22T09:00:00.316",
                  "createdBy": "ONLINE",
                  "updatedTimestamp": "2023-01-22T09:00:00.316",
                  "updatedBy": "ONLINE"
              },
              "_links": {
                  "self": {
                      "href": "http://localhost:8100/v1/citizens/ac100a58-8a21-1840-818a-2e055b7c06c0"
                  },
                  "citizen": {
                      "href": "http://localhost:8100/v1/citizens/ac100a58-8a21-1840-818a-2e055b7c06c0"
                  }
              }
          },
          {
              "id": "ac100a58-8a21-1840-818a-2e05630606c6",
              "firstName": "John",
              "lastName": "Smith",
              "dateOfBirth": "1997-03-24",
              "addresses": [
                  {
                      "id": "ac100a58-8a21-1840-818a-2e05630606c6",
                      "type": "POSTAL",
                      "addressLine1": "Stella House",
                      "addressLine2": "Goldcrest Way",
                      "townOrCity": "Newcastle upon Tyne",
                      "country": "England",
                      "postcode": "NE15 8NY",
                      "_meta": {
                          "channel": "ONLINE",
                          "createdTimestamp": "2023-01-22T09:00:00.316",
                          "createdBy": "ONLINE",
                          "updatedTimestamp": "2023-01-22T09:00:00.316",
                          "updatedBy": "ONLINE"
                      },
                      "_links": {
                          "citizen": {
                              "href": "http://localhost:8100/v1/citizens/ac100a58-8a21-1840-818a-2e05630606c6"
                          }
                      }
                  }
              ],
              "emails": [],
              "_meta": {
                  "channel": "ONLINE",
                  "createdTimestamp": "2023-01-22T09:00:00.316",
                  "createdBy": "ONLINE",
                  "updatedTimestamp": "2023-01-22T09:00:00.316",
                  "updatedBy": "ONLINE"
              },
              "_links": {
                  "self": {
                      "href": "http://localhost:8100/v1/citizens/ac100a58-8a21-1840-818a-2e05630606c6"
                  },
                  "citizen": {
                      "href": "http://localhost:8100/v1/citizens/ac100a58-8a21-1840-818a-2e05630606c6"
                  }
              }
          },
          {
              "id": "ac100a58-8a21-1840-818a-2e05671406c9",
              "firstName": "John",
              "lastName": "Smith",
              "dateOfBirth": "1997-03-24",
              "addresses": [
                  {
                      "id": "ac100a58-8a21-1840-818a-2e05671406c9",
                      "type": "POSTAL",
                      "addressLine1": "Stella House",
                      "addressLine2": "Goldcrest Way",
                      "townOrCity": "Newcastle upon Tyne",
                      "country": "England",
                      "postcode": "NE15 8NY",
                      "_meta": {
                          "channel": "ONLINE",
                          "createdTimestamp": "2023-01-22T09:00:00.316",
                          "createdBy": "ONLINE",
                          "updatedTimestamp": "2023-01-22T09:00:00.316",
                          "updatedBy": "ONLINE"
                      },
                      "_links": {
                          "citizen": {
                              "href": "http://localhost:8100/v1/citizens/ac100a58-8a21-1840-818a-2e05671406c9"
                          }
                      }
                  }
              ],
              "emails": [],
              "_meta": {
                  "channel": "ONLINE",
                  "createdTimestamp": "2023-01-22T09:00:00.316",
                  "createdBy": "ONLINE",
                  "updatedTimestamp": "2023-01-22T09:00:00.316",
                  "updatedBy": "ONLINE"
              },
              "_links": {
                  "self": {
                      "href": "http://localhost:8100/v1/citizens/ac100a58-8a21-1840-818a-2e05671406c9"
                  },
                  "citizen": {
                      "href": "http://localhost:8100/v1/citizens/ac100a58-8a21-1840-818a-2e05671406c9"
                  }
              }
          },
          {
              "id": "ac100a58-8a21-1840-818a-2e056ac706cc",
              "firstName": "John",
              "lastName": "Smith",
              "dateOfBirth": "1997-03-24",
              "addresses": [
                  {
                      "id": "ac100a58-8a21-1840-818a-2e056ac706cc",
                      "type": "POSTAL",
                      "addressLine1": "Stella House",
                      "addressLine2": "Goldcrest Way",
                      "townOrCity": "Newcastle upon Tyne",
                      "country": "England",
                      "postcode": "NE15 8NY",
                      "_meta": {
                          "channel": "ONLINE",
                          "createdTimestamp": "2023-01-22T09:00:00.316",
                          "createdBy": "ONLINE",
                          "updatedTimestamp": "2023-01-22T09:00:00.316",
                          "updatedBy": "ONLINE"
                      },
                      "_links": {
                          "citizen": {
                              "href": "http://localhost:8100/v1/citizens/ac100a58-8a21-1840-818a-2e056ac706cc"
                          }
                      }
                  }
              ],
              "emails": [],
              "_meta": {
                  "channel": "ONLINE",
                  "createdTimestamp": "2023-01-22T09:00:00.316",
                  "createdBy": "ONLINE",
                  "updatedTimestamp": "2023-01-22T09:00:00.316",
                  "updatedBy": "ONLINE"
              },
              "_links": {
                  "self": {
                      "href": "http://localhost:8100/v1/citizens/ac100a58-8a21-1840-818a-2e056ac706cc"
                  },
                  "citizen": {
                      "href": "http://localhost:8100/v1/citizens/ac100a58-8a21-1840-818a-2e056ac706cc"
                  }
              }
          },
          {
              "id": "ac100a58-8a21-1840-818a-2e056e7506cf",
              "firstName": "John",
              "lastName": "Smith",
              "dateOfBirth": "1997-03-24",
              "addresses": [
                  {
                      "id": "ac100a58-8a21-1840-818a-2e056e7506cf",
                      "type": "POSTAL",
                      "addressLine1": "Stella House",
                      "addressLine2": "Goldcrest Way",
                      "townOrCity": "Newcastle upon Tyne",
                      "country": "England",
                      "postcode": "NE15 8NY",
                      "_meta": {
                          "channel": "ONLINE",
                          "createdTimestamp": "2023-01-22T09:00:00.316",
                          "createdBy": "ONLINE",
                          "updatedTimestamp": "2023-01-22T09:00:00.316",
                          "updatedBy": "ONLINE"
                      },
                      "_links": {
                          "citizen": {
                              "href": "http://localhost:8100/v1/citizens/ac100a58-8a21-1840-818a-2e056e7506cf"
                          }
                      }
                  }
              ],
              "emails": [],
              "_meta": {
                  "channel": "ONLINE",
                  "createdTimestamp": "2023-01-22T09:00:00.316",
                  "createdBy": "ONLINE",
                  "updatedTimestamp": "2023-01-22T09:00:00.316",
                  "updatedBy": "ONLINE"
              },
              "_links": {
                  "self": {
                      "href": "http://localhost:8100/v1/citizens/ac100a58-8a21-1840-818a-2e056e7506cf"
                  },
                  "citizen": {
                      "href": "http://localhost:8100/v1/citizens/ac100a58-8a21-1840-818a-2e056e7506cf"
                  }
              }
          },
          {
              "id": "ac100a58-8a21-1840-818a-2e0667c406d2",
              "firstName": "John",
              "lastName": "Smith",
              "dateOfBirth": "1997-03-24",
              "addresses": [
                  {
                      "id": "ac100a58-8a21-1840-818a-2e0667c406d2",
                      "type": "POSTAL",
                      "addressLine1": "Stella House",
                      "addressLine2": "Goldcrest Way",
                      "townOrCity": "Newcastle upon Tyne",
                      "country": "England",
                      "postcode": "NE15 8NY",
                      "_meta": {
                          "channel": "ONLINE",
                          "createdTimestamp": "2023-01-22T09:00:00.316",
                          "createdBy": "ONLINE",
                          "updatedTimestamp": "2023-01-22T09:00:00.316",
                          "updatedBy": "ONLINE"
                      },
                      "_links": {
                          "citizen": {
                              "href": "http://localhost:8100/v1/citizens/ac100a58-8a21-1840-818a-2e0667c406d2"
                          }
                      }
                  }
              ],
              "emails": [],
              "_meta": {
                  "channel": "ONLINE",
                  "createdTimestamp": "2023-01-22T09:00:00.316",
                  "createdBy": "ONLINE",
                  "updatedTimestamp": "2023-01-22T09:00:00.316",
                  "updatedBy": "ONLINE"
              },
              "_links": {
                  "self": {
                      "href": "http://localhost:8100/v1/citizens/ac100a58-8a21-1840-818a-2e0667c406d2"
                  },
                  "citizen": {
                      "href": "http://localhost:8100/v1/citizens/ac100a58-8a21-1840-818a-2e0667c406d2"
                  }
              }
          }
      ]
  },
  "_links": {
      "first": {
          "href": "http://localhost:8100/v1/citizens?firstName=John&lastName=Smith&dateOfBirth=1997-03-24&addresses.postcode=NE158NY&page=0&size=50"
      },
      "prev": {
          "href": "http://localhost:8100/v1/citizens?firstName=John&lastName=Smith&dateOfBirth=1997-03-24&addresses.postcode=NE158NY&page=2&size=50"
      },
      "self": {
          "href": "http://localhost:8100/v1/citizens?firstName=John&lastName=Smith&dateOfBirth=1997-03-24&addresses.postcode=NE158NY&page=3&size=50"
      },
      "next": {
          "href": "http://localhost:8100/v1/citizens?firstName=John&lastName=Smith&dateOfBirth=1997-03-24&addresses.postcode=NE158NY&page=4&size=50"
      },
      "last": {
          "href": "http://localhost:8100/v1/citizens?firstName=John&lastName=Smith&dateOfBirth=1997-03-24&addresses.postcode=NE158NY&page=10&size=50"
      },
      "profile": {
          "href": "http://localhost:8100/v1/profile/citizens"
      }
  },
  "page": {
      "size": 50,
      "totalElements": 501,
      "totalPages": 11,
      "number": 3
  }
}