{
  "_embedded": {
    "citizens": []
  },
  "_links": {
    "self": {
      "href": "http://localhost:8100/v1/citizens?firstName=John&lastName=Smith&dateOfBirth=1998-03-24&postcode=NE158NY"
    },
    "profile": {
      "href": "http://localhost:8100/v1/profile/citizens"
    },
    "search": {
      "href": "http://localhost:8100/v1/citizens/search"
    }
  },
  "page": {
    "size": 20,
    "totalElements": 0,
    "totalPages": 0,
    "number": 0
  }
}