{
  "headers": {
    "x-api-key": "x-api-key",
    "channel": "ONLINE",
    "user-id": "ABCD",
    "correlation-id": "e7fffacb-4575-47ba-b998-e0169945cdd5"
  },
  "requestContext": {
    "requestId": "requestId"
  },
  "body": "{\"citizen\":{\"address\":{\"postcode\":\"NE15 8NY\"}}}"
}