{
  "_embedded": {
    "certificates": [
      {
        "id": "c0a80005-8576-12ed-8185-77be4c060036",
        "citizenId": "0a004b01-8515-1a6c-8185-1558ae970000",
        "reference": "BB1D3E453CE002CC6512",
        "type": "HRT_PPC",
        "applicationDate": "2022-12-12",
        "duration": "P12M",
        "startDate": "2022-12-12",
        "endDate": "2023-12-12",
        "cost": 1819,
        "status": "PENDING",
        "pharmacyId": "ABCD",
        "_meta": {
          "channel": "ONLINE",
          "createdTimestamp": "2023-01-03T13:07:18.14996",
          "createdBy": "POSTMAN",
          "updatedTimestamp": "2023-01-03T13:07:18.14996",
          "updatedBy": "POSTMAN"
        },
        "_links": {
          "self": {
            "href": "http://localhost:8090/v1/certificates/c0a80005-8576-12ed-8185-77be4c060036"
          },
          "certificate": {
            "href": "http://localhost:8090/v1/certificates/c0a80005-8576-12ed-8185-77be4c060036"
          }
        }
      },
      {
        "id": "c0a80005-8576-12ed-8185-77be4f010037",
        "citizenId": "0a004b01-8515-1a6c-8185-1558ae970000",
        "reference": "E2CBB05CF07003447673",
        "type": "HRT_PPC",
        "applicationDate": "2022-12-12",
        "duration": "P12M",
        "startDate": "2022-12-12",
        "endDate": "2023-12-12",
        "cost": 1819,
        "status": "PENDING",
        "pharmacyId": "ABCD",
        "_meta": {
          "channel": "ONLINE",
          "createdTimestamp": "2023-01-03T13:07:18.913876",
          "createdBy": "POSTMAN",
          "updatedTimestamp": "2023-01-03T13:07:18.913876",
          "updatedBy": "POSTMAN"
        },
        "_links": {
          "self": {
            "href": "http://localhost:8090/v1/certificates/c0a80005-8576-12ed-8185-77be4f010037"
          },
          "certificate": {
            "href": "http://localhost:8090/v1/certificates/c0a80005-8576-12ed-8185-77be4f010037"
          }
        }
      }
    ]
  },
  "_links": {
    "self": {
      "href": "http://localhost:8090/v1/certificates/search/findByCitizens?citizenIds=0a004b01-8515-1a6c-8185-1558ae970000&page=0&size=20"
    }
  },
  "page": {
    "size": 20,
    "totalElements": 2,
    "totalPages": 1,
    "number": 0
  }
}