{
    "exemptionStatus": "EXEMPT",
    "farthestExemptionType": "MATERNITY",
    "expiredCertificateEndDate": null,
    "futureCertificateDate": null,
    "paymentAwaited": false,
    "defaulter": false,
    "nhsNumberSearch": false,
    "resultDescription": "Still has a valid exemption and not ready for renewal.",
    "exemptions": [
        {
            "certNumber": 20000047039,
            "startDate": "2019-08-18T00:00:00.000+00:00",
            "expiryDate": "2099-12-31T00:00:00.000+00:00",
            "exemptionType": "MATERNITY"
        }
    ]
}