{
  "headers": {
    "channel": "ONLINE",
    "user-id": "ABCD",
    "correlation-id": "e7fffacb-4575-47ba-b998-e0169945cdd5"
  },
  "requestContext": {
    "requestId": "requestId"
  },
  "body": "{\"citizen\":{\"firstName\":\"John\",\"lastName\":\"Smith\",\"dateOfBirth\":\"2022-11-18\",\"nhsNumber\":\"5165713040\",\"addresses\":[{\"addressLine1\":\"Stella House\",\"addressLine2\":\"Goldcrest Way\",\"townOrCity\":\"Newcastle upon Tyne\",\"country\":\"England\",\"postcode\":\"NE15 8NY\"}],\"emails\":[{\"emailAddress\":\"test@example.com\"}],\"telephones\":[{\"phoneNumber\":\"+447123456789\"}]},\"certificate\":{\"type\":\"HRT_PPC\",\"duration\":\"P12M\",\"cost\":1870,\"startDate\":\"2022-09-14\",\"endDate\":\"2023-09-13\",\"applicationDate\":\"2022-09-14\",\"pharmacyId\":\"ABCD\"}}"
}