{
    "id": "ac1be9c0-8578-15b0-8185-7da2d6a00010",
    "citizenId": "0a004b01-857c-1e59-8185-7da2d678004e",
    "reference": "3569BDF217A46923DB1A",
    "type": "HRT_PPC",
    "applicationDate": "2022-09-14",
    "duration": "P12M",
    "startDate": "2022-09-14",
    "endDate": "2023-09-13",
    "cost": 1870,
    "status": "PENDING",
    "pharmacyId": "ABCD",
    "_meta": {
        "channel": "ONLINE",
        "createdTimestamp": "2023-01-04T16:35:01.9197717",
        "createdBy": "ABCD",
        "updatedTimestamp": "2023-01-04T16:35:01.9197717",
        "updatedBy": "ABCD"
    },
    "_links": {
        "self": {
            "href": "http://localhost:8500/v1/certificates/ac1be9c0-8578-15b0-8185-7da2d6a00010"
        },
        "certificate": {
            "href": "http://localhost:8500/v1/certificates/ac1be9c0-8578-15b0-8185-7da2d6a00010"
        }
    }
}