{
    "id": "0a004b01-857c-1e59-8185-7da2d678004e",
    "firstName": "John",
    "lastName": "Smith",
    "dateOfBirth": "2022-11-18",
    "nhsNumber": "5165713040",
    "_meta": {
        "channel": "ONLINE",
        "createdTimestamp": "2023-01-04T16:35:01.8797647",
        "createdBy": "ABCD",
        "updatedTimestamp": "2023-01-04T16:35:01.8797647",
        "updatedBy": "ABCD"
    },
    "_links": {
        "self": {
            "href": "http://localhost:8500/v1/citizens/0a004b01-857c-1e59-8185-7da2d678004e"
        },
        "citizen": {
            "href": "http://localhost:8500/v1/citizens/0a004b01-857c-1e59-8185-7da2d678004e"
        },
        "addresses": {
            "href": "http://localhost:8500/v1/citizens/0a004b01-857c-1e59-8185-7da2d678004e/addresses"
        },
        "emails": {
            "href": "http://localhost:8500/v1/citizens/0a004b01-857c-1e59-8185-7da2d678004e/emails"
        }
    }
}