{
  "_embedded": {
    "citizens": [
      {
        "id": "0a004b01-8515-1a6c-8185-1558ae970000",
        "firstName": "John",
        "lastName": "Smith",
        "dateOfBirth": "1997-03-24",
        "addresses": [
          {
            "id": "0a004b01-8515-1a6c-8185-1558aeb70001",
            "type": "POSTAL",
            "addressLine1": "Stella House",
            "addressLine2": "Goldcrest Way",
            "townOrCity": "Newcastle upon Tyne",
            "country": "England",
            "postcode": "NE15 8NY",
            "_meta": {
              "channel": "LIS_STAFF",
              "createdTimestamp": "2022-12-15T10:33:31.575376",
              "createdBy": "POSTMAN",
              "updatedTimestamp": "2022-12-15T10:33:31.575376",
              "updatedBy": "POSTMAN"
            },
            "_links": {
              "citizen": {
                "href": "http://localhost:8100/v1/citizens/0a004b01-8515-1a6c-8185-1558ae970000"
              }
            }
          }
        ],
        "emails": [
          {
            "id": "0a004b01-8515-1a6c-8185-1558aebc0002",
            "type": "PERSONAL",
            "emailAddress": "test@test.com",
            "_meta": {
              "channel": "LIS_STAFF",
              "createdTimestamp": "2022-12-15T10:33:31.580379",
              "createdBy": "POSTMAN",
              "updatedTimestamp": "2022-12-15T10:33:31.580379",
              "updatedBy": "POSTMAN"
            },
            "_links": {
              "citizen": {
                "href": "http://localhost:8100/v1/citizens/0a004b01-8515-1a6c-8185-1558ae970000"
              }
            }
          }
        ],
        "_meta": {
          "channel": "LIS_STAFF",
          "createdTimestamp": "2022-12-15T10:33:31.540372",
          "createdBy": "POSTMAN",
          "updatedTimestamp": "2022-12-15T10:33:31.540372",
          "updatedBy": "POSTMAN"
        },
        "_links": {
          "self": {
            "href": "http://localhost:8100/v1/citizens/0a004b01-8515-1a6c-8185-1558ae970000"
          },
          "citizen": {
            "href": "http://localhost:8100/v1/citizens/0a004b01-8515-1a6c-8185-1558ae970000"
          }
        }
      },
      {
        "id": "c0a800eb-90ee-1888-8190-ee82b6120003",
        "firstName": "Janey",
        "lastName": "Smith",
        "dateOfBirth": "1998-11-19",
        "addresses": [
          {
            "id": "c0a800eb-90ee-1888-8190-ee82b6120004",
            "type": "POSTAL",
            "addressLine1": "Stella House",
            "addressLine2": "Goldcrest Way",
            "townOrCity": "Newcastle upon Tyne",
            "country": "England",
            "postcode": "NE15 8NY",
            "_meta": {
              "channel": "LIS_STAFF",
              "createdTimestamp": "2022-12-15T10:33:44.673335",
              "createdBy": "POSTMAN",
              "updatedTimestamp": "2022-12-15T10:33:44.673335",
              "updatedBy": "POSTMAN"
            },
            "_links": {
              "citizen": {
                "href": "http://localhost:8100/v1/citizens/c0a800eb-90ee-1888-8190-ee82b6120003"
              }
            }
          }
        ],
        "_meta": {
          "channel": "LIS_STAFF",
          "createdTimestamp": "2022-12-15T10:33:44.672336",
          "createdBy": "POSTMAN",
          "updatedTimestamp": "2022-12-15T10:33:44.672336",
          "updatedBy": "POSTMAN"
        },
        "_links": {
          "self": {
            "href": "http://localhost:8100/v1/citizens/c0a800eb-90ee-1888-8190-ee82b6120003"
          },
          "citizen": {
            "href": "http://localhost:8100/v1/citizens/c0a800eb-90ee-1888-8190-ee82b6120003"
          }
        }
      }
    ]
  },
  "page": {
    "size": 2,
    "totalElements": 2,
    "totalPages": 1,
    "number": 0
  }
}