{
  "_embedded": {
      "citizens": [
          {
              "id": "ac100bcf-8a21-1839-818a-2ce8e5f401c4",
              "firstName": "John",
              "lastName": "Smith",
              "dateOfBirth": "1997-03-24",
              "nhsNumber": "4857773457",
              "addresses": [
                  {
                      "id": "ac100bcf-8a21-1839-818a-2ce8e5f401c4",
                      "type": "POSTAL",
                      "addressLine1": "Stella House",
                      "addressLine2": "Goldcrest Way",
                      "townOrCity": "Newcastle upon Tyne",
                      "country": "England",
                      "postcode": "NE15 8NY",
                      "_meta": {
                          "channel": "HRT_ONLINE",
                          "createdTimestamp": "2023-01-22T09:00:00.316",
                          "createdBy": "HRT_ONLINE",
                          "updatedTimestamp": "2023-01-22T09:00:00.316",
                          "updatedBy": "HRT_ONLINE"
                      },
                      "_links": {
                          "citizen": {
                              "href": "http://localhost:8100/v1/citizens/ac100bcf-8a21-1839-818a-2ce8e5f401c4"
                          }
                      }
                  }
              ],
              "emails": [],
              "_meta": {
                  "channel": "HRT_ONLINE",
                  "createdTimestamp": "2023-01-22T09:00:00.316",
                  "createdBy": "HRT_ONLINE",
                  "updatedTimestamp": "2023-01-22T09:00:00.316",
                  "updatedBy": "HRT_ONLINE"
              },
              "_links": {
                  "self": {
                      "href": "http://localhost:8100/v1/citizens/ac100bcf-8a21-1839-818a-2ce8e5f401c4"
                  },
                  "citizen": {
                      "href": "http://localhost:8100/v1/citizens/ac100bcf-8a21-1839-818a-2ce8e5f401c4"
                  }
              }
          },
          {
              "id": "ac100bcf-8a21-1839-818a-2ce8eb0e01c7",
              "firstName": "John",
              "lastName": "Smith",
              "dateOfBirth": "1997-03-24",
              "nhsNumber": "4857773457",
              "addresses": [
                  {
                      "id": "ac100bcf-8a21-1839-818a-2ce8eb0e01c7",
                      "type": "POSTAL",
                      "addressLine1": "Stella House",
                      "addressLine2": "Goldcrest Way",
                      "townOrCity": "Newcastle upon Tyne",
                      "country": "England",
                      "postcode": "NE15 8NY",
                      "_meta": {
                          "channel": "HRT_ONLINE",
                          "createdTimestamp": "2023-01-22T09:00:00.316",
                          "createdBy": "HRT_ONLINE",
                          "updatedTimestamp": "2023-01-22T09:00:00.316",
                          "updatedBy": "HRT_ONLINE"
                      },
                      "_links": {
                          "citizen": {
                              "href": "http://localhost:8100/v1/citizens/ac100bcf-8a21-1839-818a-2ce8eb0e01c7"
                          }
                      }
                  }
              ],
              "emails": [],
              "_meta": {
                  "channel": "HRT_ONLINE",
                  "createdTimestamp": "2023-01-22T09:00:00.316",
                  "createdBy": "HRT_ONLINE",
                  "updatedTimestamp": "2023-01-22T09:00:00.316",
                  "updatedBy": "HRT_ONLINE"
              },
              "_links": {
                  "self": {
                      "href": "http://localhost:8100/v1/citizens/ac100bcf-8a21-1839-818a-2ce8eb0e01c7"
                  },
                  "citizen": {
                      "href": "http://localhost:8100/v1/citizens/ac100bcf-8a21-1839-818a-2ce8eb0e01c7"
                  }
              }
          },
          {
              "id": "ac100bcf-8a21-1839-818a-2ce9082d01cd",
              "firstName": "John",
              "lastName": "Smith",
              "dateOfBirth": "1997-03-24",
              "nhsNumber": "4857773457",
              "addresses": [
                  {
                      "id": "ac100bcf-8a21-1839-818a-2ce9082d01cd",
                      "type": "POSTAL",
                      "addressLine1": "Stella House",
                      "addressLine2": "Goldcrest Way",
                      "townOrCity": "Newcastle upon Tyne",
                      "country": "England",
                      "postcode": "NE15 8NY",
                      "_meta": {
                          "channel": "HRT_ONLINE",
                          "createdTimestamp": "2023-01-22T09:00:00.316",
                          "createdBy": "HRT_ONLINE",
                          "updatedTimestamp": "2023-01-22T09:00:00.316",
                          "updatedBy": "HRT_ONLINE"
                      },
                      "_links": {
                          "citizen": {
                              "href": "http://localhost:8100/v1/citizens/ac100bcf-8a21-1839-818a-2ce9082d01cd"
                          }
                      }
                  }
              ],
              "emails": [],
              "_meta": {
                  "channel": "HRT_ONLINE",
                  "createdTimestamp": "2023-01-22T09:00:00.316",
                  "createdBy": "HRT_ONLINE",
                  "updatedTimestamp": "2023-01-22T09:00:00.316",
                  "updatedBy": "HRT_ONLINE"
              },
              "_links": {
                  "self": {
                      "href": "http://localhost:8100/v1/citizens/ac100bcf-8a21-1839-818a-2ce9082d01cd"
                  },
                  "citizen": {
                      "href": "http://localhost:8100/v1/citizens/ac100bcf-8a21-1839-818a-2ce9082d01cd"
                  }
              }
          },
          {
              "id": "ac100bcf-8a21-1839-818a-2ce926e301d0",
              "firstName": "John",
              "lastName": "Smith",
              "dateOfBirth": "1997-03-24",
              "nhsNumber": "4857773457",
              "addresses": [
                  {
                      "id": "ac100bcf-8a21-1839-818a-2ce926e301d0",
                      "type": "POSTAL",
                      "addressLine1": "Stella House",
                      "addressLine2": "Goldcrest Way",
                      "townOrCity": "Newcastle upon Tyne",
                      "country": "England",
                      "postcode": "NE15 8NY",
                      "_meta": {
                          "channel": "HRT_ONLINE",
                          "createdTimestamp": "2023-01-22T09:00:00.316",
                          "createdBy": "HRT_ONLINE",
                          "updatedTimestamp": "2023-01-22T09:00:00.316",
                          "updatedBy": "HRT_ONLINE"
                      },
                      "_links": {
                          "citizen": {
                              "href": "http://localhost:8100/v1/citizens/ac100bcf-8a21-1839-818a-2ce926e301d0"
                          }
                      }
                  }
              ],
              "emails": [],
              "_meta": {
                  "channel": "HRT_ONLINE",
                  "createdTimestamp": "2023-01-22T09:00:00.316",
                  "createdBy": "HRT_ONLINE",
                  "updatedTimestamp": "2023-01-22T09:00:00.316",
                  "updatedBy": "HRT_ONLINE"
              },
              "_links": {
                  "self": {
                      "href": "http://localhost:8100/v1/citizens/ac100bcf-8a21-1839-818a-2ce926e301d0"
                  },
                  "citizen": {
                      "href": "http://localhost:8100/v1/citizens/ac100bcf-8a21-1839-818a-2ce926e301d0"
                  }
              }
          },
          {
              "id": "ac100bcf-8a21-1839-818a-2e054da50697",
              "firstName": "John",
              "lastName": "Smith",
              "dateOfBirth": "1997-03-24",
              "addresses": [
                  {
                      "id": "ac100bcf-8a21-1839-818a-2e054da50697",
                      "type": "POSTAL",
                      "addressLine1": "Stella House",
                      "addressLine2": "Goldcrest Way",
                      "townOrCity": "Newcastle upon Tyne",
                      "country": "England",
                      "postcode": "NE15 8NY",
                      "_meta": {
                          "channel": "HRT_ONLINE",
                          "createdTimestamp": "2023-01-22T09:00:00.316",
                          "createdBy": "HRT_ONLINE",
                          "updatedTimestamp": "2023-01-22T09:00:00.316",
                          "updatedBy": "HRT_ONLINE"
                      },
                      "_links": {
                          "citizen": {
                              "href": "http://localhost:8100/v1/citizens/ac100bcf-8a21-1839-818a-2e054da50697"
                          }
                      }
                  }
              ],
              "emails": [],
              "_meta": {
                  "channel": "HRT_ONLINE",
                  "createdTimestamp": "2023-01-22T09:00:00.316",
                  "createdBy": "HRT_ONLINE",
                  "updatedTimestamp": "2023-01-22T09:00:00.316",
                  "updatedBy": "HRT_ONLINE"
              },
              "_links": {
                  "self": {
                      "href": "http://localhost:8100/v1/citizens/ac100bcf-8a21-1839-818a-2e054da50697"
                  },
                  "citizen": {
                      "href": "http://localhost:8100/v1/citizens/ac100bcf-8a21-1839-818a-2e054da50697"
                  }
              }
          },
          {
              "id": "ac100bcf-8a21-1839-818a-2e0675c706be",
              "firstName": "John",
              "lastName": "Smith",
              "dateOfBirth": "1997-03-24",
              "addresses": [
                  {
                      "id": "ac100bcf-8a21-1839-818a-2e0675c706be",
                      "type": "POSTAL",
                      "addressLine1": "Stella House",
                      "addressLine2": "Goldcrest Way",
                      "townOrCity": "Newcastle upon Tyne",
                      "country": "England",
                      "postcode": "NE15 8NY",
                      "_meta": {
                          "channel": "HRT_ONLINE",
                          "createdTimestamp": "2023-01-22T09:00:00.316",
                          "createdBy": "HRT_ONLINE",
                          "updatedTimestamp": "2023-01-22T09:00:00.316",
                          "updatedBy": "HRT_ONLINE"
                      },
                      "_links": {
                          "citizen": {
                              "href": "http://localhost:8100/v1/citizens/ac100bcf-8a21-1839-818a-2e0675c706be"
                          }
                      }
                  }
              ],
              "emails": [],
              "_meta": {
                  "channel": "HRT_ONLINE",
                  "createdTimestamp": "2023-01-22T09:00:00.316",
                  "createdBy": "HRT_ONLINE",
                  "updatedTimestamp": "2023-01-22T09:00:00.316",
                  "updatedBy": "HRT_ONLINE"
              },
              "_links": {
                  "self": {
                      "href": "http://localhost:8100/v1/citizens/ac100bcf-8a21-1839-818a-2e0675c706be"
                  },
                  "citizen": {
                      "href": "http://localhost:8100/v1/citizens/ac100bcf-8a21-1839-818a-2e0675c706be"
                  }
              }
          },
          {
              "id": "ac100a58-8a21-1840-818a-2e1784350813",
              "firstName": "John",
              "lastName": "Smith",
              "dateOfBirth": "1997-03-24",
              "addresses": [
                  {
                      "id": "ac100a58-8a21-1840-818a-2e1784350813",
                      "type": "POSTAL",
                      "addressLine1": "Stella House",
                      "addressLine2": "Goldcrest Way",
                      "townOrCity": "Newcastle upon Tyne",
                      "country": "England",
                      "postcode": "NE15 8NY",
                      "_meta": {
                          "channel": "HRT_ONLINE",
                          "createdTimestamp": "2023-01-22T09:00:00.316",
                          "createdBy": "HRT_ONLINE",
                          "updatedTimestamp": "2023-01-22T09:00:00.316",
                          "updatedBy": "HRT_ONLINE"
                      },
                      "_links": {
                          "citizen": {
                              "href": "http://localhost:8100/v1/citizens/ac100a58-8a21-1840-818a-2e1784350813"
                          }
                      }
                  }
              ],
              "emails": [],
              "_meta": {
                  "channel": "HRT_ONLINE",
                  "createdTimestamp": "2023-01-22T09:00:00.316",
                  "createdBy": "HRT_ONLINE",
                  "updatedTimestamp": "2023-01-22T09:00:00.316",
                  "updatedBy": "HRT_ONLINE"
              },
              "_links": {
                  "self": {
                      "href": "http://localhost:8100/v1/citizens/ac100a58-8a21-1840-818a-2e1784350813"
                  },
                  "citizen": {
                      "href": "http://localhost:8100/v1/citizens/ac100a58-8a21-1840-818a-2e1784350813"
                  }
              }
          },
          {
              "id": "ac100a58-8a21-1840-818a-2c599249009a",
              "firstName": "John",
              "lastName": "Smith",
              "dateOfBirth": "1997-03-24",
              "addresses": [
                  {
                      "id": "ac100a58-8a21-1840-818a-2c599249009a",
                      "type": "POSTAL",
                      "addressLine1": "Stella House",
                      "addressLine2": "Goldcrest Way",
                      "townOrCity": "Newcastle upon Tyne",
                      "country": "England",
                      "postcode": "NE15 8NY",
                      "_meta": {
                          "channel": "HRT_ONLINE",
                          "createdTimestamp": "2023-01-22T09:00:00.316",
                          "createdBy": "HRT_ONLINE",
                          "updatedTimestamp": "2023-01-22T09:00:00.316",
                          "updatedBy": "HRT_ONLINE"
                      },
                      "_links": {
                          "citizen": {
                              "href": "http://localhost:8100/v1/citizens/ac100a58-8a21-1840-818a-2c599249009a"
                          }
                      }
                  }
              ],
              "emails": [],
              "_meta": {
                  "channel": "HRT_ONLINE",
                  "createdTimestamp": "2023-01-22T09:00:00.316",
                  "createdBy": "HRT_ONLINE",
                  "updatedTimestamp": "2023-01-22T09:00:00.316",
                  "updatedBy": "HRT_ONLINE"
              },
              "_links": {
                  "self": {
                      "href": "http://localhost:8100/v1/citizens/ac100a58-8a21-1840-818a-2c599249009a"
                  },
                  "citizen": {
                      "href": "http://localhost:8100/v1/citizens/ac100a58-8a21-1840-818a-2c599249009a"
                  }
              }
          },
          {
              "id": "ac100bcf-8a21-1839-818a-2c59ec21009f",
              "firstName": "John",
              "lastName": "Smith",
              "dateOfBirth": "1997-03-24",
              "addresses": [
                  {
                      "id": "ac100bcf-8a21-1839-818a-2c59ec21009f",
                      "type": "POSTAL",
                      "addressLine1": "Stella House",
                      "addressLine2": "Goldcrest Way",
                      "townOrCity": "Newcastle upon Tyne",
                      "country": "England",
                      "postcode": "NE15 8NY",
                      "_meta": {
                          "channel": "HRT_ONLINE",
                          "createdTimestamp": "2023-01-22T09:00:00.316",
                          "createdBy": "HRT_ONLINE",
                          "updatedTimestamp": "2023-01-22T09:00:00.316",
                          "updatedBy": "HRT_ONLINE"
                      },
                      "_links": {
                          "citizen": {
                              "href": "http://localhost:8100/v1/citizens/ac100bcf-8a21-1839-818a-2c59ec21009f"
                          }
                      }
                  }
              ],
              "emails": [],
              "_meta": {
                  "channel": "HRT_ONLINE",
                  "createdTimestamp": "2023-01-22T09:00:00.316",
                  "createdBy": "HRT_ONLINE",
                  "updatedTimestamp": "2023-01-22T09:00:00.316",
                  "updatedBy": "HRT_ONLINE"
              },
              "_links": {
                  "self": {
                      "href": "http://localhost:8100/v1/citizens/ac100bcf-8a21-1839-818a-2c59ec21009f"
                  },
                  "citizen": {
                      "href": "http://localhost:8100/v1/citizens/ac100bcf-8a21-1839-818a-2c59ec21009f"
                  }
              }
          },
          {
              "id": "ac100bcf-8a21-1839-818a-2c5c5ebb00cc",
              "firstName": "John",
              "lastName": "Smith",
              "dateOfBirth": "1997-03-24",
              "addresses": [
                  {
                      "id": "ac100bcf-8a21-1839-818a-2c5c5ebb00cc",
                      "type": "POSTAL",
                      "addressLine1": "Stella House",
                      "addressLine2": "Goldcrest Way",
                      "townOrCity": "Newcastle upon Tyne",
                      "country": "England",
                      "postcode": "NE15 8NY",
                      "_meta": {
                          "channel": "HRT_ONLINE",
                          "createdTimestamp": "2023-01-22T09:00:00.316",
                          "createdBy": "HRT_ONLINE",
                          "updatedTimestamp": "2023-01-22T09:00:00.316",
                          "updatedBy": "HRT_ONLINE"
                      },
                      "_links": {
                          "citizen": {
                              "href": "http://localhost:8100/v1/citizens/ac100bcf-8a21-1839-818a-2c5c5ebb00cc"
                          }
                      }
                  }
              ],
              "emails": [],
              "_meta": {
                  "channel": "HRT_ONLINE",
                  "createdTimestamp": "2023-01-22T09:00:00.316",
                  "createdBy": "HRT_ONLINE",
                  "updatedTimestamp": "2023-01-22T09:00:00.316",
                  "updatedBy": "HRT_ONLINE"
              },
              "_links": {
                  "self": {
                      "href": "http://localhost:8100/v1/citizens/ac100bcf-8a21-1839-818a-2c5c5ebb00cc"
                  },
                  "citizen": {
                      "href": "http://localhost:8100/v1/citizens/ac100bcf-8a21-1839-818a-2c5c5ebb00cc"
                  }
              }
          },
          {
              "id": "ac100a58-8a21-1840-818a-2e05610f06c3",
              "firstName": "John",
              "lastName": "Smith",
              "dateOfBirth": "1997-03-24",
              "addresses": [
                  {
                      "id": "ac100a58-8a21-1840-818a-2e05610f06c3",
                      "type": "POSTAL",
                      "addressLine1": "Stella House",
                      "addressLine2": "Goldcrest Way",
                      "townOrCity": "Newcastle upon Tyne",
                      "country": "England",
                      "postcode": "NE15 8NY",
                      "_meta": {
                          "channel": "HRT_ONLINE",
                          "createdTimestamp": "2023-01-22T09:00:00.316",
                          "createdBy": "HRT_ONLINE",
                          "updatedTimestamp": "2023-01-22T09:00:00.316",
                          "updatedBy": "HRT_ONLINE"
                      },
                      "_links": {
                          "citizen": {
                              "href": "http://localhost:8100/v1/citizens/ac100a58-8a21-1840-818a-2e05610f06c3"
                          }
                      }
                  }
              ],
              "emails": [],
              "_meta": {
                  "channel": "HRT_ONLINE",
                  "createdTimestamp": "2023-01-22T09:00:00.316",
                  "createdBy": "HRT_ONLINE",
                  "updatedTimestamp": "2023-01-22T09:00:00.316",
                  "updatedBy": "HRT_ONLINE"
              },
              "_links": {
                  "self": {
                      "href": "http://localhost:8100/v1/citizens/ac100a58-8a21-1840-818a-2e05610f06c3"
                  },
                  "citizen": {
                      "href": "http://localhost:8100/v1/citizens/ac100a58-8a21-1840-818a-2e05610f06c3"
                  }
              }
          },
          {
              "id": "ac100a58-8a21-1840-818a-2e0689af06ea",
              "firstName": "John",
              "lastName": "Smith",
              "dateOfBirth": "1997-03-24",
              "addresses": [
                  {
                      "id": "ac100a58-8a21-1840-818a-2e0689af06ea",
                      "type": "POSTAL",
                      "addressLine1": "Stella House",
                      "addressLine2": "Goldcrest Way",
                      "townOrCity": "Newcastle upon Tyne",
                      "country": "England",
                      "postcode": "NE15 8NY",
                      "_meta": {
                          "channel": "HRT_ONLINE",
                          "createdTimestamp": "2023-01-22T09:00:00.316",
                          "createdBy": "HRT_ONLINE",
                          "updatedTimestamp": "2023-01-22T09:00:00.316",
                          "updatedBy": "HRT_ONLINE"
                      },
                      "_links": {
                          "citizen": {
                              "href": "http://localhost:8100/v1/citizens/ac100a58-8a21-1840-818a-2e0689af06ea"
                          }
                      }
                  }
              ],
              "emails": [],
              "_meta": {
                  "channel": "HRT_ONLINE",
                  "createdTimestamp": "2023-01-22T09:00:00.316",
                  "createdBy": "HRT_ONLINE",
                  "updatedTimestamp": "2023-01-22T09:00:00.316",
                  "updatedBy": "HRT_ONLINE"
              },
              "_links": {
                  "self": {
                      "href": "http://localhost:8100/v1/citizens/ac100a58-8a21-1840-818a-2e0689af06ea"
                  },
                  "citizen": {
                      "href": "http://localhost:8100/v1/citizens/ac100a58-8a21-1840-818a-2e0689af06ea"
                  }
              }
          },
          {
              "id": "ac100bcf-8a21-1839-818a-2e1a67770844",
              "firstName": "John",
              "lastName": "Smith",
              "dateOfBirth": "1997-03-24",
              "addresses": [
                  {
                      "id": "ac100bcf-8a21-1839-818a-2e1a67770844",
                      "type": "POSTAL",
                      "addressLine1": "Stella House",
                      "addressLine2": "Goldcrest Way",
                      "townOrCity": "Newcastle upon Tyne",
                      "country": "England",
                      "postcode": "NE15 8NY",
                      "_meta": {
                          "channel": "HRT_ONLINE",
                          "createdTimestamp": "2023-01-22T09:00:00.316",
                          "createdBy": "HRT_ONLINE",
                          "updatedTimestamp": "2023-01-22T09:00:00.316",
                          "updatedBy": "HRT_ONLINE"
                      },
                      "_links": {
                          "citizen": {
                              "href": "http://localhost:8100/v1/citizens/ac100bcf-8a21-1839-818a-2e1a67770844"
                          }
                      }
                  }
              ],
              "emails": [],
              "_meta": {
                  "channel": "HRT_ONLINE",
                  "createdTimestamp": "2023-01-22T09:00:00.316",
                  "createdBy": "HRT_ONLINE",
                  "updatedTimestamp": "2023-01-22T09:00:00.316",
                  "updatedBy": "HRT_ONLINE"
              },
              "_links": {
                  "self": {
                      "href": "http://localhost:8100/v1/citizens/ac100bcf-8a21-1839-818a-2e1a67770844"
                  },
                  "citizen": {
                      "href": "http://localhost:8100/v1/citizens/ac100bcf-8a21-1839-818a-2e1a67770844"
                  }
              }
          },
          {
              "id": "ac100a58-8a21-1840-818a-2c603a6e0106",
              "firstName": "John",
              "lastName": "Smith",
              "dateOfBirth": "1997-03-24",
              "addresses": [
                  {
                      "id": "ac100a58-8a21-1840-818a-2c603a6e0106",
                      "type": "POSTAL",
                      "addressLine1": "Stella House",
                      "addressLine2": "Goldcrest Way",
                      "townOrCity": "Newcastle upon Tyne",
                      "country": "England",
                      "postcode": "NE15 8NY",
                      "_meta": {
                          "channel": "HRT_ONLINE",
                          "createdTimestamp": "2023-01-22T09:00:00.316",
                          "createdBy": "HRT_ONLINE",
                          "updatedTimestamp": "2023-01-22T09:00:00.316",
                          "updatedBy": "HRT_ONLINE"
                      },
                      "_links": {
                          "citizen": {
                              "href": "http://localhost:8100/v1/citizens/ac100a58-8a21-1840-818a-2c603a6e0106"
                          }
                      }
                  }
              ],
              "emails": [],
              "_meta": {
                  "channel": "HRT_ONLINE",
                  "createdTimestamp": "2023-01-22T09:00:00.316",
                  "createdBy": "HRT_ONLINE",
                  "updatedTimestamp": "2023-01-22T09:00:00.316",
                  "updatedBy": "HRT_ONLINE"
              },
              "_links": {
                  "self": {
                      "href": "http://localhost:8100/v1/citizens/ac100a58-8a21-1840-818a-2c603a6e0106"
                  },
                  "citizen": {
                      "href": "http://localhost:8100/v1/citizens/ac100a58-8a21-1840-818a-2c603a6e0106"
                  }
              }
          },
          {
              "id": "ac100a58-8a21-1840-818a-2c626df3011e",
              "firstName": "John",
              "lastName": "Smith",
              "dateOfBirth": "1997-03-24",
              "addresses": [
                  {
                      "id": "ac100a58-8a21-1840-818a-2c626df3011e",
                      "type": "POSTAL",
                      "addressLine1": "Stella House",
                      "addressLine2": "Goldcrest Way",
                      "townOrCity": "Newcastle upon Tyne",
                      "country": "England",
                      "postcode": "NE15 8NY",
                      "_meta": {
                          "channel": "HRT_ONLINE",
                          "createdTimestamp": "2023-01-22T09:00:00.316",
                          "createdBy": "HRT_ONLINE",
                          "updatedTimestamp": "2023-01-22T09:00:00.316",
                          "updatedBy": "HRT_ONLINE"
                      },
                      "_links": {
                          "citizen": {
                              "href": "http://localhost:8100/v1/citizens/ac100a58-8a21-1840-818a-2c626df3011e"
                          }
                      }
                  }
              ],
              "emails": [],
              "_meta": {
                  "channel": "HRT_ONLINE",
                  "createdTimestamp": "2023-01-22T09:00:00.316",
                  "createdBy": "HRT_ONLINE",
                  "updatedTimestamp": "2023-01-22T09:00:00.316",
                  "updatedBy": "HRT_ONLINE"
              },
              "_links": {
                  "self": {
                      "href": "http://localhost:8100/v1/citizens/ac100a58-8a21-1840-818a-2c626df3011e"
                  },
                  "citizen": {
                      "href": "http://localhost:8100/v1/citizens/ac100a58-8a21-1840-818a-2c626df3011e"
                  }
              }
          },
          {
              "id": "ac100bcf-8a21-1839-818a-2c77351e0135",
              "firstName": "John",
              "lastName": "Smith",
              "dateOfBirth": "1997-03-24",
              "addresses": [
                  {
                      "id": "ac100bcf-8a21-1839-818a-2c77351e0135",
                      "type": "POSTAL",
                      "addressLine1": "Stella House",
                      "addressLine2": "Goldcrest Way",
                      "townOrCity": "Newcastle upon Tyne",
                      "country": "England",
                      "postcode": "NE15 8NY",
                      "_meta": {
                          "channel": "HRT_ONLINE",
                          "createdTimestamp": "2023-01-22T09:00:00.316",
                          "createdBy": "HRT_ONLINE",
                          "updatedTimestamp": "2023-01-22T09:00:00.316",
                          "updatedBy": "HRT_ONLINE"
                      },
                      "_links": {
                          "citizen": {
                              "href": "http://localhost:8100/v1/citizens/ac100bcf-8a21-1839-818a-2c77351e0135"
                          }
                      }
                  }
              ],
              "emails": [],
              "_meta": {
                  "channel": "HRT_ONLINE",
                  "createdTimestamp": "2023-01-22T09:00:00.316",
                  "createdBy": "HRT_ONLINE",
                  "updatedTimestamp": "2023-01-22T09:00:00.316",
                  "updatedBy": "HRT_ONLINE"
              },
              "_links": {
                  "self": {
                      "href": "http://localhost:8100/v1/citizens/ac100bcf-8a21-1839-818a-2c77351e0135"
                  },
                  "citizen": {
                      "href": "http://localhost:8100/v1/citizens/ac100bcf-8a21-1839-818a-2c77351e0135"
                  }
              }
          },
          {
              "id": "ac100bcf-8a21-1839-818a-2ce35288015b",
              "firstName": "John",
              "lastName": "Smith",
              "dateOfBirth": "1997-03-24",
              "nhsNumber": "4857773457",
              "addresses": [
                  {
                      "id": "ac100bcf-8a21-1839-818a-2ce35288015b",
                      "type": "POSTAL",
                      "addressLine1": "Stella House",
                      "addressLine2": "Goldcrest Way",
                      "townOrCity": "Newcastle upon Tyne",
                      "country": "England",
                      "postcode": "NE15 8NY",
                      "_meta": {
                          "channel": "HRT_ONLINE",
                          "createdTimestamp": "2023-01-22T09:00:00.316",
                          "createdBy": "HRT_ONLINE",
                          "updatedTimestamp": "2023-01-22T09:00:00.316",
                          "updatedBy": "HRT_ONLINE"
                      },
                      "_links": {
                          "citizen": {
                              "href": "http://localhost:8100/v1/citizens/ac100bcf-8a21-1839-818a-2ce35288015b"
                          }
                      }
                  }
              ],
              "emails": [],
              "_meta": {
                  "channel": "HRT_ONLINE",
                  "createdTimestamp": "2023-01-22T09:00:00.316",
                  "createdBy": "HRT_ONLINE",
                  "updatedTimestamp": "2023-01-22T09:00:00.316",
                  "updatedBy": "HRT_ONLINE"
              },
              "_links": {
                  "self": {
                      "href": "http://localhost:8100/v1/citizens/ac100bcf-8a21-1839-818a-2ce35288015b"
                  },
                  "citizen": {
                      "href": "http://localhost:8100/v1/citizens/ac100bcf-8a21-1839-818a-2ce35288015b"
                  }
              }
          },
          {
              "id": "ac100a58-8a21-1840-818a-2ce4baec01a3",
              "firstName": "John",
              "lastName": "Smith",
              "dateOfBirth": "1997-03-24",
              "nhsNumber": "4857773457",
              "addresses": [
                  {
                      "id": "ac100a58-8a21-1840-818a-2ce4baec01a3",
                      "type": "POSTAL",
                      "addressLine1": "Stella House",
                      "addressLine2": "Goldcrest Way",
                      "townOrCity": "Newcastle upon Tyne",
                      "country": "England",
                      "postcode": "NE15 8NY",
                      "_meta": {
                          "channel": "HRT_ONLINE",
                          "createdTimestamp": "2023-01-22T09:00:00.316",
                          "createdBy": "HRT_ONLINE",
                          "updatedTimestamp": "2023-01-22T09:00:00.316",
                          "updatedBy": "HRT_ONLINE"
                      },
                      "_links": {
                          "citizen": {
                              "href": "http://localhost:8100/v1/citizens/ac100a58-8a21-1840-818a-2ce4baec01a3"
                          }
                      }
                  }
              ],
              "emails": [],
              "_meta": {
                  "channel": "HRT_ONLINE",
                  "createdTimestamp": "2023-01-22T09:00:00.316",
                  "createdBy": "HRT_ONLINE",
                  "updatedTimestamp": "2023-01-22T09:00:00.316",
                  "updatedBy": "HRT_ONLINE"
              },
              "_links": {
                  "self": {
                      "href": "http://localhost:8100/v1/citizens/ac100a58-8a21-1840-818a-2ce4baec01a3"
                  },
                  "citizen": {
                      "href": "http://localhost:8100/v1/citizens/ac100a58-8a21-1840-818a-2ce4baec01a3"
                  }
              }
          },
          {
              "id": "ac100a58-8a21-1840-818a-2ce8c4f101df",
              "firstName": "John",
              "lastName": "Smith",
              "dateOfBirth": "1997-03-24",
              "nhsNumber": "4857773457",
              "addresses": [
                  {
                      "id": "ac100a58-8a21-1840-818a-2ce8c4f101df",
                      "type": "POSTAL",
                      "addressLine1": "Stella House",
                      "addressLine2": "Goldcrest Way",
                      "townOrCity": "Newcastle upon Tyne",
                      "country": "England",
                      "postcode": "NE15 8NY",
                      "_meta": {
                          "channel": "HRT_ONLINE",
                          "createdTimestamp": "2023-01-22T09:00:00.316",
                          "createdBy": "HRT_ONLINE",
                          "updatedTimestamp": "2023-01-22T09:00:00.316",
                          "updatedBy": "HRT_ONLINE"
                      },
                      "_links": {
                          "citizen": {
                              "href": "http://localhost:8100/v1/citizens/ac100a58-8a21-1840-818a-2ce8c4f101df"
                          }
                      }
                  }
              ],
              "emails": [],
              "_meta": {
                  "channel": "HRT_ONLINE",
                  "createdTimestamp": "2023-01-22T09:00:00.316",
                  "createdBy": "HRT_ONLINE",
                  "updatedTimestamp": "2023-01-22T09:00:00.316",
                  "updatedBy": "HRT_ONLINE"
              },
              "_links": {
                  "self": {
                      "href": "http://localhost:8100/v1/citizens/ac100a58-8a21-1840-818a-2ce8c4f101df"
                  },
                  "citizen": {
                      "href": "http://localhost:8100/v1/citizens/ac100a58-8a21-1840-818a-2ce8c4f101df"
                  }
              }
          },
          {
              "id": "ac100a58-8a21-1840-818a-2ce9006a01f1",
              "firstName": "John",
              "lastName": "Smith",
              "dateOfBirth": "1997-03-24",
              "nhsNumber": "4857773457",
              "addresses": [
                  {
                      "id": "ac100a58-8a21-1840-818a-2ce9006a01f1",
                      "type": "POSTAL",
                      "addressLine1": "Stella House",
                      "addressLine2": "Goldcrest Way",
                      "townOrCity": "Newcastle upon Tyne",
                      "country": "England",
                      "postcode": "NE15 8NY",
                      "_meta": {
                          "channel": "HRT_ONLINE",
                          "createdTimestamp": "2023-01-22T09:00:00.316",
                          "createdBy": "HRT_ONLINE",
                          "updatedTimestamp": "2023-01-22T09:00:00.316",
                          "updatedBy": "HRT_ONLINE"
                      },
                      "_links": {
                          "citizen": {
                              "href": "http://localhost:8100/v1/citizens/ac100a58-8a21-1840-818a-2ce9006a01f1"
                          }
                      }
                  }
              ],
              "emails": [],
              "_meta": {
                  "channel": "HRT_ONLINE",
                  "createdTimestamp": "2023-01-22T09:00:00.316",
                  "createdBy": "HRT_ONLINE",
                  "updatedTimestamp": "2023-01-22T09:00:00.316",
                  "updatedBy": "HRT_ONLINE"
              },
              "_links": {
                  "self": {
                      "href": "http://localhost:8100/v1/citizens/ac100a58-8a21-1840-818a-2ce9006a01f1"
                  },
                  "citizen": {
                      "href": "http://localhost:8100/v1/citizens/ac100a58-8a21-1840-818a-2ce9006a01f1"
                  }
              }
          },
          {
              "id": "ac100a58-8a21-1840-818a-2ce984030200",
              "firstName": "John",
              "lastName": "Smith",
              "dateOfBirth": "1997-03-24",
              "nhsNumber": "4857773457",
              "addresses": [
                  {
                      "id": "ac100a58-8a21-1840-818a-2ce984030200",
                      "type": "POSTAL",
                      "addressLine1": "Stella House",
                      "addressLine2": "Goldcrest Way",
                      "townOrCity": "Newcastle upon Tyne",
                      "country": "England",
                      "postcode": "NE15 8NY",
                      "_meta": {
                          "channel": "HRT_ONLINE",
                          "createdTimestamp": "2023-01-22T09:00:00.316",
                          "createdBy": "HRT_ONLINE",
                          "updatedTimestamp": "2023-01-22T09:00:00.316",
                          "updatedBy": "HRT_ONLINE"
                      },
                      "_links": {
                          "citizen": {
                              "href": "http://localhost:8100/v1/citizens/ac100a58-8a21-1840-818a-2ce984030200"
                          }
                      }
                  }
              ],
              "emails": [],
              "_meta": {
                  "channel": "HRT_ONLINE",
                  "createdTimestamp": "2023-01-22T09:00:00.316",
                  "createdBy": "HRT_ONLINE",
                  "updatedTimestamp": "2023-01-22T09:00:00.316",
                  "updatedBy": "HRT_ONLINE"
              },
              "_links": {
                  "self": {
                      "href": "http://localhost:8100/v1/citizens/ac100a58-8a21-1840-818a-2ce984030200"
                  },
                  "citizen": {
                      "href": "http://localhost:8100/v1/citizens/ac100a58-8a21-1840-818a-2ce984030200"
                  }
              }
          },
          {
              "id": "ac100a58-8a21-1840-818a-2e1a588c0858",
              "firstName": "John",
              "lastName": "Smith",
              "dateOfBirth": "1997-03-24",
              "addresses": [
                  {
                      "id": "ac100a58-8a21-1840-818a-2e1a588c0858",
                      "type": "POSTAL",
                      "addressLine1": "Stella House",
                      "addressLine2": "Goldcrest Way",
                      "townOrCity": "Newcastle upon Tyne",
                      "country": "England",
                      "postcode": "NE15 8NY",
                      "_meta": {
                          "channel": "HRT_ONLINE",
                          "createdTimestamp": "2023-01-22T09:00:00.316",
                          "createdBy": "HRT_ONLINE",
                          "updatedTimestamp": "2023-01-22T09:00:00.316",
                          "updatedBy": "HRT_ONLINE"
                      },
                      "_links": {
                          "citizen": {
                              "href": "http://localhost:8100/v1/citizens/ac100a58-8a21-1840-818a-2e1a588c0858"
                          }
                      }
                  }
              ],
              "emails": [],
              "_meta": {
                  "channel": "HRT_ONLINE",
                  "createdTimestamp": "2023-01-22T09:00:00.316",
                  "createdBy": "HRT_ONLINE",
                  "updatedTimestamp": "2023-01-22T09:00:00.316",
                  "updatedBy": "HRT_ONLINE"
              },
              "_links": {
                  "self": {
                      "href": "http://localhost:8100/v1/citizens/ac100a58-8a21-1840-818a-2e1a588c0858"
                  },
                  "citizen": {
                      "href": "http://localhost:8100/v1/citizens/ac100a58-8a21-1840-818a-2e1a588c0858"
                  }
              }
          },
          {
              "id": "ac100bcf-8a21-1839-818a-2ce8fa8e01ca",
              "firstName": "John",
              "lastName": "Smith",
              "dateOfBirth": "1997-03-24",
              "nhsNumber": "4857773457",
              "addresses": [
                  {
                      "id": "ac100bcf-8a21-1839-818a-2ce8fa8e01ca",
                      "type": "POSTAL",
                      "addressLine1": "Stella House",
                      "addressLine2": "Goldcrest Way",
                      "townOrCity": "Newcastle upon Tyne",
                      "country": "England",
                      "postcode": "NE15 8NY",
                      "_meta": {
                          "channel": "HRT_ONLINE",
                          "createdTimestamp": "2023-01-22T09:00:00.316",
                          "createdBy": "HRT_ONLINE",
                          "updatedTimestamp": "2023-01-22T09:00:00.316",
                          "updatedBy": "HRT_ONLINE"
                      },
                      "_links": {
                          "citizen": {
                              "href": "http://localhost:8100/v1/citizens/ac100bcf-8a21-1839-818a-2ce8fa8e01ca"
                          }
                      }
                  }
              ],
              "emails": [],
              "_meta": {
                  "channel": "HRT_ONLINE",
                  "createdTimestamp": "2023-01-22T09:00:00.316",
                  "createdBy": "HRT_ONLINE",
                  "updatedTimestamp": "2023-01-22T09:00:00.316",
                  "updatedBy": "HRT_ONLINE"
              },
              "_links": {
                  "self": {
                      "href": "http://localhost:8100/v1/citizens/ac100bcf-8a21-1839-818a-2ce8fa8e01ca"
                  },
                  "citizen": {
                      "href": "http://localhost:8100/v1/citizens/ac100bcf-8a21-1839-818a-2ce8fa8e01ca"
                  }
              }
          },
          {
              "id": "ac100bcf-8a21-1839-818a-2ce946bb01d3",
              "firstName": "John",
              "lastName": "Smith",
              "dateOfBirth": "1997-03-24",
              "nhsNumber": "4857773457",
              "addresses": [
                  {
                      "id": "ac100bcf-8a21-1839-818a-2ce946bb01d3",
                      "type": "POSTAL",
                      "addressLine1": "Stella House",
                      "addressLine2": "Goldcrest Way",
                      "townOrCity": "Newcastle upon Tyne",
                      "country": "England",
                      "postcode": "NE15 8NY",
                      "_meta": {
                          "channel": "HRT_ONLINE",
                          "createdTimestamp": "2023-01-22T09:00:00.316",
                          "createdBy": "HRT_ONLINE",
                          "updatedTimestamp": "2023-01-22T09:00:00.316",
                          "updatedBy": "HRT_ONLINE"
                      },
                      "_links": {
                          "citizen": {
                              "href": "http://localhost:8100/v1/citizens/ac100bcf-8a21-1839-818a-2ce946bb01d3"
                          }
                      }
                  }
              ],
              "emails": [],
              "_meta": {
                  "channel": "HRT_ONLINE",
                  "createdTimestamp": "2023-01-22T09:00:00.316",
                  "createdBy": "HRT_ONLINE",
                  "updatedTimestamp": "2023-01-22T09:00:00.316",
                  "updatedBy": "HRT_ONLINE"
              },
              "_links": {
                  "self": {
                      "href": "http://localhost:8100/v1/citizens/ac100bcf-8a21-1839-818a-2ce946bb01d3"
                  },
                  "citizen": {
                      "href": "http://localhost:8100/v1/citizens/ac100bcf-8a21-1839-818a-2ce946bb01d3"
                  }
              }
          },
          {
              "id": "ac100bcf-8a21-1839-818a-2ce9483f01d6",
              "firstName": "John",
              "lastName": "Smith",
              "dateOfBirth": "1997-03-24",
              "nhsNumber": "4857773457",
              "addresses": [
                  {
                      "id": "ac100bcf-8a21-1839-818a-2ce9483f01d6",
                      "type": "POSTAL",
                      "addressLine1": "Stella House",
                      "addressLine2": "Goldcrest Way",
                      "townOrCity": "Newcastle upon Tyne",
                      "country": "England",
                      "postcode": "NE15 8NY",
                      "_meta": {
                          "channel": "HRT_ONLINE",
                          "createdTimestamp": "2023-01-22T09:00:00.316",
                          "createdBy": "HRT_ONLINE",
                          "updatedTimestamp": "2023-01-22T09:00:00.316",
                          "updatedBy": "HRT_ONLINE"
                      },
                      "_links": {
                          "citizen": {
                              "href": "http://localhost:8100/v1/citizens/ac100bcf-8a21-1839-818a-2ce9483f01d6"
                          }
                      }
                  }
              ],
              "emails": [],
              "_meta": {
                  "channel": "HRT_ONLINE",
                  "createdTimestamp": "2023-01-22T09:00:00.316",
                  "createdBy": "HRT_ONLINE",
                  "updatedTimestamp": "2023-01-22T09:00:00.316",
                  "updatedBy": "HRT_ONLINE"
              },
              "_links": {
                  "self": {
                      "href": "http://localhost:8100/v1/citizens/ac100bcf-8a21-1839-818a-2ce9483f01d6"
                  },
                  "citizen": {
                      "href": "http://localhost:8100/v1/citizens/ac100bcf-8a21-1839-818a-2ce9483f01d6"
                  }
              }
          },
          {
              "id": "ac100bcf-8a21-1839-818a-2ce9734101d9",
              "firstName": "John",
              "lastName": "Smith",
              "dateOfBirth": "1997-03-24",
              "nhsNumber": "4857773457",
              "addresses": [
                  {
                      "id": "ac100bcf-8a21-1839-818a-2ce9734101d9",
                      "type": "POSTAL",
                      "addressLine1": "Stella House",
                      "addressLine2": "Goldcrest Way",
                      "townOrCity": "Newcastle upon Tyne",
                      "country": "England",
                      "postcode": "NE15 8NY",
                      "_meta": {
                          "channel": "HRT_ONLINE",
                          "createdTimestamp": "2023-01-22T09:00:00.316",
                          "createdBy": "HRT_ONLINE",
                          "updatedTimestamp": "2023-01-22T09:00:00.316",
                          "updatedBy": "HRT_ONLINE"
                      },
                      "_links": {
                          "citizen": {
                              "href": "http://localhost:8100/v1/citizens/ac100bcf-8a21-1839-818a-2ce9734101d9"
                          }
                      }
                  }
              ],
              "emails": [],
              "_meta": {
                  "channel": "HRT_ONLINE",
                  "createdTimestamp": "2023-01-22T09:00:00.316",
                  "createdBy": "HRT_ONLINE",
                  "updatedTimestamp": "2023-01-22T09:00:00.316",
                  "updatedBy": "HRT_ONLINE"
              },
              "_links": {
                  "self": {
                      "href": "http://localhost:8100/v1/citizens/ac100bcf-8a21-1839-818a-2ce9734101d9"
                  },
                  "citizen": {
                      "href": "http://localhost:8100/v1/citizens/ac100bcf-8a21-1839-818a-2ce9734101d9"
                  }
              }
          },
          {
              "id": "ac100bcf-8a21-1839-818a-2ce97e8d01dc",
              "firstName": "John",
              "lastName": "Smith",
              "dateOfBirth": "1997-03-24",
              "nhsNumber": "4857773457",
              "addresses": [
                  {
                      "id": "ac100bcf-8a21-1839-818a-2ce97e8d01dc",
                      "type": "POSTAL",
                      "addressLine1": "Stella House",
                      "addressLine2": "Goldcrest Way",
                      "townOrCity": "Newcastle upon Tyne",
                      "country": "England",
                      "postcode": "NE15 8NY",
                      "_meta": {
                          "channel": "HRT_ONLINE",
                          "createdTimestamp": "2023-01-22T09:00:00.316",
                          "createdBy": "HRT_ONLINE",
                          "updatedTimestamp": "2023-01-22T09:00:00.316",
                          "updatedBy": "HRT_ONLINE"
                      },
                      "_links": {
                          "citizen": {
                              "href": "http://localhost:8100/v1/citizens/ac100bcf-8a21-1839-818a-2ce97e8d01dc"
                          }
                      }
                  }
              ],
              "emails": [],
              "_meta": {
                  "channel": "HRT_ONLINE",
                  "createdTimestamp": "2023-01-22T09:00:00.316",
                  "createdBy": "HRT_ONLINE",
                  "updatedTimestamp": "2023-01-22T09:00:00.316",
                  "updatedBy": "HRT_ONLINE"
              },
              "_links": {
                  "self": {
                      "href": "http://localhost:8100/v1/citizens/ac100bcf-8a21-1839-818a-2ce97e8d01dc"
                  },
                  "citizen": {
                      "href": "http://localhost:8100/v1/citizens/ac100bcf-8a21-1839-818a-2ce97e8d01dc"
                  }
              }
          },
          {
              "id": "ac100bcf-8a21-1839-818a-2ce9897d01df",
              "firstName": "John",
              "lastName": "Smith",
              "dateOfBirth": "1997-03-24",
              "nhsNumber": "4857773457",
              "addresses": [
                  {
                      "id": "ac100bcf-8a21-1839-818a-2ce9897d01df",
                      "type": "POSTAL",
                      "addressLine1": "Stella House",
                      "addressLine2": "Goldcrest Way",
                      "townOrCity": "Newcastle upon Tyne",
                      "country": "England",
                      "postcode": "NE15 8NY",
                      "_meta": {
                          "channel": "HRT_ONLINE",
                          "createdTimestamp": "2023-01-22T09:00:00.316",
                          "createdBy": "HRT_ONLINE",
                          "updatedTimestamp": "2023-01-22T09:00:00.316",
                          "updatedBy": "HRT_ONLINE"
                      },
                      "_links": {
                          "citizen": {
                              "href": "http://localhost:8100/v1/citizens/ac100bcf-8a21-1839-818a-2ce9897d01df"
                          }
                      }
                  }
              ],
              "emails": [],
              "_meta": {
                  "channel": "HRT_ONLINE",
                  "createdTimestamp": "2023-01-22T09:00:00.316",
                  "createdBy": "HRT_ONLINE",
                  "updatedTimestamp": "2023-01-22T09:00:00.316",
                  "updatedBy": "HRT_ONLINE"
              },
              "_links": {
                  "self": {
                      "href": "http://localhost:8100/v1/citizens/ac100bcf-8a21-1839-818a-2ce9897d01df"
                  },
                  "citizen": {
                      "href": "http://localhost:8100/v1/citizens/ac100bcf-8a21-1839-818a-2ce9897d01df"
                  }
              }
          },
          {
              "id": "ac100bcf-8a21-1839-818a-2ce98dd601e2",
              "firstName": "John",
              "lastName": "Smith",
              "dateOfBirth": "1997-03-24",
              "nhsNumber": "4857773457",
              "addresses": [
                  {
                      "id": "ac100bcf-8a21-1839-818a-2ce98dd601e2",
                      "type": "POSTAL",
                      "addressLine1": "Stella House",
                      "addressLine2": "Goldcrest Way",
                      "townOrCity": "Newcastle upon Tyne",
                      "country": "England",
                      "postcode": "NE15 8NY",
                      "_meta": {
                          "channel": "HRT_ONLINE",
                          "createdTimestamp": "2023-01-22T09:00:00.316",
                          "createdBy": "HRT_ONLINE",
                          "updatedTimestamp": "2023-01-22T09:00:00.316",
                          "updatedBy": "HRT_ONLINE"
                      },
                      "_links": {
                          "citizen": {
                              "href": "http://localhost:8100/v1/citizens/ac100bcf-8a21-1839-818a-2ce98dd601e2"
                          }
                      }
                  }
              ],
              "emails": [],
              "_meta": {
                  "channel": "HRT_ONLINE",
                  "createdTimestamp": "2023-01-22T09:00:00.316",
                  "createdBy": "HRT_ONLINE",
                  "updatedTimestamp": "2023-01-22T09:00:00.316",
                  "updatedBy": "HRT_ONLINE"
              },
              "_links": {
                  "self": {
                      "href": "http://localhost:8100/v1/citizens/ac100bcf-8a21-1839-818a-2ce98dd601e2"
                  },
                  "citizen": {
                      "href": "http://localhost:8100/v1/citizens/ac100bcf-8a21-1839-818a-2ce98dd601e2"
                  }
              }
          },
          {
              "id": "ac100bcf-8a21-1839-818a-2ce9a9ee01e5",
              "firstName": "John",
              "lastName": "Smith",
              "dateOfBirth": "1997-03-24",
              "nhsNumber": "4857773457",
              "addresses": [
                  {
                      "id": "ac100bcf-8a21-1839-818a-2ce9a9ee01e5",
                      "type": "POSTAL",
                      "addressLine1": "Stella House",
                      "addressLine2": "Goldcrest Way",
                      "townOrCity": "Newcastle upon Tyne",
                      "country": "England",
                      "postcode": "NE15 8NY",
                      "_meta": {
                          "channel": "HRT_ONLINE",
                          "createdTimestamp": "2023-01-22T09:00:00.316",
                          "createdBy": "HRT_ONLINE",
                          "updatedTimestamp": "2023-01-22T09:00:00.316",
                          "updatedBy": "HRT_ONLINE"
                      },
                      "_links": {
                          "citizen": {
                              "href": "http://localhost:8100/v1/citizens/ac100bcf-8a21-1839-818a-2ce9a9ee01e5"
                          }
                      }
                  }
              ],
              "emails": [],
              "_meta": {
                  "channel": "HRT_ONLINE",
                  "createdTimestamp": "2023-01-22T09:00:00.316",
                  "createdBy": "HRT_ONLINE",
                  "updatedTimestamp": "2023-01-22T09:00:00.316",
                  "updatedBy": "HRT_ONLINE"
              },
              "_links": {
                  "self": {
                      "href": "http://localhost:8100/v1/citizens/ac100bcf-8a21-1839-818a-2ce9a9ee01e5"
                  },
                  "citizen": {
                      "href": "http://localhost:8100/v1/citizens/ac100bcf-8a21-1839-818a-2ce9a9ee01e5"
                  }
              }
          },
          {
              "id": "ac100bcf-8a21-1839-818a-2ce9b6d701e8",
              "firstName": "John",
              "lastName": "Smith",
              "dateOfBirth": "1997-03-24",
              "nhsNumber": "4857773457",
              "addresses": [
                  {
                      "id": "ac100bcf-8a21-1839-818a-2ce9b6d701e8",
                      "type": "POSTAL",
                      "addressLine1": "Stella House",
                      "addressLine2": "Goldcrest Way",
                      "townOrCity": "Newcastle upon Tyne",
                      "country": "England",
                      "postcode": "NE15 8NY",
                      "_meta": {
                          "channel": "HRT_ONLINE",
                          "createdTimestamp": "2023-01-22T09:00:00.316",
                          "createdBy": "HRT_ONLINE",
                          "updatedTimestamp": "2023-01-22T09:00:00.316",
                          "updatedBy": "HRT_ONLINE"
                      },
                      "_links": {
                          "citizen": {
                              "href": "http://localhost:8100/v1/citizens/ac100bcf-8a21-1839-818a-2ce9b6d701e8"
                          }
                      }
                  }
              ],
              "emails": [],
              "_meta": {
                  "channel": "HRT_ONLINE",
                  "createdTimestamp": "2023-01-22T09:00:00.316",
                  "createdBy": "HRT_ONLINE",
                  "updatedTimestamp": "2023-01-22T09:00:00.316",
                  "updatedBy": "HRT_ONLINE"
              },
              "_links": {
                  "self": {
                      "href": "http://localhost:8100/v1/citizens/ac100bcf-8a21-1839-818a-2ce9b6d701e8"
                  },
                  "citizen": {
                      "href": "http://localhost:8100/v1/citizens/ac100bcf-8a21-1839-818a-2ce9b6d701e8"
                  }
              }
          },
          {
              "id": "ac100bcf-8a21-1839-818a-2ce9dc5601eb",
              "firstName": "John",
              "lastName": "Smith",
              "dateOfBirth": "1997-03-24",
              "nhsNumber": "4857773457",
              "addresses": [
                  {
                      "id": "ac100bcf-8a21-1839-818a-2ce9dc5601eb",
                      "type": "POSTAL",
                      "addressLine1": "Stella House",
                      "addressLine2": "Goldcrest Way",
                      "townOrCity": "Newcastle upon Tyne",
                      "country": "England",
                      "postcode": "NE15 8NY",
                      "_meta": {
                          "channel": "HRT_ONLINE",
                          "createdTimestamp": "2023-01-22T09:00:00.316",
                          "createdBy": "HRT_ONLINE",
                          "updatedTimestamp": "2023-01-22T09:00:00.316",
                          "updatedBy": "HRT_ONLINE"
                      },
                      "_links": {
                          "citizen": {
                              "href": "http://localhost:8100/v1/citizens/ac100bcf-8a21-1839-818a-2ce9dc5601eb"
                          }
                      }
                  }
              ],
              "emails": [],
              "_meta": {
                  "channel": "HRT_ONLINE",
                  "createdTimestamp": "2023-01-22T09:00:00.316",
                  "createdBy": "HRT_ONLINE",
                  "updatedTimestamp": "2023-01-22T09:00:00.316",
                  "updatedBy": "HRT_ONLINE"
              },
              "_links": {
                  "self": {
                      "href": "http://localhost:8100/v1/citizens/ac100bcf-8a21-1839-818a-2ce9dc5601eb"
                  },
                  "citizen": {
                      "href": "http://localhost:8100/v1/citizens/ac100bcf-8a21-1839-818a-2ce9dc5601eb"
                  }
              }
          },
          {
              "id": "ac100bcf-8a21-1839-818a-2ce9dd6601ee",
              "firstName": "John",
              "lastName": "Smith",
              "dateOfBirth": "1997-03-24",
              "nhsNumber": "4857773457",
              "addresses": [
                  {
                      "id": "ac100bcf-8a21-1839-818a-2ce9dd6601ee",
                      "type": "POSTAL",
                      "addressLine1": "Stella House",
                      "addressLine2": "Goldcrest Way",
                      "townOrCity": "Newcastle upon Tyne",
                      "country": "England",
                      "postcode": "NE15 8NY",
                      "_meta": {
                          "channel": "HRT_ONLINE",
                          "createdTimestamp": "2023-01-22T09:00:00.316",
                          "createdBy": "HRT_ONLINE",
                          "updatedTimestamp": "2023-01-22T09:00:00.316",
                          "updatedBy": "HRT_ONLINE"
                      },
                      "_links": {
                          "citizen": {
                              "href": "http://localhost:8100/v1/citizens/ac100bcf-8a21-1839-818a-2ce9dd6601ee"
                          }
                      }
                  }
              ],
              "emails": [],
              "_meta": {
                  "channel": "HRT_ONLINE",
                  "createdTimestamp": "2023-01-22T09:00:00.316",
                  "createdBy": "HRT_ONLINE",
                  "updatedTimestamp": "2023-01-22T09:00:00.316",
                  "updatedBy": "HRT_ONLINE"
              },
              "_links": {
                  "self": {
                      "href": "http://localhost:8100/v1/citizens/ac100bcf-8a21-1839-818a-2ce9dd6601ee"
                  },
                  "citizen": {
                      "href": "http://localhost:8100/v1/citizens/ac100bcf-8a21-1839-818a-2ce9dd6601ee"
                  }
              }
          },
          {
              "id": "ac100bcf-8a21-1839-818a-2ce9e1c301f1",
              "firstName": "John",
              "lastName": "Smith",
              "dateOfBirth": "1997-03-24",
              "nhsNumber": "4857773457",
              "addresses": [
                  {
                      "id": "ac100bcf-8a21-1839-818a-2ce9e1c301f1",
                      "type": "POSTAL",
                      "addressLine1": "Stella House",
                      "addressLine2": "Goldcrest Way",
                      "townOrCity": "Newcastle upon Tyne",
                      "country": "England",
                      "postcode": "NE15 8NY",
                      "_meta": {
                          "channel": "HRT_ONLINE",
                          "createdTimestamp": "2023-01-22T09:00:00.316",
                          "createdBy": "HRT_ONLINE",
                          "updatedTimestamp": "2023-01-22T09:00:00.316",
                          "updatedBy": "HRT_ONLINE"
                      },
                      "_links": {
                          "citizen": {
                              "href": "http://localhost:8100/v1/citizens/ac100bcf-8a21-1839-818a-2ce9e1c301f1"
                          }
                      }
                  }
              ],
              "emails": [],
              "_meta": {
                  "channel": "HRT_ONLINE",
                  "createdTimestamp": "2023-01-22T09:00:00.316",
                  "createdBy": "HRT_ONLINE",
                  "updatedTimestamp": "2023-01-22T09:00:00.316",
                  "updatedBy": "HRT_ONLINE"
              },
              "_links": {
                  "self": {
                      "href": "http://localhost:8100/v1/citizens/ac100bcf-8a21-1839-818a-2ce9e1c301f1"
                  },
                  "citizen": {
                      "href": "http://localhost:8100/v1/citizens/ac100bcf-8a21-1839-818a-2ce9e1c301f1"
                  }
              }
          },
          {
              "id": "ac100bcf-8a21-1839-818a-2ce9f43001f4",
              "firstName": "John",
              "lastName": "Smith",
              "dateOfBirth": "1997-03-24",
              "nhsNumber": "4857773457",
              "addresses": [
                  {
                      "id": "ac100bcf-8a21-1839-818a-2ce9f43001f4",
                      "type": "POSTAL",
                      "addressLine1": "Stella House",
                      "addressLine2": "Goldcrest Way",
                      "townOrCity": "Newcastle upon Tyne",
                      "country": "England",
                      "postcode": "NE15 8NY",
                      "_meta": {
                          "channel": "HRT_ONLINE",
                          "createdTimestamp": "2023-01-22T09:00:00.316",
                          "createdBy": "HRT_ONLINE",
                          "updatedTimestamp": "2023-01-22T09:00:00.316",
                          "updatedBy": "HRT_ONLINE"
                      },
                      "_links": {
                          "citizen": {
                              "href": "http://localhost:8100/v1/citizens/ac100bcf-8a21-1839-818a-2ce9f43001f4"
                          }
                      }
                  }
              ],
              "emails": [],
              "_meta": {
                  "channel": "HRT_ONLINE",
                  "createdTimestamp": "2023-01-22T09:00:00.316",
                  "createdBy": "HRT_ONLINE",
                  "updatedTimestamp": "2023-01-22T09:00:00.316",
                  "updatedBy": "HRT_ONLINE"
              },
              "_links": {
                  "self": {
                      "href": "http://localhost:8100/v1/citizens/ac100bcf-8a21-1839-818a-2ce9f43001f4"
                  },
                  "citizen": {
                      "href": "http://localhost:8100/v1/citizens/ac100bcf-8a21-1839-818a-2ce9f43001f4"
                  }
              }
          },
          {
              "id": "ac100bcf-8a21-1839-818a-2cea0ade01f7",
              "firstName": "John",
              "lastName": "Smith",
              "dateOfBirth": "1997-03-24",
              "nhsNumber": "4857773457",
              "addresses": [
                  {
                      "id": "ac100bcf-8a21-1839-818a-2cea0ade01f7",
                      "type": "POSTAL",
                      "addressLine1": "Stella House",
                      "addressLine2": "Goldcrest Way",
                      "townOrCity": "Newcastle upon Tyne",
                      "country": "England",
                      "postcode": "NE15 8NY",
                      "_meta": {
                          "channel": "HRT_ONLINE",
                          "createdTimestamp": "2023-01-22T09:00:00.316",
                          "createdBy": "HRT_ONLINE",
                          "updatedTimestamp": "2023-01-22T09:00:00.316",
                          "updatedBy": "HRT_ONLINE"
                      },
                      "_links": {
                          "citizen": {
                              "href": "http://localhost:8100/v1/citizens/ac100bcf-8a21-1839-818a-2cea0ade01f7"
                          }
                      }
                  }
              ],
              "emails": [],
              "_meta": {
                  "channel": "HRT_ONLINE",
                  "createdTimestamp": "2023-01-22T09:00:00.316",
                  "createdBy": "HRT_ONLINE",
                  "updatedTimestamp": "2023-01-22T09:00:00.316",
                  "updatedBy": "HRT_ONLINE"
              },
              "_links": {
                  "self": {
                      "href": "http://localhost:8100/v1/citizens/ac100bcf-8a21-1839-818a-2cea0ade01f7"
                  },
                  "citizen": {
                      "href": "http://localhost:8100/v1/citizens/ac100bcf-8a21-1839-818a-2cea0ade01f7"
                  }
              }
          },
          {
              "id": "ac100bcf-8a21-1839-818a-2cea13b001fa",
              "firstName": "John",
              "lastName": "Smith",
              "dateOfBirth": "1997-03-24",
              "nhsNumber": "4857773457",
              "addresses": [
                  {
                      "id": "ac100bcf-8a21-1839-818a-2cea13b001fa",
                      "type": "POSTAL",
                      "addressLine1": "Stella House",
                      "addressLine2": "Goldcrest Way",
                      "townOrCity": "Newcastle upon Tyne",
                      "country": "England",
                      "postcode": "NE15 8NY",
                      "_meta": {
                          "channel": "HRT_ONLINE",
                          "createdTimestamp": "2023-01-22T09:00:00.316",
                          "createdBy": "HRT_ONLINE",
                          "updatedTimestamp": "2023-01-22T09:00:00.316",
                          "updatedBy": "HRT_ONLINE"
                      },
                      "_links": {
                          "citizen": {
                              "href": "http://localhost:8100/v1/citizens/ac100bcf-8a21-1839-818a-2cea13b001fa"
                          }
                      }
                  }
              ],
              "emails": [],
              "_meta": {
                  "channel": "HRT_ONLINE",
                  "createdTimestamp": "2023-01-22T09:00:00.316",
                  "createdBy": "HRT_ONLINE",
                  "updatedTimestamp": "2023-01-22T09:00:00.316",
                  "updatedBy": "HRT_ONLINE"
              },
              "_links": {
                  "self": {
                      "href": "http://localhost:8100/v1/citizens/ac100bcf-8a21-1839-818a-2cea13b001fa"
                  },
                  "citizen": {
                      "href": "http://localhost:8100/v1/citizens/ac100bcf-8a21-1839-818a-2cea13b001fa"
                  }
              }
          },
          {
              "id": "ac100bcf-8a21-1839-818a-2cea339201fd",
              "firstName": "John",
              "lastName": "Smith",
              "dateOfBirth": "1997-03-24",
              "nhsNumber": "4857773457",
              "addresses": [
                  {
                      "id": "ac100bcf-8a21-1839-818a-2cea339201fd",
                      "type": "POSTAL",
                      "addressLine1": "Stella House",
                      "addressLine2": "Goldcrest Way",
                      "townOrCity": "Newcastle upon Tyne",
                      "country": "England",
                      "postcode": "NE15 8NY",
                      "_meta": {
                          "channel": "HRT_ONLINE",
                          "createdTimestamp": "2023-01-22T09:00:00.316",
                          "createdBy": "HRT_ONLINE",
                          "updatedTimestamp": "2023-01-22T09:00:00.316",
                          "updatedBy": "HRT_ONLINE"
                      },
                      "_links": {
                          "citizen": {
                              "href": "http://localhost:8100/v1/citizens/ac100bcf-8a21-1839-818a-2cea339201fd"
                          }
                      }
                  }
              ],
              "emails": [],
              "_meta": {
                  "channel": "HRT_ONLINE",
                  "createdTimestamp": "2023-01-22T09:00:00.316",
                  "createdBy": "HRT_ONLINE",
                  "updatedTimestamp": "2023-01-22T09:00:00.316",
                  "updatedBy": "HRT_ONLINE"
              },
              "_links": {
                  "self": {
                      "href": "http://localhost:8100/v1/citizens/ac100bcf-8a21-1839-818a-2cea339201fd"
                  },
                  "citizen": {
                      "href": "http://localhost:8100/v1/citizens/ac100bcf-8a21-1839-818a-2cea339201fd"
                  }
              }
          },
          {
              "id": "ac100bcf-8a21-1839-818a-2cea38d00200",
              "firstName": "John",
              "lastName": "Smith",
              "dateOfBirth": "1997-03-24",
              "nhsNumber": "4857773457",
              "addresses": [
                  {
                      "id": "ac100bcf-8a21-1839-818a-2cea38d00200",
                      "type": "POSTAL",
                      "addressLine1": "Stella House",
                      "addressLine2": "Goldcrest Way",
                      "townOrCity": "Newcastle upon Tyne",
                      "country": "England",
                      "postcode": "NE15 8NY",
                      "_meta": {
                          "channel": "HRT_ONLINE",
                          "createdTimestamp": "2023-01-22T09:00:00.316",
                          "createdBy": "HRT_ONLINE",
                          "updatedTimestamp": "2023-01-22T09:00:00.316",
                          "updatedBy": "HRT_ONLINE"
                      },
                      "_links": {
                          "citizen": {
                              "href": "http://localhost:8100/v1/citizens/ac100bcf-8a21-1839-818a-2cea38d00200"
                          }
                      }
                  }
              ],
              "emails": [],
              "_meta": {
                  "channel": "HRT_ONLINE",
                  "createdTimestamp": "2023-01-22T09:00:00.316",
                  "createdBy": "HRT_ONLINE",
                  "updatedTimestamp": "2023-01-22T09:00:00.316",
                  "updatedBy": "HRT_ONLINE"
              },
              "_links": {
                  "self": {
                      "href": "http://localhost:8100/v1/citizens/ac100bcf-8a21-1839-818a-2cea38d00200"
                  },
                  "citizen": {
                      "href": "http://localhost:8100/v1/citizens/ac100bcf-8a21-1839-818a-2cea38d00200"
                  }
              }
          },
          {
              "id": "ac100a58-8a21-1840-818a-2cea3e1a0227",
              "firstName": "John",
              "lastName": "Smith",
              "dateOfBirth": "1997-03-24",
              "nhsNumber": "4857773457",
              "addresses": [
                  {
                      "id": "ac100a58-8a21-1840-818a-2cea3e1a0227",
                      "type": "POSTAL",
                      "addressLine1": "Stella House",
                      "addressLine2": "Goldcrest Way",
                      "townOrCity": "Newcastle upon Tyne",
                      "country": "England",
                      "postcode": "NE15 8NY",
                      "_meta": {
                          "channel": "HRT_ONLINE",
                          "createdTimestamp": "2023-01-22T09:00:00.316",
                          "createdBy": "HRT_ONLINE",
                          "updatedTimestamp": "2023-01-22T09:00:00.316",
                          "updatedBy": "HRT_ONLINE"
                      },
                      "_links": {
                          "citizen": {
                              "href": "http://localhost:8100/v1/citizens/ac100a58-8a21-1840-818a-2cea3e1a0227"
                          }
                      }
                  }
              ],
              "emails": [],
              "_meta": {
                  "channel": "HRT_ONLINE",
                  "createdTimestamp": "2023-01-22T09:00:00.316",
                  "createdBy": "HRT_ONLINE",
                  "updatedTimestamp": "2023-01-22T09:00:00.316",
                  "updatedBy": "HRT_ONLINE"
              },
              "_links": {
                  "self": {
                      "href": "http://localhost:8100/v1/citizens/ac100a58-8a21-1840-818a-2cea3e1a0227"
                  },
                  "citizen": {
                      "href": "http://localhost:8100/v1/citizens/ac100a58-8a21-1840-818a-2cea3e1a0227"
                  }
              }
          },
          {
              "id": "ac100bcf-8a21-1839-818a-2cea43a60203",
              "firstName": "John",
              "lastName": "Smith",
              "dateOfBirth": "1997-03-24",
              "nhsNumber": "4857773457",
              "addresses": [
                  {
                      "id": "ac100bcf-8a21-1839-818a-2cea43a60203",
                      "type": "POSTAL",
                      "addressLine1": "Stella House",
                      "addressLine2": "Goldcrest Way",
                      "townOrCity": "Newcastle upon Tyne",
                      "country": "England",
                      "postcode": "NE15 8NY",
                      "_meta": {
                          "channel": "HRT_ONLINE",
                          "createdTimestamp": "2023-01-22T09:00:00.316",
                          "createdBy": "HRT_ONLINE",
                          "updatedTimestamp": "2023-01-22T09:00:00.316",
                          "updatedBy": "HRT_ONLINE"
                      },
                      "_links": {
                          "citizen": {
                              "href": "http://localhost:8100/v1/citizens/ac100bcf-8a21-1839-818a-2cea43a60203"
                          }
                      }
                  }
              ],
              "emails": [],
              "_meta": {
                  "channel": "HRT_ONLINE",
                  "createdTimestamp": "2023-01-22T09:00:00.316",
                  "createdBy": "HRT_ONLINE",
                  "updatedTimestamp": "2023-01-22T09:00:00.316",
                  "updatedBy": "HRT_ONLINE"
              },
              "_links": {
                  "self": {
                      "href": "http://localhost:8100/v1/citizens/ac100bcf-8a21-1839-818a-2cea43a60203"
                  },
                  "citizen": {
                      "href": "http://localhost:8100/v1/citizens/ac100bcf-8a21-1839-818a-2cea43a60203"
                  }
              }
          },
          {
              "id": "ac100bcf-8a21-1839-818a-2cea49b60206",
              "firstName": "John",
              "lastName": "Smith",
              "dateOfBirth": "1997-03-24",
              "nhsNumber": "4857773457",
              "addresses": [
                  {
                      "id": "ac100bcf-8a21-1839-818a-2cea49b60206",
                      "type": "POSTAL",
                      "addressLine1": "Stella House",
                      "addressLine2": "Goldcrest Way",
                      "townOrCity": "Newcastle upon Tyne",
                      "country": "England",
                      "postcode": "NE15 8NY",
                      "_meta": {
                          "channel": "HRT_ONLINE",
                          "createdTimestamp": "2023-01-22T09:00:00.316",
                          "createdBy": "HRT_ONLINE",
                          "updatedTimestamp": "2023-01-22T09:00:00.316",
                          "updatedBy": "HRT_ONLINE"
                      },
                      "_links": {
                          "citizen": {
                              "href": "http://localhost:8100/v1/citizens/ac100bcf-8a21-1839-818a-2cea49b60206"
                          }
                      }
                  }
              ],
              "emails": [],
              "_meta": {
                  "channel": "HRT_ONLINE",
                  "createdTimestamp": "2023-01-22T09:00:00.316",
                  "createdBy": "HRT_ONLINE",
                  "updatedTimestamp": "2023-01-22T09:00:00.316",
                  "updatedBy": "HRT_ONLINE"
              },
              "_links": {
                  "self": {
                      "href": "http://localhost:8100/v1/citizens/ac100bcf-8a21-1839-818a-2cea49b60206"
                  },
                  "citizen": {
                      "href": "http://localhost:8100/v1/citizens/ac100bcf-8a21-1839-818a-2cea49b60206"
                  }
              }
          },
          {
              "id": "ac100a58-8a21-1840-818a-2cea4fb2022a",
              "firstName": "John",
              "lastName": "Smith",
              "dateOfBirth": "1997-03-24",
              "nhsNumber": "4857773457",
              "addresses": [
                  {
                      "id": "ac100a58-8a21-1840-818a-2cea4fb2022a",
                      "type": "POSTAL",
                      "addressLine1": "Stella House",
                      "addressLine2": "Goldcrest Way",
                      "townOrCity": "Newcastle upon Tyne",
                      "country": "England",
                      "postcode": "NE15 8NY",
                      "_meta": {
                          "channel": "HRT_ONLINE",
                          "createdTimestamp": "2023-01-22T09:00:00.316",
                          "createdBy": "HRT_ONLINE",
                          "updatedTimestamp": "2023-01-22T09:00:00.316",
                          "updatedBy": "HRT_ONLINE"
                      },
                      "_links": {
                          "citizen": {
                              "href": "http://localhost:8100/v1/citizens/ac100a58-8a21-1840-818a-2cea4fb2022a"
                          }
                      }
                  }
              ],
              "emails": [],
              "_meta": {
                  "channel": "HRT_ONLINE",
                  "createdTimestamp": "2023-01-22T09:00:00.316",
                  "createdBy": "HRT_ONLINE",
                  "updatedTimestamp": "2023-01-22T09:00:00.316",
                  "updatedBy": "HRT_ONLINE"
              },
              "_links": {
                  "self": {
                      "href": "http://localhost:8100/v1/citizens/ac100a58-8a21-1840-818a-2cea4fb2022a"
                  },
                  "citizen": {
                      "href": "http://localhost:8100/v1/citizens/ac100a58-8a21-1840-818a-2cea4fb2022a"
                  }
              }
          },
          {
              "id": "ac100bcf-8a21-1839-818a-2cea556e0209",
              "firstName": "John",
              "lastName": "Smith",
              "dateOfBirth": "1997-03-24",
              "nhsNumber": "4857773457",
              "addresses": [
                  {
                      "id": "ac100bcf-8a21-1839-818a-2cea556e0209",
                      "type": "POSTAL",
                      "addressLine1": "Stella House",
                      "addressLine2": "Goldcrest Way",
                      "townOrCity": "Newcastle upon Tyne",
                      "country": "England",
                      "postcode": "NE15 8NY",
                      "_meta": {
                          "channel": "HRT_ONLINE",
                          "createdTimestamp": "2023-01-22T09:00:00.316",
                          "createdBy": "HRT_ONLINE",
                          "updatedTimestamp": "2023-01-22T09:00:00.316",
                          "updatedBy": "HRT_ONLINE"
                      },
                      "_links": {
                          "citizen": {
                              "href": "http://localhost:8100/v1/citizens/ac100bcf-8a21-1839-818a-2cea556e0209"
                          }
                      }
                  }
              ],
              "emails": [],
              "_meta": {
                  "channel": "HRT_ONLINE",
                  "createdTimestamp": "2023-01-22T09:00:00.316",
                  "createdBy": "HRT_ONLINE",
                  "updatedTimestamp": "2023-01-22T09:00:00.316",
                  "updatedBy": "HRT_ONLINE"
              },
              "_links": {
                  "self": {
                      "href": "http://localhost:8100/v1/citizens/ac100bcf-8a21-1839-818a-2cea556e0209"
                  },
                  "citizen": {
                      "href": "http://localhost:8100/v1/citizens/ac100bcf-8a21-1839-818a-2cea556e0209"
                  }
              }
          },
          {
              "id": "ac100a58-8a21-1840-818a-2cea5ab7022d",
              "firstName": "John",
              "lastName": "Smith",
              "dateOfBirth": "1997-03-24",
              "nhsNumber": "4857773457",
              "addresses": [
                  {
                      "id": "ac100a58-8a21-1840-818a-2cea5ab7022d",
                      "type": "POSTAL",
                      "addressLine1": "Stella House",
                      "addressLine2": "Goldcrest Way",
                      "townOrCity": "Newcastle upon Tyne",
                      "country": "England",
                      "postcode": "NE15 8NY",
                      "_meta": {
                          "channel": "HRT_ONLINE",
                          "createdTimestamp": "2023-01-22T09:00:00.316",
                          "createdBy": "HRT_ONLINE",
                          "updatedTimestamp": "2023-01-22T09:00:00.316",
                          "updatedBy": "HRT_ONLINE"
                      },
                      "_links": {
                          "citizen": {
                              "href": "http://localhost:8100/v1/citizens/ac100a58-8a21-1840-818a-2cea5ab7022d"
                          }
                      }
                  }
              ],
              "emails": [],
              "_meta": {
                  "channel": "HRT_ONLINE",
                  "createdTimestamp": "2023-01-22T09:00:00.316",
                  "createdBy": "HRT_ONLINE",
                  "updatedTimestamp": "2023-01-22T09:00:00.316",
                  "updatedBy": "HRT_ONLINE"
              },
              "_links": {
                  "self": {
                      "href": "http://localhost:8100/v1/citizens/ac100a58-8a21-1840-818a-2cea5ab7022d"
                  },
                  "citizen": {
                      "href": "http://localhost:8100/v1/citizens/ac100a58-8a21-1840-818a-2cea5ab7022d"
                  }
              }
          },
          {
              "id": "ac100a58-8a21-1840-818a-2cea69620230",
              "firstName": "John",
              "lastName": "Smith",
              "dateOfBirth": "1997-03-24",
              "nhsNumber": "4857773457",
              "addresses": [
                  {
                      "id": "ac100a58-8a21-1840-818a-2cea69620230",
                      "type": "POSTAL",
                      "addressLine1": "Stella House",
                      "addressLine2": "Goldcrest Way",
                      "townOrCity": "Newcastle upon Tyne",
                      "country": "England",
                      "postcode": "NE15 8NY",
                      "_meta": {
                          "channel": "HRT_ONLINE",
                          "createdTimestamp": "2023-01-22T09:00:00.316",
                          "createdBy": "HRT_ONLINE",
                          "updatedTimestamp": "2023-01-22T09:00:00.316",
                          "updatedBy": "HRT_ONLINE"
                      },
                      "_links": {
                          "citizen": {
                              "href": "http://localhost:8100/v1/citizens/ac100a58-8a21-1840-818a-2cea69620230"
                          }
                      }
                  }
              ],
              "emails": [],
              "_meta": {
                  "channel": "HRT_ONLINE",
                  "createdTimestamp": "2023-01-22T09:00:00.316",
                  "createdBy": "HRT_ONLINE",
                  "updatedTimestamp": "2023-01-22T09:00:00.316",
                  "updatedBy": "HRT_ONLINE"
              },
              "_links": {
                  "self": {
                      "href": "http://localhost:8100/v1/citizens/ac100a58-8a21-1840-818a-2cea69620230"
                  },
                  "citizen": {
                      "href": "http://localhost:8100/v1/citizens/ac100a58-8a21-1840-818a-2cea69620230"
                  }
              }
          },
          {
              "id": "ac100bcf-8a21-1839-818a-2cea7288020c",
              "firstName": "John",
              "lastName": "Smith",
              "dateOfBirth": "1997-03-24",
              "nhsNumber": "4857773457",
              "addresses": [
                  {
                      "id": "ac100bcf-8a21-1839-818a-2cea7288020c",
                      "type": "POSTAL",
                      "addressLine1": "Stella House",
                      "addressLine2": "Goldcrest Way",
                      "townOrCity": "Newcastle upon Tyne",
                      "country": "England",
                      "postcode": "NE15 8NY",
                      "_meta": {
                          "channel": "HRT_ONLINE",
                          "createdTimestamp": "2023-01-22T09:00:00.316",
                          "createdBy": "HRT_ONLINE",
                          "updatedTimestamp": "2023-01-22T09:00:00.316",
                          "updatedBy": "HRT_ONLINE"
                      },
                      "_links": {
                          "citizen": {
                              "href": "http://localhost:8100/v1/citizens/ac100bcf-8a21-1839-818a-2cea7288020c"
                          }
                      }
                  }
              ],
              "emails": [],
              "_meta": {
                  "channel": "HRT_ONLINE",
                  "createdTimestamp": "2023-01-22T09:00:00.316",
                  "createdBy": "HRT_ONLINE",
                  "updatedTimestamp": "2023-01-22T09:00:00.316",
                  "updatedBy": "HRT_ONLINE"
              },
              "_links": {
                  "self": {
                      "href": "http://localhost:8100/v1/citizens/ac100bcf-8a21-1839-818a-2cea7288020c"
                  },
                  "citizen": {
                      "href": "http://localhost:8100/v1/citizens/ac100bcf-8a21-1839-818a-2cea7288020c"
                  }
              }
          },
          {
              "id": "ac100bcf-8a21-1839-818a-2cea7ae9020f",
              "firstName": "John",
              "lastName": "Smith",
              "dateOfBirth": "1997-03-24",
              "nhsNumber": "4857773457",
              "addresses": [
                  {
                      "id": "ac100bcf-8a21-1839-818a-2cea7ae9020f",
                      "type": "POSTAL",
                      "addressLine1": "Stella House",
                      "addressLine2": "Goldcrest Way",
                      "townOrCity": "Newcastle upon Tyne",
                      "country": "England",
                      "postcode": "NE15 8NY",
                      "_meta": {
                          "channel": "HRT_ONLINE",
                          "createdTimestamp": "2023-01-22T09:00:00.316",
                          "createdBy": "HRT_ONLINE",
                          "updatedTimestamp": "2023-01-22T09:00:00.316",
                          "updatedBy": "HRT_ONLINE"
                      },
                      "_links": {
                          "citizen": {
                              "href": "http://localhost:8100/v1/citizens/ac100bcf-8a21-1839-818a-2cea7ae9020f"
                          }
                      }
                  }
              ],
              "emails": [],
              "_meta": {
                  "channel": "HRT_ONLINE",
                  "createdTimestamp": "2023-01-22T09:00:00.316",
                  "createdBy": "HRT_ONLINE",
                  "updatedTimestamp": "2023-01-22T09:00:00.316",
                  "updatedBy": "HRT_ONLINE"
              },
              "_links": {
                  "self": {
                      "href": "http://localhost:8100/v1/citizens/ac100bcf-8a21-1839-818a-2cea7ae9020f"
                  },
                  "citizen": {
                      "href": "http://localhost:8100/v1/citizens/ac100bcf-8a21-1839-818a-2cea7ae9020f"
                  }
              }
          },
          {
              "id": "ac100a58-8a21-1840-818a-2cea7f9e0233",
              "firstName": "John",
              "lastName": "Smith",
              "dateOfBirth": "1997-03-24",
              "nhsNumber": "4857773457",
              "addresses": [
                  {
                      "id": "ac100a58-8a21-1840-818a-2cea7f9e0233",
                      "type": "POSTAL",
                      "addressLine1": "Stella House",
                      "addressLine2": "Goldcrest Way",
                      "townOrCity": "Newcastle upon Tyne",
                      "country": "England",
                      "postcode": "NE15 8NY",
                      "_meta": {
                          "channel": "HRT_ONLINE",
                          "createdTimestamp": "2023-01-22T09:00:00.316",
                          "createdBy": "HRT_ONLINE",
                          "updatedTimestamp": "2023-01-22T09:00:00.316",
                          "updatedBy": "HRT_ONLINE"
                      },
                      "_links": {
                          "citizen": {
                              "href": "http://localhost:8100/v1/citizens/ac100a58-8a21-1840-818a-2cea7f9e0233"
                          }
                      }
                  }
              ],
              "emails": [],
              "_meta": {
                  "channel": "HRT_ONLINE",
                  "createdTimestamp": "2023-01-22T09:00:00.316",
                  "createdBy": "HRT_ONLINE",
                  "updatedTimestamp": "2023-01-22T09:00:00.316",
                  "updatedBy": "HRT_ONLINE"
              },
              "_links": {
                  "self": {
                      "href": "http://localhost:8100/v1/citizens/ac100a58-8a21-1840-818a-2cea7f9e0233"
                  },
                  "citizen": {
                      "href": "http://localhost:8100/v1/citizens/ac100a58-8a21-1840-818a-2cea7f9e0233"
                  }
              }
          },
          {
              "id": "ac100bcf-8a21-1839-818a-2cea85300212",
              "firstName": "John",
              "lastName": "Smith",
              "dateOfBirth": "1997-03-24",
              "nhsNumber": "4857773457",
              "addresses": [
                  {
                      "id": "ac100bcf-8a21-1839-818a-2cea85300212",
                      "type": "POSTAL",
                      "addressLine1": "Stella House",
                      "addressLine2": "Goldcrest Way",
                      "townOrCity": "Newcastle upon Tyne",
                      "country": "England",
                      "postcode": "NE15 8NY",
                      "_meta": {
                          "channel": "HRT_ONLINE",
                          "createdTimestamp": "2023-01-22T09:00:00.316",
                          "createdBy": "HRT_ONLINE",
                          "updatedTimestamp": "2023-01-22T09:00:00.316",
                          "updatedBy": "HRT_ONLINE"
                      },
                      "_links": {
                          "citizen": {
                              "href": "http://localhost:8100/v1/citizens/ac100bcf-8a21-1839-818a-2cea85300212"
                          }
                      }
                  }
              ],
              "emails": [],
              "_meta": {
                  "channel": "HRT_ONLINE",
                  "createdTimestamp": "2023-01-22T09:00:00.316",
                  "createdBy": "HRT_ONLINE",
                  "updatedTimestamp": "2023-01-22T09:00:00.316",
                  "updatedBy": "HRT_ONLINE"
              },
              "_links": {
                  "self": {
                      "href": "http://localhost:8100/v1/citizens/ac100bcf-8a21-1839-818a-2cea85300212"
                  },
                  "citizen": {
                      "href": "http://localhost:8100/v1/citizens/ac100bcf-8a21-1839-818a-2cea85300212"
                  }
              }
          }
      ]
  },
  "_links": {
      "first": {
          "href": "http://localhost:8100/v1/citizens?firstName=John&lastName=Smith&dateOfBirth=1997-03-24&addresses.postcode=NE158NY&page=0&size=50"
      },
      "prev": {
          "href": "http://localhost:8100/v1/citizens?firstName=John&lastName=Smith&dateOfBirth=1997-03-24&addresses.postcode=NE158NY&page=8&size=50"
      },
      "self": {
          "href": "http://localhost:8100/v1/citizens?firstName=John&lastName=Smith&dateOfBirth=1997-03-24&addresses.postcode=NE158NY&page=9&size=50"
      },
      "next": {
          "href": "http://localhost:8100/v1/citizens?firstName=John&lastName=Smith&dateOfBirth=1997-03-24&addresses.postcode=NE158NY&page=10&size=50"
      },
      "last": {
          "href": "http://localhost:8100/v1/citizens?firstName=John&lastName=Smith&dateOfBirth=1997-03-24&addresses.postcode=NE158NY&page=10&size=50"
      },
      "profile": {
          "href": "http://localhost:8100/v1/profile/citizens"
      }
  },
  "page": {
      "size": 50,
      "totalElements": 501,
      "totalPages": 11,
      "number": 9
  }
}