{
  "healthChargeExemptions": {
    "citizens": [
      {
        "id": "0a004b01-8515-1a6c-8185-1558ae970000",
        "firstName": "John",
        "lastName": "Smith",
        "dateOfBirth": "1997-03-24",
        "addresses": [
          {
            "addressLine1": "Stella House",
            "addressLine2": "Goldcrest Way",
            "country": "England",
            "id": "0a004b01-8515-1a6c-8185-1558aeb70001",
            "postcode": "NE15 8NY",
            "townOrCity": "Newcastle upon Tyne",
            "type": "POSTAL"
          }
        ],
        "certificates": [
          {
            "id": "c0a80005-8576-12ed-8185-77be4c060036",
            "endDate": "2023-12-12",
            "reference": "BB1D3E453CE002CC6512",
            "startDate": "2022-12-12",
            "status": "PENDING",
            "type": "HRT_PPC"
          },
          {
            "id": "c0a80005-8576-12ed-8185-77be4f010037",
            "endDate": "2023-12-12",
            "reference": "E2CBB05CF07003447673",
            "startDate": "2022-12-12",
            "status": "PENDING",
            "type": "HRT_PPC"
          }
        ]
      },
      {
        "id": "0a004b01-8515-1a6c-8185-1558e1e10003",
        "firstName": "John",
        "lastName": "Smith",
        "dateOfBirth": "1997-03-24",
        "addresses": [
          {
            "addressLine1": "Stella House",
            "addressLine2": "Goldcrest Way",
            "country": "England",
            "id": "0a004b01-8515-1a6c-8185-1558e1e10004",
            "postcode": "NE15 8NY",
            "townOrCity": "Newcastle upon Tyne",
            "type": "POSTAL"
          }
        ],
        "certificates": []
      }
    ]
  },
  "otherExemptions": {
    "citizens": [
      {
        "firstName": "John",
        "lastName": "Smith",
        "dateOfBirth": "1997-03-24",
        "certificates": [
          {
            "reference": "20000047039",
            "startDate": "2019-08-18",
            "endDate": "2099-12-31",
            "type": "MATERNITY",
            "status": "ACTIVE"
          }
        ]
      }
    ]
  }
}