{
  "_embedded": {
    "citizens": [
      {
        "id": "c0a8012f-852e-13ca-8185-356ab94d00a2",
        "firstName": "JoHn",
        "lastName": "Smith",
        "dateOfBirth": "1997-03-24",
        "addresses": [
          {
            "id": "c0a8012f-852e-13ca-8185-356ab94d00a3",
            "type": "POSTAL",
            "addressLine1": "Stella House",
            "addressLine2": "Goldcrest Way",
            "townOrCity": "Newcastle upon Tyne",
            "country": "England",
            "postcode": "NE15 8NY",
            "_meta": {
              "channel": "HRT_ONLINE",
              "createdTimestamp": "2022-12-21T16:01:04.8454",
              "createdBy": "POSTMAN",
              "updatedTimestamp": "2022-12-21T16:01:04.8454",
              "updatedBy": "POSTMAN"
            },
            "_links": {
              "citizen": {
                "href": "http://localhost:8100/v1/citizens/c0a8012f-852e-13ca-8185-356ab94d00a2"
              }
            }
          }
        ],
        "emails": [
          {
            "id": "c0a8012f-852e-13ca-8185-356ab94d00a4",
            "type": "PERSONAL",
            "emailAddress": "test@test.com",
            "_meta": {
              "channel": "HRT_ONLINE",
              "createdTimestamp": "2022-12-21T16:01:04.845545",
              "createdBy": "POSTMAN",
              "updatedTimestamp": "2022-12-21T16:01:04.845545",
              "updatedBy": "POSTMAN"
            },
            "_links": {
              "citizen": {
                "href": "http://localhost:8100/v1/citizens/c0a8012f-852e-13ca-8185-356ab94d00a2"
              }
            }
          }
        ],
        "_meta": {
          "channel": "HRT_ONLINE",
          "createdTimestamp": "2022-12-21T16:01:04.845197",
          "createdBy": "POSTMAN",
          "updatedTimestamp": "2022-12-21T16:01:04.845197",
          "updatedBy": "POSTMAN"
        },
        "_links": {
          "self": {
            "href": "http://localhost:8100/v1/citizens/c0a8012f-852e-13ca-8185-356ab94d00a2"
          },
          "citizen": {
            "href": "http://localhost:8100/v1/citizens/c0a8012f-852e-13ca-8185-356ab94d00a2"
          }
        }
      },
      {
        "id": "0a004b01-8515-1a6c-8185-1558ae970000",
        "firstName": "John",
        "lastName": "SmiTh",
        "dateOfBirth": "1997-03-24",
        "addresses": [
          {
            "id": "c0a8012f-852e-13ca-8185-356abd3000a6",
            "type": "POSTAL",
            "addressLine1": "Stella House",
            "addressLine2": "Goldcrest Way",
            "townOrCity": "Newcastle upon Tyne",
            "country": "England",
            "postcode": "NE15 8NY",
            "_meta": {
              "channel": "HRT_ONLINE",
              "createdTimestamp": "2022-12-21T16:01:05.840132",
              "createdBy": "POSTMAN",
              "updatedTimestamp": "2022-12-21T16:01:05.840132",
              "updatedBy": "POSTMAN"
            },
            "_links": {
              "citizen": {
                "href": "http://localhost:8100/v1/citizens/0a004b01-8515-1a6c-8185-1558ae970000"
              }
            }
          }
        ],
        "emails": [
          {
            "id": "c0a8012f-852e-13ca-8185-356abd3000a7",
            "type": "PERSONAL",
            "emailAddress": "test@test.com",
            "_meta": {
              "channel": "HRT_ONLINE",
              "createdTimestamp": "2022-12-21T16:01:05.840335",
              "createdBy": "POSTMAN",
              "updatedTimestamp": "2022-12-21T16:01:05.840335",
              "updatedBy": "POSTMAN"
            },
            "_links": {
              "citizen": {
                "href": "http://localhost:8100/v1/citizens/c0a8012f-852e-13ca-8185-356abd2f00a5"
              }
            }
          }
        ],
        "_meta": {
          "channel": "HRT_ONLINE",
          "createdTimestamp": "2022-12-21T16:01:05.839377",
          "createdBy": "POSTMAN",
          "updatedTimestamp": "2022-12-21T16:01:05.839377",
          "updatedBy": "POSTMAN"
        },
        "_links": {
          "self": {
            "href": "http://localhost:8100/v1/citizens/c0a8012f-852e-13ca-8185-356abd2f00a5"
          },
          "citizen": {
            "href": "http://localhost:8100/v1/citizens/c0a8012f-852e-13ca-8185-356abd2f00a5"
          }
        }
      }
    ]
  },
  "_links": {
    "first": {
      "href": "http://localhost:8100/v1/citizens?firstName=John&lastName=Smith&dateOfBirth=1997-03-24&postcode=NE158NY&page=0&size=2"
    },
    "prev": {
      "href": "http://localhost:8100/v1/citizens?firstName=John&lastName=Smith&dateOfBirth=1997-03-24&postcode=NE158NY&page=0&size=2"
    },
    "self": {
      "href": "http://localhost:8100/v1/citizens?firstName=John&lastName=Smith&dateOfBirth=1997-03-24&postcode=NE158NY&size=2&page=1"
    },
    "next": {
      "href": "http://localhost:8100/v1/citizens?firstName=John&lastName=Smith&dateOfBirth=1997-03-24&postcode=NE158NY&page=2&size=2"
    },
    "last": {
      "href": "http://localhost:8100/v1/citizens?firstName=John&lastName=Smith&dateOfBirth=1997-03-24&postcode=NE158NY&page=2&size=2"
    },
    "profile": {
      "href": "http://localhost:8100/v1/profile/citizens"
    },
    "search": {
      "href": "http://localhost:8100/v1/citizens/search"
    }
  },
  "page": {
    "size": 2,
    "totalElements": 5,
    "totalPages": 3,
    "number": 1
  }
}