{
  "headers": {
    "x-api-key": "x-api-key",
    "channel": "HRT_ONLINE",
    "user-id": "ABCD",
    "correlation-id": "e7fffacb-4575-47ba-b998-e0169945cdd5"
  },
  "requestContext": {
    "requestId": "requestId"
  },
  "body": "{\"citizen\":{\"firstName\":\"John\",\"lastName\":\"Smith\",\"dateOfBirth\":\"1997-03-24\",\"address\":{\"postcode\":\"NE15 8NY\"}},\"certificate\":{\"status\":\"PENDING\",\"reference\":\"ABCDE\",\"startDate\":\"2022-03-24\",\"endDate\":\"2023-03-24\"}}"
}