{
  "_embedded": {
      "citizens": [
          {
              "id": "c0a8012f-852e-13ca-8185-356ab044009c",
              "firstName": "John",
              "lastName": "Smith",
              "dateOfBirth": "1997-03-24",
              "addresses": [
                  {
                      "id": "c0a8012f-852e-13ca-8185-356ab044009c",
                      "type": "POSTAL",
                      "addressLine1": "Stella House",
                      "addressLine2": "Goldcrest Way",
                      "townOrCity": "Newcastle upon Tyne",
                      "country": "England",
                      "postcode": "NE15 8NY",
                      "_meta": {
                          "channel": "HRT_ONLINE",
                          "createdTimestamp": "2023-01-22T09:00:00.316",
                          "createdBy": "HRT_ONLINE",
                          "updatedTimestamp": "2023-01-22T09:00:00.316",
                          "updatedBy": "HRT_ONLINE"
                      },
                      "_links": {
                          "citizen": {
                              "href": "http://localhost:8100/v1/citizens/c0a8012f-852e-13ca-8185-356ab044009c"
                          }
                      }
                  }
              ],
              "emails": [],
              "_meta": {
                  "channel": "HRT_ONLINE",
                  "createdTimestamp": "2023-01-22T09:00:00.316",
                  "createdBy": "HRT_ONLINE",
                  "updatedTimestamp": "2023-01-22T09:00:00.316",
                  "updatedBy": "HRT_ONLINE"
              },
              "_links": {
                  "self": {
                      "href": "http://localhost:8100/v1/citizens/ac100bcf-8a21-1839-818a-2c3b96a60027"
                  },
                  "citizen": {
                      "href": "http://localhost:8100/v1/citizens/ac100bcf-8a21-1839-818a-2c3b96a60027"
                  }
              }
          },
          {
              "id": "ac100a58-8a21-1840-818a-2c3b9a370037",
              "firstName": "John",
              "lastName": "Smith",
              "dateOfBirth": "1997-03-24",
              "addresses": [
                  {
                      "id": "ac100a58-8a21-1840-818a-2c3b9a370037",
                      "type": "POSTAL",
                      "addressLine1": "Stella House",
                      "addressLine2": "Goldcrest Way",
                      "townOrCity": "Newcastle upon Tyne",
                      "country": "England",
                      "postcode": "NE15 8NY",
                      "_meta": {
                          "channel": "HRT_ONLINE",
                          "createdTimestamp": "2023-01-22T09:00:00.316",
                          "createdBy": "HRT_ONLINE",
                          "updatedTimestamp": "2023-01-22T09:00:00.316",
                          "updatedBy": "HRT_ONLINE"
                      },
                      "_links": {
                          "citizen": {
                              "href": "http://localhost:8100/v1/citizens/ac100a58-8a21-1840-818a-2c3b9a370037"
                          }
                      }
                  }
              ],
              "emails": [],
              "_meta": {
                  "channel": "HRT_ONLINE",
                  "createdTimestamp": "2023-01-22T09:00:00.316",
                  "createdBy": "HRT_ONLINE",
                  "updatedTimestamp": "2023-01-22T09:00:00.316",
                  "updatedBy": "HRT_ONLINE"
              },
              "_links": {
                  "self": {
                      "href": "http://localhost:8100/v1/citizens/ac100a58-8a21-1840-818a-2c3b9a370037"
                  },
                  "citizen": {
                      "href": "http://localhost:8100/v1/citizens/ac100a58-8a21-1840-818a-2c3b9a370037"
                  }
              }
          },
          {
              "id": "ac100bcf-8a21-1839-818a-2c3b9dc4002a",
              "firstName": "John",
              "lastName": "Smith",
              "dateOfBirth": "1997-03-24",
              "addresses": [
                  {
                      "id": "ac100bcf-8a21-1839-818a-2c3b9dc4002a",
                      "type": "POSTAL",
                      "addressLine1": "Stella House",
                      "addressLine2": "Goldcrest Way",
                      "townOrCity": "Newcastle upon Tyne",
                      "country": "England",
                      "postcode": "NE15 8NY",
                      "_meta": {
                          "channel": "HRT_ONLINE",
                          "createdTimestamp": "2023-01-22T09:00:00.316",
                          "createdBy": "HRT_ONLINE",
                          "updatedTimestamp": "2023-01-22T09:00:00.316",
                          "updatedBy": "HRT_ONLINE"
                      },
                      "_links": {
                          "citizen": {
                              "href": "http://localhost:8100/v1/citizens/ac100bcf-8a21-1839-818a-2c3b9dc4002a"
                          }
                      }
                  }
              ],
              "emails": [],
              "_meta": {
                  "channel": "HRT_ONLINE",
                  "createdTimestamp": "2023-01-22T09:00:00.316",
                  "createdBy": "HRT_ONLINE",
                  "updatedTimestamp": "2023-01-22T09:00:00.316",
                  "updatedBy": "HRT_ONLINE"
              },
              "_links": {
                  "self": {
                      "href": "http://localhost:8100/v1/citizens/ac100bcf-8a21-1839-818a-2c3b9dc4002a"
                  },
                  "citizen": {
                      "href": "http://localhost:8100/v1/citizens/ac100bcf-8a21-1839-818a-2c3b9dc4002a"
                  }
              }
          },
          {
              "id": "ac100a58-8a21-1840-818a-2c3ba067003a",
              "firstName": "John",
              "lastName": "Smith",
              "dateOfBirth": "1997-03-24",
              "addresses": [
                  {
                      "id": "ac100a58-8a21-1840-818a-2c3ba067003a",
                      "type": "POSTAL",
                      "addressLine1": "Stella House",
                      "addressLine2": "Goldcrest Way",
                      "townOrCity": "Newcastle upon Tyne",
                      "country": "England",
                      "postcode": "NE15 8NY",
                      "_meta": {
                          "channel": "HRT_ONLINE",
                          "createdTimestamp": "2023-01-22T09:00:00.316",
                          "createdBy": "HRT_ONLINE",
                          "updatedTimestamp": "2023-01-22T09:00:00.316",
                          "updatedBy": "HRT_ONLINE"
                      },
                      "_links": {
                          "citizen": {
                              "href": "http://localhost:8100/v1/citizens/ac100a58-8a21-1840-818a-2c3ba067003a"
                          }
                      }
                  }
              ],
              "emails": [],
              "_meta": {
                  "channel": "HRT_ONLINE",
                  "createdTimestamp": "2023-01-22T09:00:00.316",
                  "createdBy": "HRT_ONLINE",
                  "updatedTimestamp": "2023-01-22T09:00:00.316",
                  "updatedBy": "HRT_ONLINE"
              },
              "_links": {
                  "self": {
                      "href": "http://localhost:8100/v1/citizens/ac100a58-8a21-1840-818a-2c3ba067003a"
                  },
                  "citizen": {
                      "href": "http://localhost:8100/v1/citizens/ac100a58-8a21-1840-818a-2c3ba067003a"
                  }
              }
          },
          {
              "id": "ac100bcf-8a21-1839-818a-2c3ba3a0002d",
              "firstName": "John",
              "lastName": "Smith",
              "dateOfBirth": "1997-03-24",
              "addresses": [
                  {
                      "id": "ac100bcf-8a21-1839-818a-2c3ba3a0002d",
                      "type": "POSTAL",
                      "addressLine1": "Stella House",
                      "addressLine2": "Goldcrest Way",
                      "townOrCity": "Newcastle upon Tyne",
                      "country": "England",
                      "postcode": "NE15 8NY",
                      "_meta": {
                          "channel": "HRT_ONLINE",
                          "createdTimestamp": "2023-01-22T09:00:00.316",
                          "createdBy": "HRT_ONLINE",
                          "updatedTimestamp": "2023-01-22T09:00:00.316",
                          "updatedBy": "HRT_ONLINE"
                      },
                      "_links": {
                          "citizen": {
                              "href": "http://localhost:8100/v1/citizens/ac100bcf-8a21-1839-818a-2c3ba3a0002d"
                          }
                      }
                  }
              ],
              "emails": [],
              "_meta": {
                  "channel": "HRT_ONLINE",
                  "createdTimestamp": "2023-01-22T09:00:00.316",
                  "createdBy": "HRT_ONLINE",
                  "updatedTimestamp": "2023-01-22T09:00:00.316",
                  "updatedBy": "HRT_ONLINE"
              },
              "_links": {
                  "self": {
                      "href": "http://localhost:8100/v1/citizens/ac100bcf-8a21-1839-818a-2c3ba3a0002d"
                  },
                  "citizen": {
                      "href": "http://localhost:8100/v1/citizens/ac100bcf-8a21-1839-818a-2c3ba3a0002d"
                  }
              }
          },
          {
              "id": "ac100a58-8a21-1840-818a-2c3ba6cc003d",
              "firstName": "John",
              "lastName": "Smith",
              "dateOfBirth": "1997-03-24",
              "addresses": [
                  {
                      "id": "ac100a58-8a21-1840-818a-2c3ba6cc003d",
                      "type": "POSTAL",
                      "addressLine1": "Stella House",
                      "addressLine2": "Goldcrest Way",
                      "townOrCity": "Newcastle upon Tyne",
                      "country": "England",
                      "postcode": "NE15 8NY",
                      "_meta": {
                          "channel": "HRT_ONLINE",
                          "createdTimestamp": "2023-01-22T09:00:00.316",
                          "createdBy": "HRT_ONLINE",
                          "updatedTimestamp": "2023-01-22T09:00:00.316",
                          "updatedBy": "HRT_ONLINE"
                      },
                      "_links": {
                          "citizen": {
                              "href": "http://localhost:8100/v1/citizens/ac100a58-8a21-1840-818a-2c3ba6cc003d"
                          }
                      }
                  }
              ],
              "emails": [],
              "_meta": {
                  "channel": "HRT_ONLINE",
                  "createdTimestamp": "2023-01-22T09:00:00.316",
                  "createdBy": "HRT_ONLINE",
                  "updatedTimestamp": "2023-01-22T09:00:00.316",
                  "updatedBy": "HRT_ONLINE"
              },
              "_links": {
                  "self": {
                      "href": "http://localhost:8100/v1/citizens/ac100a58-8a21-1840-818a-2c3ba6cc003d"
                  },
                  "citizen": {
                      "href": "http://localhost:8100/v1/citizens/ac100a58-8a21-1840-818a-2c3ba6cc003d"
                  }
              }
          },
          {
              "id": "ac100bcf-8a21-1839-818a-2c3bac8b0030",
              "firstName": "John",
              "lastName": "Smith",
              "dateOfBirth": "1997-03-24",
              "addresses": [
                  {
                      "id": "ac100bcf-8a21-1839-818a-2c3bac8b0030",
                      "type": "POSTAL",
                      "addressLine1": "Stella House",
                      "addressLine2": "Goldcrest Way",
                      "townOrCity": "Newcastle upon Tyne",
                      "country": "England",
                      "postcode": "NE15 8NY",
                      "_meta": {
                          "channel": "HRT_ONLINE",
                          "createdTimestamp": "2023-01-22T09:00:00.316",
                          "createdBy": "HRT_ONLINE",
                          "updatedTimestamp": "2023-01-22T09:00:00.316",
                          "updatedBy": "HRT_ONLINE"
                      },
                      "_links": {
                          "citizen": {
                              "href": "http://localhost:8100/v1/citizens/ac100bcf-8a21-1839-818a-2c3bac8b0030"
                          }
                      }
                  }
              ],
              "emails": [],
              "_meta": {
                  "channel": "HRT_ONLINE",
                  "createdTimestamp": "2023-01-22T09:00:00.316",
                  "createdBy": "HRT_ONLINE",
                  "updatedTimestamp": "2023-01-22T09:00:00.316",
                  "updatedBy": "HRT_ONLINE"
              },
              "_links": {
                  "self": {
                      "href": "http://localhost:8100/v1/citizens/ac100bcf-8a21-1839-818a-2c3bac8b0030"
                  },
                  "citizen": {
                      "href": "http://localhost:8100/v1/citizens/ac100bcf-8a21-1839-818a-2c3bac8b0030"
                  }
              }
          },
          {
              "id": "ac100a58-8a21-1840-818a-2c3baf670040",
              "firstName": "John",
              "lastName": "Smith",
              "dateOfBirth": "1997-03-24",
              "addresses": [
                  {
                      "id": "ac100a58-8a21-1840-818a-2c3baf670040",
                      "type": "POSTAL",
                      "addressLine1": "Stella House",
                      "addressLine2": "Goldcrest Way",
                      "townOrCity": "Newcastle upon Tyne",
                      "country": "England",
                      "postcode": "NE15 8NY",
                      "_meta": {
                          "channel": "HRT_ONLINE",
                          "createdTimestamp": "2023-01-22T09:00:00.316",
                          "createdBy": "HRT_ONLINE",
                          "updatedTimestamp": "2023-01-22T09:00:00.316",
                          "updatedBy": "HRT_ONLINE"
                      },
                      "_links": {
                          "citizen": {
                              "href": "http://localhost:8100/v1/citizens/ac100a58-8a21-1840-818a-2c3baf670040"
                          }
                      }
                  }
              ],
              "emails": [],
              "_meta": {
                  "channel": "HRT_ONLINE",
                  "createdTimestamp": "2023-01-22T09:00:00.316",
                  "createdBy": "HRT_ONLINE",
                  "updatedTimestamp": "2023-01-22T09:00:00.316",
                  "updatedBy": "HRT_ONLINE"
              },
              "_links": {
                  "self": {
                      "href": "http://localhost:8100/v1/citizens/ac100a58-8a21-1840-818a-2c3baf670040"
                  },
                  "citizen": {
                      "href": "http://localhost:8100/v1/citizens/ac100a58-8a21-1840-818a-2c3baf670040"
                  }
              }
          },
          {
              "id": "ac100bcf-8a21-1839-818a-2c3bb2080033",
              "firstName": "John",
              "lastName": "Smith",
              "dateOfBirth": "1997-03-24",
              "addresses": [
                  {
                      "id": "ac100bcf-8a21-1839-818a-2c3bb2080033",
                      "type": "POSTAL",
                      "addressLine1": "Stella House",
                      "addressLine2": "Goldcrest Way",
                      "townOrCity": "Newcastle upon Tyne",
                      "country": "England",
                      "postcode": "NE15 8NY",
                      "_meta": {
                          "channel": "HRT_ONLINE",
                          "createdTimestamp": "2023-01-22T09:00:00.316",
                          "createdBy": "HRT_ONLINE",
                          "updatedTimestamp": "2023-01-22T09:00:00.316",
                          "updatedBy": "HRT_ONLINE"
                      },
                      "_links": {
                          "citizen": {
                              "href": "http://localhost:8100/v1/citizens/ac100bcf-8a21-1839-818a-2c3bb2080033"
                          }
                      }
                  }
              ],
              "emails": [],
              "_meta": {
                  "channel": "HRT_ONLINE",
                  "createdTimestamp": "2023-01-22T09:00:00.316",
                  "createdBy": "HRT_ONLINE",
                  "updatedTimestamp": "2023-01-22T09:00:00.316",
                  "updatedBy": "HRT_ONLINE"
              },
              "_links": {
                  "self": {
                      "href": "http://localhost:8100/v1/citizens/ac100bcf-8a21-1839-818a-2c3bb2080033"
                  },
                  "citizen": {
                      "href": "http://localhost:8100/v1/citizens/ac100bcf-8a21-1839-818a-2c3bb2080033"
                  }
              }
          },
          {
              "id": "ac100a58-8a21-1840-818a-2c3bb8b30043",
              "firstName": "John",
              "lastName": "Smith",
              "dateOfBirth": "1997-03-24",
              "addresses": [
                  {
                      "id": "ac100a58-8a21-1840-818a-2c3bb8b30043",
                      "type": "POSTAL",
                      "addressLine1": "Stella House",
                      "addressLine2": "Goldcrest Way",
                      "townOrCity": "Newcastle upon Tyne",
                      "country": "England",
                      "postcode": "NE15 8NY",
                      "_meta": {
                          "channel": "HRT_ONLINE",
                          "createdTimestamp": "2023-01-22T09:00:00.316",
                          "createdBy": "HRT_ONLINE",
                          "updatedTimestamp": "2023-01-22T09:00:00.316",
                          "updatedBy": "HRT_ONLINE"
                      },
                      "_links": {
                          "citizen": {
                              "href": "http://localhost:8100/v1/citizens/ac100a58-8a21-1840-818a-2c3bb8b30043"
                          }
                      }
                  }
              ],
              "emails": [],
              "_meta": {
                  "channel": "HRT_ONLINE",
                  "createdTimestamp": "2023-01-22T09:00:00.316",
                  "createdBy": "HRT_ONLINE",
                  "updatedTimestamp": "2023-01-22T09:00:00.316",
                  "updatedBy": "HRT_ONLINE"
              },
              "_links": {
                  "self": {
                      "href": "http://localhost:8100/v1/citizens/ac100a58-8a21-1840-818a-2c3bb8b30043"
                  },
                  "citizen": {
                      "href": "http://localhost:8100/v1/citizens/ac100a58-8a21-1840-818a-2c3bb8b30043"
                  }
              }
          },
          {
              "id": "ac100bcf-8a21-1839-818a-2c3bbc300036",
              "firstName": "John",
              "lastName": "Smith",
              "dateOfBirth": "1997-03-24",
              "addresses": [
                  {
                      "id": "ac100bcf-8a21-1839-818a-2c3bbc300036",
                      "type": "POSTAL",
                      "addressLine1": "Stella House",
                      "addressLine2": "Goldcrest Way",
                      "townOrCity": "Newcastle upon Tyne",
                      "country": "England",
                      "postcode": "NE15 8NY",
                      "_meta": {
                          "channel": "HRT_ONLINE",
                          "createdTimestamp": "2023-01-22T09:00:00.316",
                          "createdBy": "HRT_ONLINE",
                          "updatedTimestamp": "2023-01-22T09:00:00.316",
                          "updatedBy": "HRT_ONLINE"
                      },
                      "_links": {
                          "citizen": {
                              "href": "http://localhost:8100/v1/citizens/ac100bcf-8a21-1839-818a-2c3bbc300036"
                          }
                      }
                  }
              ],
              "emails": [],
              "_meta": {
                  "channel": "HRT_ONLINE",
                  "createdTimestamp": "2023-01-22T09:00:00.316",
                  "createdBy": "HRT_ONLINE",
                  "updatedTimestamp": "2023-01-22T09:00:00.316",
                  "updatedBy": "HRT_ONLINE"
              },
              "_links": {
                  "self": {
                      "href": "http://localhost:8100/v1/citizens/ac100bcf-8a21-1839-818a-2c3bbc300036"
                  },
                  "citizen": {
                      "href": "http://localhost:8100/v1/citizens/ac100bcf-8a21-1839-818a-2c3bbc300036"
                  }
              }
          },
          {
              "id": "ac100a58-8a21-1840-818a-2c3bbf350046",
              "firstName": "John",
              "lastName": "Smith",
              "dateOfBirth": "1997-03-24",
              "addresses": [
                  {
                      "id": "ac100a58-8a21-1840-818a-2c3bbf350046",
                      "type": "POSTAL",
                      "addressLine1": "Stella House",
                      "addressLine2": "Goldcrest Way",
                      "townOrCity": "Newcastle upon Tyne",
                      "country": "England",
                      "postcode": "NE15 8NY",
                      "_meta": {
                          "channel": "HRT_ONLINE",
                          "createdTimestamp": "2023-01-22T09:00:00.316",
                          "createdBy": "HRT_ONLINE",
                          "updatedTimestamp": "2023-01-22T09:00:00.316",
                          "updatedBy": "HRT_ONLINE"
                      },
                      "_links": {
                          "citizen": {
                              "href": "http://localhost:8100/v1/citizens/ac100a58-8a21-1840-818a-2c3bbf350046"
                          }
                      }
                  }
              ],
              "emails": [],
              "_meta": {
                  "channel": "HRT_ONLINE",
                  "createdTimestamp": "2023-01-22T09:00:00.316",
                  "createdBy": "HRT_ONLINE",
                  "updatedTimestamp": "2023-01-22T09:00:00.316",
                  "updatedBy": "HRT_ONLINE"
              },
              "_links": {
                  "self": {
                      "href": "http://localhost:8100/v1/citizens/ac100a58-8a21-1840-818a-2c3bbf350046"
                  },
                  "citizen": {
                      "href": "http://localhost:8100/v1/citizens/ac100a58-8a21-1840-818a-2c3bbf350046"
                  }
              }
          },
          {
              "id": "ac100bcf-8a21-1839-818a-2c3bc1da0039",
              "firstName": "John",
              "lastName": "Smith",
              "dateOfBirth": "1997-03-24",
              "addresses": [
                  {
                      "id": "ac100bcf-8a21-1839-818a-2c3bc1da0039",
                      "type": "POSTAL",
                      "addressLine1": "Stella House",
                      "addressLine2": "Goldcrest Way",
                      "townOrCity": "Newcastle upon Tyne",
                      "country": "England",
                      "postcode": "NE15 8NY",
                      "_meta": {
                          "channel": "HRT_ONLINE",
                          "createdTimestamp": "2023-01-22T09:00:00.316",
                          "createdBy": "HRT_ONLINE",
                          "updatedTimestamp": "2023-01-22T09:00:00.316",
                          "updatedBy": "HRT_ONLINE"
                      },
                      "_links": {
                          "citizen": {
                              "href": "http://localhost:8100/v1/citizens/ac100bcf-8a21-1839-818a-2c3bc1da0039"
                          }
                      }
                  }
              ],
              "emails": [],
              "_meta": {
                  "channel": "HRT_ONLINE",
                  "createdTimestamp": "2023-01-22T09:00:00.316",
                  "createdBy": "HRT_ONLINE",
                  "updatedTimestamp": "2023-01-22T09:00:00.316",
                  "updatedBy": "HRT_ONLINE"
              },
              "_links": {
                  "self": {
                      "href": "http://localhost:8100/v1/citizens/ac100bcf-8a21-1839-818a-2c3bc1da0039"
                  },
                  "citizen": {
                      "href": "http://localhost:8100/v1/citizens/ac100bcf-8a21-1839-818a-2c3bc1da0039"
                  }
              }
          },
          {
              "id": "ac100a58-8a21-1840-818a-2c3bc7340049",
              "firstName": "John",
              "lastName": "Smith",
              "dateOfBirth": "1997-03-24",
              "addresses": [
                  {
                      "id": "ac100a58-8a21-1840-818a-2c3bc7340049",
                      "type": "POSTAL",
                      "addressLine1": "Stella House",
                      "addressLine2": "Goldcrest Way",
                      "townOrCity": "Newcastle upon Tyne",
                      "country": "England",
                      "postcode": "NE15 8NY",
                      "_meta": {
                          "channel": "HRT_ONLINE",
                          "createdTimestamp": "2023-01-22T09:00:00.316",
                          "createdBy": "HRT_ONLINE",
                          "updatedTimestamp": "2023-01-22T09:00:00.316",
                          "updatedBy": "HRT_ONLINE"
                      },
                      "_links": {
                          "citizen": {
                              "href": "http://localhost:8100/v1/citizens/ac100a58-8a21-1840-818a-2c3bc7340049"
                          }
                      }
                  }
              ],
              "emails": [],
              "_meta": {
                  "channel": "HRT_ONLINE",
                  "createdTimestamp": "2023-01-22T09:00:00.316",
                  "createdBy": "HRT_ONLINE",
                  "updatedTimestamp": "2023-01-22T09:00:00.316",
                  "updatedBy": "HRT_ONLINE"
              },
              "_links": {
                  "self": {
                      "href": "http://localhost:8100/v1/citizens/ac100a58-8a21-1840-818a-2c3bc7340049"
                  },
                  "citizen": {
                      "href": "http://localhost:8100/v1/citizens/ac100a58-8a21-1840-818a-2c3bc7340049"
                  }
              }
          },
          {
              "id": "ac100bcf-8a21-1839-818a-2c3bcb01003c",
              "firstName": "John",
              "lastName": "Smith",
              "dateOfBirth": "1997-03-24",
              "addresses": [
                  {
                      "id": "ac100bcf-8a21-1839-818a-2c3bcb01003c",
                      "type": "POSTAL",
                      "addressLine1": "Stella House",
                      "addressLine2": "Goldcrest Way",
                      "townOrCity": "Newcastle upon Tyne",
                      "country": "England",
                      "postcode": "NE15 8NY",
                      "_meta": {
                          "channel": "HRT_ONLINE",
                          "createdTimestamp": "2023-01-22T09:00:00.316",
                          "createdBy": "HRT_ONLINE",
                          "updatedTimestamp": "2023-01-22T09:00:00.316",
                          "updatedBy": "HRT_ONLINE"
                      },
                      "_links": {
                          "citizen": {
                              "href": "http://localhost:8100/v1/citizens/ac100bcf-8a21-1839-818a-2c3bcb01003c"
                          }
                      }
                  }
              ],
              "emails": [],
              "_meta": {
                  "channel": "HRT_ONLINE",
                  "createdTimestamp": "2023-01-22T09:00:00.316",
                  "createdBy": "HRT_ONLINE",
                  "updatedTimestamp": "2023-01-22T09:00:00.316",
                  "updatedBy": "HRT_ONLINE"
              },
              "_links": {
                  "self": {
                      "href": "http://localhost:8100/v1/citizens/ac100bcf-8a21-1839-818a-2c3bcb01003c"
                  },
                  "citizen": {
                      "href": "http://localhost:8100/v1/citizens/ac100bcf-8a21-1839-818a-2c3bcb01003c"
                  }
              }
          },
          {
              "id": "ac100a58-8a21-1840-818a-2c3bce74004c",
              "firstName": "John",
              "lastName": "Smith",
              "dateOfBirth": "1997-03-24",
              "addresses": [
                  {
                      "id": "ac100a58-8a21-1840-818a-2c3bce74004c",
                      "type": "POSTAL",
                      "addressLine1": "Stella House",
                      "addressLine2": "Goldcrest Way",
                      "townOrCity": "Newcastle upon Tyne",
                      "country": "England",
                      "postcode": "NE15 8NY",
                      "_meta": {
                          "channel": "HRT_ONLINE",
                          "createdTimestamp": "2023-01-22T09:00:00.316",
                          "createdBy": "HRT_ONLINE",
                          "updatedTimestamp": "2023-01-22T09:00:00.316",
                          "updatedBy": "HRT_ONLINE"
                      },
                      "_links": {
                          "citizen": {
                              "href": "http://localhost:8100/v1/citizens/ac100a58-8a21-1840-818a-2c3bce74004c"
                          }
                      }
                  }
              ],
              "emails": [],
              "_meta": {
                  "channel": "HRT_ONLINE",
                  "createdTimestamp": "2023-01-22T09:00:00.316",
                  "createdBy": "HRT_ONLINE",
                  "updatedTimestamp": "2023-01-22T09:00:00.316",
                  "updatedBy": "HRT_ONLINE"
              },
              "_links": {
                  "self": {
                      "href": "http://localhost:8100/v1/citizens/ac100a58-8a21-1840-818a-2c3bce74004c"
                  },
                  "citizen": {
                      "href": "http://localhost:8100/v1/citizens/ac100a58-8a21-1840-818a-2c3bce74004c"
                  }
              }
          },
          {
              "id": "ac100bcf-8a21-1839-818a-2c3bd28f003f",
              "firstName": "John",
              "lastName": "Smith",
              "dateOfBirth": "1997-03-24",
              "addresses": [
                  {
                      "id": "ac100bcf-8a21-1839-818a-2c3bd28f003f",
                      "type": "POSTAL",
                      "addressLine1": "Stella House",
                      "addressLine2": "Goldcrest Way",
                      "townOrCity": "Newcastle upon Tyne",
                      "country": "England",
                      "postcode": "NE15 8NY",
                      "_meta": {
                          "channel": "HRT_ONLINE",
                          "createdTimestamp": "2023-01-22T09:00:00.316",
                          "createdBy": "HRT_ONLINE",
                          "updatedTimestamp": "2023-01-22T09:00:00.316",
                          "updatedBy": "HRT_ONLINE"
                      },
                      "_links": {
                          "citizen": {
                              "href": "http://localhost:8100/v1/citizens/ac100bcf-8a21-1839-818a-2c3bd28f003f"
                          }
                      }
                  }
              ],
              "emails": [],
              "_meta": {
                  "channel": "HRT_ONLINE",
                  "createdTimestamp": "2023-01-22T09:00:00.316",
                  "createdBy": "HRT_ONLINE",
                  "updatedTimestamp": "2023-01-22T09:00:00.316",
                  "updatedBy": "HRT_ONLINE"
              },
              "_links": {
                  "self": {
                      "href": "http://localhost:8100/v1/citizens/ac100bcf-8a21-1839-818a-2c3bd28f003f"
                  },
                  "citizen": {
                      "href": "http://localhost:8100/v1/citizens/ac100bcf-8a21-1839-818a-2c3bd28f003f"
                  }
              }
          },
          {
              "id": "ac100a58-8a21-1840-818a-2c3bd928004f",
              "firstName": "John",
              "lastName": "Smith",
              "dateOfBirth": "1997-03-24",
              "addresses": [
                  {
                      "id": "ac100a58-8a21-1840-818a-2c3bd928004f",
                      "type": "POSTAL",
                      "addressLine1": "Stella House",
                      "addressLine2": "Goldcrest Way",
                      "townOrCity": "Newcastle upon Tyne",
                      "country": "England",
                      "postcode": "NE15 8NY",
                      "_meta": {
                          "channel": "HRT_ONLINE",
                          "createdTimestamp": "2023-01-22T09:00:00.316",
                          "createdBy": "HRT_ONLINE",
                          "updatedTimestamp": "2023-01-22T09:00:00.316",
                          "updatedBy": "HRT_ONLINE"
                      },
                      "_links": {
                          "citizen": {
                              "href": "http://localhost:8100/v1/citizens/ac100a58-8a21-1840-818a-2c3bd928004f"
                          }
                      }
                  }
              ],
              "emails": [],
              "_meta": {
                  "channel": "HRT_ONLINE",
                  "createdTimestamp": "2023-01-22T09:00:00.316",
                  "createdBy": "HRT_ONLINE",
                  "updatedTimestamp": "2023-01-22T09:00:00.316",
                  "updatedBy": "HRT_ONLINE"
              },
              "_links": {
                  "self": {
                      "href": "http://localhost:8100/v1/citizens/ac100a58-8a21-1840-818a-2c3bd928004f"
                  },
                  "citizen": {
                      "href": "http://localhost:8100/v1/citizens/ac100a58-8a21-1840-818a-2c3bd928004f"
                  }
              }
          },
          {
              "id": "ac100bcf-8a21-1839-818a-2c3bdf0c0042",
              "firstName": "John",
              "lastName": "Smith",
              "dateOfBirth": "1997-03-24",
              "addresses": [
                  {
                      "id": "ac100bcf-8a21-1839-818a-2c3bdf0c0042",
                      "type": "POSTAL",
                      "addressLine1": "Stella House",
                      "addressLine2": "Goldcrest Way",
                      "townOrCity": "Newcastle upon Tyne",
                      "country": "England",
                      "postcode": "NE15 8NY",
                      "_meta": {
                          "channel": "HRT_ONLINE",
                          "createdTimestamp": "2023-01-22T09:00:00.316",
                          "createdBy": "HRT_ONLINE",
                          "updatedTimestamp": "2023-01-22T09:00:00.316",
                          "updatedBy": "HRT_ONLINE"
                      },
                      "_links": {
                          "citizen": {
                              "href": "http://localhost:8100/v1/citizens/ac100bcf-8a21-1839-818a-2c3bdf0c0042"
                          }
                      }
                  }
              ],
              "emails": [],
              "_meta": {
                  "channel": "HRT_ONLINE",
                  "createdTimestamp": "2023-01-22T09:00:00.316",
                  "createdBy": "HRT_ONLINE",
                  "updatedTimestamp": "2023-01-22T09:00:00.316",
                  "updatedBy": "HRT_ONLINE"
              },
              "_links": {
                  "self": {
                      "href": "http://localhost:8100/v1/citizens/ac100bcf-8a21-1839-818a-2c3bdf0c0042"
                  },
                  "citizen": {
                      "href": "http://localhost:8100/v1/citizens/ac100bcf-8a21-1839-818a-2c3bdf0c0042"
                  }
              }
          },
          {
              "id": "ac100a58-8a21-1840-818a-2c3be5030052",
              "firstName": "John",
              "lastName": "Smith",
              "dateOfBirth": "1997-03-24",
              "addresses": [
                  {
                      "id": "ac100a58-8a21-1840-818a-2c3be5030052",
                      "type": "POSTAL",
                      "addressLine1": "Stella House",
                      "addressLine2": "Goldcrest Way",
                      "townOrCity": "Newcastle upon Tyne",
                      "country": "England",
                      "postcode": "NE15 8NY",
                      "_meta": {
                          "channel": "HRT_ONLINE",
                          "createdTimestamp": "2023-01-22T09:00:00.316",
                          "createdBy": "HRT_ONLINE",
                          "updatedTimestamp": "2023-01-22T09:00:00.316",
                          "updatedBy": "HRT_ONLINE"
                      },
                      "_links": {
                          "citizen": {
                              "href": "http://localhost:8100/v1/citizens/ac100a58-8a21-1840-818a-2c3be5030052"
                          }
                      }
                  }
              ],
              "emails": [],
              "_meta": {
                  "channel": "HRT_ONLINE",
                  "createdTimestamp": "2023-01-22T09:00:00.316",
                  "createdBy": "HRT_ONLINE",
                  "updatedTimestamp": "2023-01-22T09:00:00.316",
                  "updatedBy": "HRT_ONLINE"
              },
              "_links": {
                  "self": {
                      "href": "http://localhost:8100/v1/citizens/ac100a58-8a21-1840-818a-2c3be5030052"
                  },
                  "citizen": {
                      "href": "http://localhost:8100/v1/citizens/ac100a58-8a21-1840-818a-2c3be5030052"
                  }
              }
          },
          {
              "id": "ac100a58-8a21-1840-818a-2c5762ba0055",
              "firstName": "John",
              "lastName": "Smith",
              "dateOfBirth": "1997-03-24",
              "addresses": [
                  {
                      "id": "ac100a58-8a21-1840-818a-2c5762ba0055",
                      "type": "POSTAL",
                      "addressLine1": "Stella House",
                      "addressLine2": "Goldcrest Way",
                      "townOrCity": "Newcastle upon Tyne",
                      "country": "England",
                      "postcode": "NE15 8NY",
                      "_meta": {
                          "channel": "HRT_ONLINE",
                          "createdTimestamp": "2023-01-22T09:00:00.316",
                          "createdBy": "HRT_ONLINE",
                          "updatedTimestamp": "2023-01-22T09:00:00.316",
                          "updatedBy": "HRT_ONLINE"
                      },
                      "_links": {
                          "citizen": {
                              "href": "http://localhost:8100/v1/citizens/ac100a58-8a21-1840-818a-2c5762ba0055"
                          }
                      }
                  }
              ],
              "emails": [],
              "_meta": {
                  "channel": "HRT_ONLINE",
                  "createdTimestamp": "2023-01-22T09:00:00.316",
                  "createdBy": "HRT_ONLINE",
                  "updatedTimestamp": "2023-01-22T09:00:00.316",
                  "updatedBy": "HRT_ONLINE"
              },
              "_links": {
                  "self": {
                      "href": "http://localhost:8100/v1/citizens/ac100a58-8a21-1840-818a-2c5762ba0055"
                  },
                  "citizen": {
                      "href": "http://localhost:8100/v1/citizens/ac100a58-8a21-1840-818a-2c5762ba0055"
                  }
              }
          },
          {
              "id": "ac100bcf-8a21-1839-818a-2c5768d70045",
              "firstName": "John",
              "lastName": "Smith",
              "dateOfBirth": "1997-03-24",
              "addresses": [
                  {
                      "id": "ac100bcf-8a21-1839-818a-2c5768d70045",
                      "type": "POSTAL",
                      "addressLine1": "Stella House",
                      "addressLine2": "Goldcrest Way",
                      "townOrCity": "Newcastle upon Tyne",
                      "country": "England",
                      "postcode": "NE15 8NY",
                      "_meta": {
                          "channel": "HRT_ONLINE",
                          "createdTimestamp": "2023-01-22T09:00:00.316",
                          "createdBy": "HRT_ONLINE",
                          "updatedTimestamp": "2023-01-22T09:00:00.316",
                          "updatedBy": "HRT_ONLINE"
                      },
                      "_links": {
                          "citizen": {
                              "href": "http://localhost:8100/v1/citizens/ac100bcf-8a21-1839-818a-2c5768d70045"
                          }
                      }
                  }
              ],
              "emails": [],
              "_meta": {
                  "channel": "HRT_ONLINE",
                  "createdTimestamp": "2023-01-22T09:00:00.316",
                  "createdBy": "HRT_ONLINE",
                  "updatedTimestamp": "2023-01-22T09:00:00.316",
                  "updatedBy": "HRT_ONLINE"
              },
              "_links": {
                  "self": {
                      "href": "http://localhost:8100/v1/citizens/ac100bcf-8a21-1839-818a-2c5768d70045"
                  },
                  "citizen": {
                      "href": "http://localhost:8100/v1/citizens/ac100bcf-8a21-1839-818a-2c5768d70045"
                  }
              }
          },
          {
              "id": "ac100a58-8a21-1840-818a-2c576e810058",
              "firstName": "John",
              "lastName": "Smith",
              "dateOfBirth": "1997-03-24",
              "addresses": [
                  {
                      "id": "ac100a58-8a21-1840-818a-2c576e810058",
                      "type": "POSTAL",
                      "addressLine1": "Stella House",
                      "addressLine2": "Goldcrest Way",
                      "townOrCity": "Newcastle upon Tyne",
                      "country": "England",
                      "postcode": "NE15 8NY",
                      "_meta": {
                          "channel": "HRT_ONLINE",
                          "createdTimestamp": "2023-01-22T09:00:00.316",
                          "createdBy": "HRT_ONLINE",
                          "updatedTimestamp": "2023-01-22T09:00:00.316",
                          "updatedBy": "HRT_ONLINE"
                      },
                      "_links": {
                          "citizen": {
                              "href": "http://localhost:8100/v1/citizens/ac100a58-8a21-1840-818a-2c576e810058"
                          }
                      }
                  }
              ],
              "emails": [],
              "_meta": {
                  "channel": "HRT_ONLINE",
                  "createdTimestamp": "2023-01-22T09:00:00.316",
                  "createdBy": "HRT_ONLINE",
                  "updatedTimestamp": "2023-01-22T09:00:00.316",
                  "updatedBy": "HRT_ONLINE"
              },
              "_links": {
                  "self": {
                      "href": "http://localhost:8100/v1/citizens/ac100a58-8a21-1840-818a-2c576e810058"
                  },
                  "citizen": {
                      "href": "http://localhost:8100/v1/citizens/ac100a58-8a21-1840-818a-2c576e810058"
                  }
              }
          },
          {
              "id": "ac100bcf-8a21-1839-818a-2c5777810048",
              "firstName": "John",
              "lastName": "Smith",
              "dateOfBirth": "1997-03-24",
              "addresses": [
                  {
                      "id": "ac100bcf-8a21-1839-818a-2c5777810048",
                      "type": "POSTAL",
                      "addressLine1": "Stella House",
                      "addressLine2": "Goldcrest Way",
                      "townOrCity": "Newcastle upon Tyne",
                      "country": "England",
                      "postcode": "NE15 8NY",
                      "_meta": {
                          "channel": "HRT_ONLINE",
                          "createdTimestamp": "2023-01-22T09:00:00.316",
                          "createdBy": "HRT_ONLINE",
                          "updatedTimestamp": "2023-01-22T09:00:00.316",
                          "updatedBy": "HRT_ONLINE"
                      },
                      "_links": {
                          "citizen": {
                              "href": "http://localhost:8100/v1/citizens/ac100bcf-8a21-1839-818a-2c5777810048"
                          }
                      }
                  }
              ],
              "emails": [],
              "_meta": {
                  "channel": "HRT_ONLINE",
                  "createdTimestamp": "2023-01-22T09:00:00.316",
                  "createdBy": "HRT_ONLINE",
                  "updatedTimestamp": "2023-01-22T09:00:00.316",
                  "updatedBy": "HRT_ONLINE"
              },
              "_links": {
                  "self": {
                      "href": "http://localhost:8100/v1/citizens/ac100bcf-8a21-1839-818a-2c5777810048"
                  },
                  "citizen": {
                      "href": "http://localhost:8100/v1/citizens/ac100bcf-8a21-1839-818a-2c5777810048"
                  }
              }
          },
          {
              "id": "ac100a58-8a21-1840-818a-2c577c44005b",
              "firstName": "John",
              "lastName": "Smith",
              "dateOfBirth": "1997-03-24",
              "addresses": [
                  {
                      "id": "ac100a58-8a21-1840-818a-2c577c44005b",
                      "type": "POSTAL",
                      "addressLine1": "Stella House",
                      "addressLine2": "Goldcrest Way",
                      "townOrCity": "Newcastle upon Tyne",
                      "country": "England",
                      "postcode": "NE15 8NY",
                      "_meta": {
                          "channel": "HRT_ONLINE",
                          "createdTimestamp": "2023-01-22T09:00:00.316",
                          "createdBy": "HRT_ONLINE",
                          "updatedTimestamp": "2023-01-22T09:00:00.316",
                          "updatedBy": "HRT_ONLINE"
                      },
                      "_links": {
                          "citizen": {
                              "href": "http://localhost:8100/v1/citizens/ac100a58-8a21-1840-818a-2c577c44005b"
                          }
                      }
                  }
              ],
              "emails": [],
              "_meta": {
                  "channel": "HRT_ONLINE",
                  "createdTimestamp": "2023-01-22T09:00:00.316",
                  "createdBy": "HRT_ONLINE",
                  "updatedTimestamp": "2023-01-22T09:00:00.316",
                  "updatedBy": "HRT_ONLINE"
              },
              "_links": {
                  "self": {
                      "href": "http://localhost:8100/v1/citizens/ac100a58-8a21-1840-818a-2c577c44005b"
                  },
                  "citizen": {
                      "href": "http://localhost:8100/v1/citizens/ac100a58-8a21-1840-818a-2c577c44005b"
                  }
              }
          },
          {
              "id": "ac100bcf-8a21-1839-818a-2c578182004b",
              "firstName": "John",
              "lastName": "Smith",
              "dateOfBirth": "1997-03-24",
              "addresses": [
                  {
                      "id": "ac100bcf-8a21-1839-818a-2c578182004b",
                      "type": "POSTAL",
                      "addressLine1": "Stella House",
                      "addressLine2": "Goldcrest Way",
                      "townOrCity": "Newcastle upon Tyne",
                      "country": "England",
                      "postcode": "NE15 8NY",
                      "_meta": {
                          "channel": "HRT_ONLINE",
                          "createdTimestamp": "2023-01-22T09:00:00.316",
                          "createdBy": "HRT_ONLINE",
                          "updatedTimestamp": "2023-01-22T09:00:00.316",
                          "updatedBy": "HRT_ONLINE"
                      },
                      "_links": {
                          "citizen": {
                              "href": "http://localhost:8100/v1/citizens/ac100bcf-8a21-1839-818a-2c578182004b"
                          }
                      }
                  }
              ],
              "emails": [],
              "_meta": {
                  "channel": "HRT_ONLINE",
                  "createdTimestamp": "2023-01-22T09:00:00.316",
                  "createdBy": "HRT_ONLINE",
                  "updatedTimestamp": "2023-01-22T09:00:00.316",
                  "updatedBy": "HRT_ONLINE"
              },
              "_links": {
                  "self": {
                      "href": "http://localhost:8100/v1/citizens/ac100bcf-8a21-1839-818a-2c578182004b"
                  },
                  "citizen": {
                      "href": "http://localhost:8100/v1/citizens/ac100bcf-8a21-1839-818a-2c578182004b"
                  }
              }
          },
          {
              "id": "ac100a58-8a21-1840-818a-2c578666005e",
              "firstName": "John",
              "lastName": "Smith",
              "dateOfBirth": "1997-03-24",
              "addresses": [
                  {
                      "id": "ac100a58-8a21-1840-818a-2c578666005e",
                      "type": "POSTAL",
                      "addressLine1": "Stella House",
                      "addressLine2": "Goldcrest Way",
                      "townOrCity": "Newcastle upon Tyne",
                      "country": "England",
                      "postcode": "NE15 8NY",
                      "_meta": {
                          "channel": "HRT_ONLINE",
                          "createdTimestamp": "2023-01-22T09:00:00.316",
                          "createdBy": "HRT_ONLINE",
                          "updatedTimestamp": "2023-01-22T09:00:00.316",
                          "updatedBy": "HRT_ONLINE"
                      },
                      "_links": {
                          "citizen": {
                              "href": "http://localhost:8100/v1/citizens/ac100a58-8a21-1840-818a-2c578666005e"
                          }
                      }
                  }
              ],
              "emails": [],
              "_meta": {
                  "channel": "HRT_ONLINE",
                  "createdTimestamp": "2023-01-22T09:00:00.316",
                  "createdBy": "HRT_ONLINE",
                  "updatedTimestamp": "2023-01-22T09:00:00.316",
                  "updatedBy": "HRT_ONLINE"
              },
              "_links": {
                  "self": {
                      "href": "http://localhost:8100/v1/citizens/ac100a58-8a21-1840-818a-2c578666005e"
                  },
                  "citizen": {
                      "href": "http://localhost:8100/v1/citizens/ac100a58-8a21-1840-818a-2c578666005e"
                  }
              }
          },
          {
              "id": "ac100bcf-8a21-1839-818a-2c578b6b004e",
              "firstName": "John",
              "lastName": "Smith",
              "dateOfBirth": "1997-03-24",
              "addresses": [
                  {
                      "id": "ac100bcf-8a21-1839-818a-2c578b6b004e",
                      "type": "POSTAL",
                      "addressLine1": "Stella House",
                      "addressLine2": "Goldcrest Way",
                      "townOrCity": "Newcastle upon Tyne",
                      "country": "England",
                      "postcode": "NE15 8NY",
                      "_meta": {
                          "channel": "HRT_ONLINE",
                          "createdTimestamp": "2023-01-22T09:00:00.316",
                          "createdBy": "HRT_ONLINE",
                          "updatedTimestamp": "2023-01-22T09:00:00.316",
                          "updatedBy": "HRT_ONLINE"
                      },
                      "_links": {
                          "citizen": {
                              "href": "http://localhost:8100/v1/citizens/ac100bcf-8a21-1839-818a-2c578b6b004e"
                          }
                      }
                  }
              ],
              "emails": [],
              "_meta": {
                  "channel": "HRT_ONLINE",
                  "createdTimestamp": "2023-01-22T09:00:00.316",
                  "createdBy": "HRT_ONLINE",
                  "updatedTimestamp": "2023-01-22T09:00:00.316",
                  "updatedBy": "HRT_ONLINE"
              },
              "_links": {
                  "self": {
                      "href": "http://localhost:8100/v1/citizens/ac100bcf-8a21-1839-818a-2c578b6b004e"
                  },
                  "citizen": {
                      "href": "http://localhost:8100/v1/citizens/ac100bcf-8a21-1839-818a-2c578b6b004e"
                  }
              }
          },
          {
              "id": "ac100a58-8a21-1840-818a-2c57905a0061",
              "firstName": "John",
              "lastName": "Smith",
              "dateOfBirth": "1997-03-24",
              "addresses": [
                  {
                      "id": "ac100a58-8a21-1840-818a-2c57905a0061",
                      "type": "POSTAL",
                      "addressLine1": "Stella House",
                      "addressLine2": "Goldcrest Way",
                      "townOrCity": "Newcastle upon Tyne",
                      "country": "England",
                      "postcode": "NE15 8NY",
                      "_meta": {
                          "channel": "HRT_ONLINE",
                          "createdTimestamp": "2023-01-22T09:00:00.316",
                          "createdBy": "HRT_ONLINE",
                          "updatedTimestamp": "2023-01-22T09:00:00.316",
                          "updatedBy": "HRT_ONLINE"
                      },
                      "_links": {
                          "citizen": {
                              "href": "http://localhost:8100/v1/citizens/ac100a58-8a21-1840-818a-2c57905a0061"
                          }
                      }
                  }
              ],
              "emails": [],
              "_meta": {
                  "channel": "HRT_ONLINE",
                  "createdTimestamp": "2023-01-22T09:00:00.316",
                  "createdBy": "HRT_ONLINE",
                  "updatedTimestamp": "2023-01-22T09:00:00.316",
                  "updatedBy": "HRT_ONLINE"
              },
              "_links": {
                  "self": {
                      "href": "http://localhost:8100/v1/citizens/ac100a58-8a21-1840-818a-2c57905a0061"
                  },
                  "citizen": {
                      "href": "http://localhost:8100/v1/citizens/ac100a58-8a21-1840-818a-2c57905a0061"
                  }
              }
          },
          {
              "id": "ac100bcf-8a21-1839-818a-2c579e500051",
              "firstName": "John",
              "lastName": "Smith",
              "dateOfBirth": "1997-03-24",
              "addresses": [
                  {
                      "id": "ac100bcf-8a21-1839-818a-2c579e500051",
                      "type": "POSTAL",
                      "addressLine1": "Stella House",
                      "addressLine2": "Goldcrest Way",
                      "townOrCity": "Newcastle upon Tyne",
                      "country": "England",
                      "postcode": "NE15 8NY",
                      "_meta": {
                          "channel": "HRT_ONLINE",
                          "createdTimestamp": "2023-01-22T09:00:00.316",
                          "createdBy": "HRT_ONLINE",
                          "updatedTimestamp": "2023-01-22T09:00:00.316",
                          "updatedBy": "HRT_ONLINE"
                      },
                      "_links": {
                          "citizen": {
                              "href": "http://localhost:8100/v1/citizens/ac100bcf-8a21-1839-818a-2c579e500051"
                          }
                      }
                  }
              ],
              "emails": [],
              "_meta": {
                  "channel": "HRT_ONLINE",
                  "createdTimestamp": "2023-01-22T09:00:00.316",
                  "createdBy": "HRT_ONLINE",
                  "updatedTimestamp": "2023-01-22T09:00:00.316",
                  "updatedBy": "HRT_ONLINE"
              },
              "_links": {
                  "self": {
                      "href": "http://localhost:8100/v1/citizens/ac100bcf-8a21-1839-818a-2c579e500051"
                  },
                  "citizen": {
                      "href": "http://localhost:8100/v1/citizens/ac100bcf-8a21-1839-818a-2c579e500051"
                  }
              }
          },
          {
              "id": "ac100a58-8a21-1840-818a-2c57ade70064",
              "firstName": "John",
              "lastName": "Smith",
              "dateOfBirth": "1997-03-24",
              "addresses": [
                  {
                      "id": "ac100a58-8a21-1840-818a-2c57ade70064",
                      "type": "POSTAL",
                      "addressLine1": "Stella House",
                      "addressLine2": "Goldcrest Way",
                      "townOrCity": "Newcastle upon Tyne",
                      "country": "England",
                      "postcode": "NE15 8NY",
                      "_meta": {
                          "channel": "HRT_ONLINE",
                          "createdTimestamp": "2023-01-22T09:00:00.316",
                          "createdBy": "HRT_ONLINE",
                          "updatedTimestamp": "2023-01-22T09:00:00.316",
                          "updatedBy": "HRT_ONLINE"
                      },
                      "_links": {
                          "citizen": {
                              "href": "http://localhost:8100/v1/citizens/ac100a58-8a21-1840-818a-2c57ade70064"
                          }
                      }
                  }
              ],
              "emails": [],
              "_meta": {
                  "channel": "HRT_ONLINE",
                  "createdTimestamp": "2023-01-22T09:00:00.316",
                  "createdBy": "HRT_ONLINE",
                  "updatedTimestamp": "2023-01-22T09:00:00.316",
                  "updatedBy": "HRT_ONLINE"
              },
              "_links": {
                  "self": {
                      "href": "http://localhost:8100/v1/citizens/ac100a58-8a21-1840-818a-2c57ade70064"
                  },
                  "citizen": {
                      "href": "http://localhost:8100/v1/citizens/ac100a58-8a21-1840-818a-2c57ade70064"
                  }
              }
          },
          {
              "id": "ac100bcf-8a21-1839-818a-2c57b2d70054",
              "firstName": "John",
              "lastName": "Smith",
              "dateOfBirth": "1997-03-24",
              "addresses": [
                  {
                      "id": "ac100bcf-8a21-1839-818a-2c57b2d70054",
                      "type": "POSTAL",
                      "addressLine1": "Stella House",
                      "addressLine2": "Goldcrest Way",
                      "townOrCity": "Newcastle upon Tyne",
                      "country": "England",
                      "postcode": "NE15 8NY",
                      "_meta": {
                          "channel": "HRT_ONLINE",
                          "createdTimestamp": "2023-01-22T09:00:00.316",
                          "createdBy": "HRT_ONLINE",
                          "updatedTimestamp": "2023-01-22T09:00:00.316",
                          "updatedBy": "HRT_ONLINE"
                      },
                      "_links": {
                          "citizen": {
                              "href": "http://localhost:8100/v1/citizens/ac100bcf-8a21-1839-818a-2c57b2d70054"
                          }
                      }
                  }
              ],
              "emails": [],
              "_meta": {
                  "channel": "HRT_ONLINE",
                  "createdTimestamp": "2023-01-22T09:00:00.316",
                  "createdBy": "HRT_ONLINE",
                  "updatedTimestamp": "2023-01-22T09:00:00.316",
                  "updatedBy": "HRT_ONLINE"
              },
              "_links": {
                  "self": {
                      "href": "http://localhost:8100/v1/citizens/ac100bcf-8a21-1839-818a-2c57b2d70054"
                  },
                  "citizen": {
                      "href": "http://localhost:8100/v1/citizens/ac100bcf-8a21-1839-818a-2c57b2d70054"
                  }
              }
          },
          {
              "id": "ac100a58-8a21-1840-818a-2c57b8130067",
              "firstName": "John",
              "lastName": "Smith",
              "dateOfBirth": "1997-03-24",
              "addresses": [
                  {
                      "id": "ac100a58-8a21-1840-818a-2c57b8130067",
                      "type": "POSTAL",
                      "addressLine1": "Stella House",
                      "addressLine2": "Goldcrest Way",
                      "townOrCity": "Newcastle upon Tyne",
                      "country": "England",
                      "postcode": "NE15 8NY",
                      "_meta": {
                          "channel": "HRT_ONLINE",
                          "createdTimestamp": "2023-01-22T09:00:00.316",
                          "createdBy": "HRT_ONLINE",
                          "updatedTimestamp": "2023-01-22T09:00:00.316",
                          "updatedBy": "HRT_ONLINE"
                      },
                      "_links": {
                          "citizen": {
                              "href": "http://localhost:8100/v1/citizens/ac100a58-8a21-1840-818a-2c57b8130067"
                          }
                      }
                  }
              ],
              "emails": [],
              "_meta": {
                  "channel": "HRT_ONLINE",
                  "createdTimestamp": "2023-01-22T09:00:00.316",
                  "createdBy": "HRT_ONLINE",
                  "updatedTimestamp": "2023-01-22T09:00:00.316",
                  "updatedBy": "HRT_ONLINE"
              },
              "_links": {
                  "self": {
                      "href": "http://localhost:8100/v1/citizens/ac100a58-8a21-1840-818a-2c57b8130067"
                  },
                  "citizen": {
                      "href": "http://localhost:8100/v1/citizens/ac100a58-8a21-1840-818a-2c57b8130067"
                  }
              }
          },
          {
              "id": "ac100bcf-8a21-1839-818a-2c57c26f0057",
              "firstName": "John",
              "lastName": "Smith",
              "dateOfBirth": "1997-03-24",
              "addresses": [
                  {
                      "id": "ac100bcf-8a21-1839-818a-2c57c26f0057",
                      "type": "POSTAL",
                      "addressLine1": "Stella House",
                      "addressLine2": "Goldcrest Way",
                      "townOrCity": "Newcastle upon Tyne",
                      "country": "England",
                      "postcode": "NE15 8NY",
                      "_meta": {
                          "channel": "HRT_ONLINE",
                          "createdTimestamp": "2023-01-22T09:00:00.316",
                          "createdBy": "HRT_ONLINE",
                          "updatedTimestamp": "2023-01-22T09:00:00.316",
                          "updatedBy": "HRT_ONLINE"
                      },
                      "_links": {
                          "citizen": {
                              "href": "http://localhost:8100/v1/citizens/ac100bcf-8a21-1839-818a-2c57c26f0057"
                          }
                      }
                  }
              ],
              "emails": [],
              "_meta": {
                  "channel": "HRT_ONLINE",
                  "createdTimestamp": "2023-01-22T09:00:00.316",
                  "createdBy": "HRT_ONLINE",
                  "updatedTimestamp": "2023-01-22T09:00:00.316",
                  "updatedBy": "HRT_ONLINE"
              },
              "_links": {
                  "self": {
                      "href": "http://localhost:8100/v1/citizens/ac100bcf-8a21-1839-818a-2c57c26f0057"
                  },
                  "citizen": {
                      "href": "http://localhost:8100/v1/citizens/ac100bcf-8a21-1839-818a-2c57c26f0057"
                  }
              }
          },
          {
              "id": "ac100a58-8a21-1840-818a-2c57c6b8006a",
              "firstName": "John",
              "lastName": "Smith",
              "dateOfBirth": "1997-03-24",
              "addresses": [
                  {
                      "id": "ac100a58-8a21-1840-818a-2c57c6b8006a",
                      "type": "POSTAL",
                      "addressLine1": "Stella House",
                      "addressLine2": "Goldcrest Way",
                      "townOrCity": "Newcastle upon Tyne",
                      "country": "England",
                      "postcode": "NE15 8NY",
                      "_meta": {
                          "channel": "HRT_ONLINE",
                          "createdTimestamp": "2023-01-22T09:00:00.316",
                          "createdBy": "HRT_ONLINE",
                          "updatedTimestamp": "2023-01-22T09:00:00.316",
                          "updatedBy": "HRT_ONLINE"
                      },
                      "_links": {
                          "citizen": {
                              "href": "http://localhost:8100/v1/citizens/ac100a58-8a21-1840-818a-2c57c6b8006a"
                          }
                      }
                  }
              ],
              "emails": [],
              "_meta": {
                  "channel": "HRT_ONLINE",
                  "createdTimestamp": "2023-01-22T09:00:00.316",
                  "createdBy": "HRT_ONLINE",
                  "updatedTimestamp": "2023-01-22T09:00:00.316",
                  "updatedBy": "HRT_ONLINE"
              },
              "_links": {
                  "self": {
                      "href": "http://localhost:8100/v1/citizens/ac100a58-8a21-1840-818a-2c57c6b8006a"
                  },
                  "citizen": {
                      "href": "http://localhost:8100/v1/citizens/ac100a58-8a21-1840-818a-2c57c6b8006a"
                  }
              }
          },
          {
              "id": "ac100bcf-8a21-1839-818a-2c57cba6005a",
              "firstName": "John",
              "lastName": "Smith",
              "dateOfBirth": "1997-03-24",
              "addresses": [
                  {
                      "id": "ac100bcf-8a21-1839-818a-2c57cba6005a",
                      "type": "POSTAL",
                      "addressLine1": "Stella House",
                      "addressLine2": "Goldcrest Way",
                      "townOrCity": "Newcastle upon Tyne",
                      "country": "England",
                      "postcode": "NE15 8NY",
                      "_meta": {
                          "channel": "HRT_ONLINE",
                          "createdTimestamp": "2023-01-22T09:00:00.316",
                          "createdBy": "HRT_ONLINE",
                          "updatedTimestamp": "2023-01-22T09:00:00.316",
                          "updatedBy": "HRT_ONLINE"
                      },
                      "_links": {
                          "citizen": {
                              "href": "http://localhost:8100/v1/citizens/ac100bcf-8a21-1839-818a-2c57cba6005a"
                          }
                      }
                  }
              ],
              "emails": [],
              "_meta": {
                  "channel": "HRT_ONLINE",
                  "createdTimestamp": "2023-01-22T09:00:00.316",
                  "createdBy": "HRT_ONLINE",
                  "updatedTimestamp": "2023-01-22T09:00:00.316",
                  "updatedBy": "HRT_ONLINE"
              },
              "_links": {
                  "self": {
                      "href": "http://localhost:8100/v1/citizens/ac100bcf-8a21-1839-818a-2c57cba6005a"
                  },
                  "citizen": {
                      "href": "http://localhost:8100/v1/citizens/ac100bcf-8a21-1839-818a-2c57cba6005a"
                  }
              }
          },
          {
              "id": "ac100a58-8a21-1840-818a-2c57d0c8006d",
              "firstName": "John",
              "lastName": "Smith",
              "dateOfBirth": "1997-03-24",
              "addresses": [
                  {
                      "id": "ac100a58-8a21-1840-818a-2c57d0c8006d",
                      "type": "POSTAL",
                      "addressLine1": "Stella House",
                      "addressLine2": "Goldcrest Way",
                      "townOrCity": "Newcastle upon Tyne",
                      "country": "England",
                      "postcode": "NE15 8NY",
                      "_meta": {
                          "channel": "HRT_ONLINE",
                          "createdTimestamp": "2023-01-22T09:00:00.316",
                          "createdBy": "HRT_ONLINE",
                          "updatedTimestamp": "2023-01-22T09:00:00.316",
                          "updatedBy": "HRT_ONLINE"
                      },
                      "_links": {
                          "citizen": {
                              "href": "http://localhost:8100/v1/citizens/ac100a58-8a21-1840-818a-2c57d0c8006d"
                          }
                      }
                  }
              ],
              "emails": [],
              "_meta": {
                  "channel": "HRT_ONLINE",
                  "createdTimestamp": "2023-01-22T09:00:00.316",
                  "createdBy": "HRT_ONLINE",
                  "updatedTimestamp": "2023-01-22T09:00:00.316",
                  "updatedBy": "HRT_ONLINE"
              },
              "_links": {
                  "self": {
                      "href": "http://localhost:8100/v1/citizens/ac100a58-8a21-1840-818a-2c57d0c8006d"
                  },
                  "citizen": {
                      "href": "http://localhost:8100/v1/citizens/ac100a58-8a21-1840-818a-2c57d0c8006d"
                  }
              }
          },
          {
              "id": "ac100bcf-8a21-1839-818a-2c58a41b0060",
              "firstName": "John",
              "lastName": "Smith",
              "dateOfBirth": "1997-03-24",
              "addresses": [
                  {
                      "id": "ac100bcf-8a21-1839-818a-2c58a41b0060",
                      "type": "POSTAL",
                      "addressLine1": "Stella House",
                      "addressLine2": "Goldcrest Way",
                      "townOrCity": "Newcastle upon Tyne",
                      "country": "England",
                      "postcode": "NE15 8NY",
                      "_meta": {
                          "channel": "HRT_ONLINE",
                          "createdTimestamp": "2023-01-22T09:00:00.316",
                          "createdBy": "HRT_ONLINE",
                          "updatedTimestamp": "2023-01-22T09:00:00.316",
                          "updatedBy": "HRT_ONLINE"
                      },
                      "_links": {
                          "citizen": {
                              "href": "http://localhost:8100/v1/citizens/ac100bcf-8a21-1839-818a-2c58a41b0060"
                          }
                      }
                  }
              ],
              "emails": [],
              "_meta": {
                  "channel": "HRT_ONLINE",
                  "createdTimestamp": "2023-01-22T09:00:00.316",
                  "createdBy": "HRT_ONLINE",
                  "updatedTimestamp": "2023-01-22T09:00:00.316",
                  "updatedBy": "HRT_ONLINE"
              },
              "_links": {
                  "self": {
                      "href": "http://localhost:8100/v1/citizens/ac100bcf-8a21-1839-818a-2c58a41b0060"
                  },
                  "citizen": {
                      "href": "http://localhost:8100/v1/citizens/ac100bcf-8a21-1839-818a-2c58a41b0060"
                  }
              }
          },
          {
              "id": "ac100a58-8a21-1840-818a-2c58a92a0070",
              "firstName": "John",
              "lastName": "Smith",
              "dateOfBirth": "1997-03-24",
              "addresses": [
                  {
                      "id": "ac100a58-8a21-1840-818a-2c58a92a0070",
                      "type": "POSTAL",
                      "addressLine1": "Stella House",
                      "addressLine2": "Goldcrest Way",
                      "townOrCity": "Newcastle upon Tyne",
                      "country": "England",
                      "postcode": "NE15 8NY",
                      "_meta": {
                          "channel": "HRT_ONLINE",
                          "createdTimestamp": "2023-01-22T09:00:00.316",
                          "createdBy": "HRT_ONLINE",
                          "updatedTimestamp": "2023-01-22T09:00:00.316",
                          "updatedBy": "HRT_ONLINE"
                      },
                      "_links": {
                          "citizen": {
                              "href": "http://localhost:8100/v1/citizens/ac100a58-8a21-1840-818a-2c58a92a0070"
                          }
                      }
                  }
              ],
              "emails": [],
              "_meta": {
                  "channel": "HRT_ONLINE",
                  "createdTimestamp": "2023-01-22T09:00:00.316",
                  "createdBy": "HRT_ONLINE",
                  "updatedTimestamp": "2023-01-22T09:00:00.316",
                  "updatedBy": "HRT_ONLINE"
              },
              "_links": {
                  "self": {
                      "href": "http://localhost:8100/v1/citizens/ac100a58-8a21-1840-818a-2c58a92a0070"
                  },
                  "citizen": {
                      "href": "http://localhost:8100/v1/citizens/ac100a58-8a21-1840-818a-2c58a92a0070"
                  }
              }
          },
          {
              "id": "ac100bcf-8a21-1839-818a-2c58ba5a0063",
              "firstName": "John",
              "lastName": "Smith",
              "dateOfBirth": "1997-03-24",
              "addresses": [
                  {
                      "id": "ac100bcf-8a21-1839-818a-2c58ba5a0063",
                      "type": "POSTAL",
                      "addressLine1": "Stella House",
                      "addressLine2": "Goldcrest Way",
                      "townOrCity": "Newcastle upon Tyne",
                      "country": "England",
                      "postcode": "NE15 8NY",
                      "_meta": {
                          "channel": "HRT_ONLINE",
                          "createdTimestamp": "2023-01-22T09:00:00.316",
                          "createdBy": "HRT_ONLINE",
                          "updatedTimestamp": "2023-01-22T09:00:00.316",
                          "updatedBy": "HRT_ONLINE"
                      },
                      "_links": {
                          "citizen": {
                              "href": "http://localhost:8100/v1/citizens/ac100bcf-8a21-1839-818a-2c58ba5a0063"
                          }
                      }
                  }
              ],
              "emails": [],
              "_meta": {
                  "channel": "HRT_ONLINE",
                  "createdTimestamp": "2023-01-22T09:00:00.316",
                  "createdBy": "HRT_ONLINE",
                  "updatedTimestamp": "2023-01-22T09:00:00.316",
                  "updatedBy": "HRT_ONLINE"
              },
              "_links": {
                  "self": {
                      "href": "http://localhost:8100/v1/citizens/ac100bcf-8a21-1839-818a-2c58ba5a0063"
                  },
                  "citizen": {
                      "href": "http://localhost:8100/v1/citizens/ac100bcf-8a21-1839-818a-2c58ba5a0063"
                  }
              }
          },
          {
              "id": "ac100a58-8a21-1840-818a-2c58be1a0073",
              "firstName": "John",
              "lastName": "Smith",
              "dateOfBirth": "1997-03-24",
              "addresses": [
                  {
                      "id": "ac100a58-8a21-1840-818a-2c58be1a0073",
                      "type": "POSTAL",
                      "addressLine1": "Stella House",
                      "addressLine2": "Goldcrest Way",
                      "townOrCity": "Newcastle upon Tyne",
                      "country": "England",
                      "postcode": "NE15 8NY",
                      "_meta": {
                          "channel": "HRT_ONLINE",
                          "createdTimestamp": "2023-01-22T09:00:00.316",
                          "createdBy": "HRT_ONLINE",
                          "updatedTimestamp": "2023-01-22T09:00:00.316",
                          "updatedBy": "HRT_ONLINE"
                      },
                      "_links": {
                          "citizen": {
                              "href": "http://localhost:8100/v1/citizens/ac100a58-8a21-1840-818a-2c58be1a0073"
                          }
                      }
                  }
              ],
              "emails": [],
              "_meta": {
                  "channel": "HRT_ONLINE",
                  "createdTimestamp": "2023-01-22T09:00:00.316",
                  "createdBy": "HRT_ONLINE",
                  "updatedTimestamp": "2023-01-22T09:00:00.316",
                  "updatedBy": "HRT_ONLINE"
              },
              "_links": {
                  "self": {
                      "href": "http://localhost:8100/v1/citizens/ac100a58-8a21-1840-818a-2c58be1a0073"
                  },
                  "citizen": {
                      "href": "http://localhost:8100/v1/citizens/ac100a58-8a21-1840-818a-2c58be1a0073"
                  }
              }
          },
          {
              "id": "ac100bcf-8a21-1839-818a-2c58c2520066",
              "firstName": "John",
              "lastName": "Smith",
              "dateOfBirth": "1997-03-24",
              "addresses": [
                  {
                      "id": "ac100bcf-8a21-1839-818a-2c58c2520066",
                      "type": "POSTAL",
                      "addressLine1": "Stella House",
                      "addressLine2": "Goldcrest Way",
                      "townOrCity": "Newcastle upon Tyne",
                      "country": "England",
                      "postcode": "NE15 8NY",
                      "_meta": {
                          "channel": "HRT_ONLINE",
                          "createdTimestamp": "2023-01-22T09:00:00.316",
                          "createdBy": "HRT_ONLINE",
                          "updatedTimestamp": "2023-01-22T09:00:00.316",
                          "updatedBy": "HRT_ONLINE"
                      },
                      "_links": {
                          "citizen": {
                              "href": "http://localhost:8100/v1/citizens/ac100bcf-8a21-1839-818a-2c58c2520066"
                          }
                      }
                  }
              ],
              "emails": [],
              "_meta": {
                  "channel": "HRT_ONLINE",
                  "createdTimestamp": "2023-01-22T09:00:00.316",
                  "createdBy": "HRT_ONLINE",
                  "updatedTimestamp": "2023-01-22T09:00:00.316",
                  "updatedBy": "HRT_ONLINE"
              },
              "_links": {
                  "self": {
                      "href": "http://localhost:8100/v1/citizens/ac100bcf-8a21-1839-818a-2c58c2520066"
                  },
                  "citizen": {
                      "href": "http://localhost:8100/v1/citizens/ac100bcf-8a21-1839-818a-2c58c2520066"
                  }
              }
          },
          {
              "id": "ac100a58-8a21-1840-818a-2c58c5dd0076",
              "firstName": "John",
              "lastName": "Smith",
              "dateOfBirth": "1997-03-24",
              "addresses": [
                  {
                      "id": "ac100a58-8a21-1840-818a-2c58c5dd0076",
                      "type": "POSTAL",
                      "addressLine1": "Stella House",
                      "addressLine2": "Goldcrest Way",
                      "townOrCity": "Newcastle upon Tyne",
                      "country": "England",
                      "postcode": "NE15 8NY",
                      "_meta": {
                          "channel": "HRT_ONLINE",
                          "createdTimestamp": "2023-01-22T09:00:00.316",
                          "createdBy": "HRT_ONLINE",
                          "updatedTimestamp": "2023-01-22T09:00:00.316",
                          "updatedBy": "HRT_ONLINE"
                      },
                      "_links": {
                          "citizen": {
                              "href": "http://localhost:8100/v1/citizens/ac100a58-8a21-1840-818a-2c58c5dd0076"
                          }
                      }
                  }
              ],
              "emails": [],
              "_meta": {
                  "channel": "HRT_ONLINE",
                  "createdTimestamp": "2023-01-22T09:00:00.316",
                  "createdBy": "HRT_ONLINE",
                  "updatedTimestamp": "2023-01-22T09:00:00.316",
                  "updatedBy": "HRT_ONLINE"
              },
              "_links": {
                  "self": {
                      "href": "http://localhost:8100/v1/citizens/ac100a58-8a21-1840-818a-2c58c5dd0076"
                  },
                  "citizen": {
                      "href": "http://localhost:8100/v1/citizens/ac100a58-8a21-1840-818a-2c58c5dd0076"
                  }
              }
          },
          {
              "id": "ac100bcf-8a21-1839-818a-2c58cc3a0069",
              "firstName": "John",
              "lastName": "Smith",
              "dateOfBirth": "1997-03-24",
              "addresses": [
                  {
                      "id": "ac100bcf-8a21-1839-818a-2c58cc3a0069",
                      "type": "POSTAL",
                      "addressLine1": "Stella House",
                      "addressLine2": "Goldcrest Way",
                      "townOrCity": "Newcastle upon Tyne",
                      "country": "England",
                      "postcode": "NE15 8NY",
                      "_meta": {
                          "channel": "HRT_ONLINE",
                          "createdTimestamp": "2023-01-22T09:00:00.316",
                          "createdBy": "HRT_ONLINE",
                          "updatedTimestamp": "2023-01-22T09:00:00.316",
                          "updatedBy": "HRT_ONLINE"
                      },
                      "_links": {
                          "citizen": {
                              "href": "http://localhost:8100/v1/citizens/ac100bcf-8a21-1839-818a-2c58cc3a0069"
                          }
                      }
                  }
              ],
              "emails": [],
              "_meta": {
                  "channel": "HRT_ONLINE",
                  "createdTimestamp": "2023-01-22T09:00:00.316",
                  "createdBy": "HRT_ONLINE",
                  "updatedTimestamp": "2023-01-22T09:00:00.316",
                  "updatedBy": "HRT_ONLINE"
              },
              "_links": {
                  "self": {
                      "href": "http://localhost:8100/v1/citizens/ac100bcf-8a21-1839-818a-2c58cc3a0069"
                  },
                  "citizen": {
                      "href": "http://localhost:8100/v1/citizens/ac100bcf-8a21-1839-818a-2c58cc3a0069"
                  }
              }
          },
          {
              "id": "ac100a58-8a21-1840-818a-2c58cf8f0079",
              "firstName": "John",
              "lastName": "Smith",
              "dateOfBirth": "1997-03-24",
              "addresses": [
                  {
                      "id": "ac100a58-8a21-1840-818a-2c58cf8f0079",
                      "type": "POSTAL",
                      "addressLine1": "Stella House",
                      "addressLine2": "Goldcrest Way",
                      "townOrCity": "Newcastle upon Tyne",
                      "country": "England",
                      "postcode": "NE15 8NY",
                      "_meta": {
                          "channel": "HRT_ONLINE",
                          "createdTimestamp": "2023-01-22T09:00:00.316",
                          "createdBy": "HRT_ONLINE",
                          "updatedTimestamp": "2023-01-22T09:00:00.316",
                          "updatedBy": "HRT_ONLINE"
                      },
                      "_links": {
                          "citizen": {
                              "href": "http://localhost:8100/v1/citizens/ac100a58-8a21-1840-818a-2c58cf8f0079"
                          }
                      }
                  }
              ],
              "emails": [],
              "_meta": {
                  "channel": "HRT_ONLINE",
                  "createdTimestamp": "2023-01-22T09:00:00.316",
                  "createdBy": "HRT_ONLINE",
                  "updatedTimestamp": "2023-01-22T09:00:00.316",
                  "updatedBy": "HRT_ONLINE"
              },
              "_links": {
                  "self": {
                      "href": "http://localhost:8100/v1/citizens/ac100a58-8a21-1840-818a-2c58cf8f0079"
                  },
                  "citizen": {
                      "href": "http://localhost:8100/v1/citizens/ac100a58-8a21-1840-818a-2c58cf8f0079"
                  }
              }
          },
          {
              "id": "ac100bcf-8a21-1839-818a-2c58d39e006c",
              "firstName": "John",
              "lastName": "Smith",
              "dateOfBirth": "1997-03-24",
              "addresses": [
                  {
                      "id": "ac100bcf-8a21-1839-818a-2c58d39e006c",
                      "type": "POSTAL",
                      "addressLine1": "Stella House",
                      "addressLine2": "Goldcrest Way",
                      "townOrCity": "Newcastle upon Tyne",
                      "country": "England",
                      "postcode": "NE15 8NY",
                      "_meta": {
                          "channel": "HRT_ONLINE",
                          "createdTimestamp": "2023-01-22T09:00:00.316",
                          "createdBy": "HRT_ONLINE",
                          "updatedTimestamp": "2023-01-22T09:00:00.316",
                          "updatedBy": "HRT_ONLINE"
                      },
                      "_links": {
                          "citizen": {
                              "href": "http://localhost:8100/v1/citizens/ac100bcf-8a21-1839-818a-2c58d39e006c"
                          }
                      }
                  }
              ],
              "emails": [],
              "_meta": {
                  "channel": "HRT_ONLINE",
                  "createdTimestamp": "2023-01-22T09:00:00.316",
                  "createdBy": "HRT_ONLINE",
                  "updatedTimestamp": "2023-01-22T09:00:00.316",
                  "updatedBy": "HRT_ONLINE"
              },
              "_links": {
                  "self": {
                      "href": "http://localhost:8100/v1/citizens/ac100bcf-8a21-1839-818a-2c58d39e006c"
                  },
                  "citizen": {
                      "href": "http://localhost:8100/v1/citizens/ac100bcf-8a21-1839-818a-2c58d39e006c"
                  }
              }
          },
          {
              "id": "ac100a58-8a21-1840-818a-2c58d96e007c",
              "firstName": "John",
              "lastName": "Smith",
              "dateOfBirth": "1997-03-24",
              "addresses": [
                  {
                      "id": "ac100a58-8a21-1840-818a-2c58d96e007c",
                      "type": "POSTAL",
                      "addressLine1": "Stella House",
                      "addressLine2": "Goldcrest Way",
                      "townOrCity": "Newcastle upon Tyne",
                      "country": "England",
                      "postcode": "NE15 8NY",
                      "_meta": {
                          "channel": "HRT_ONLINE",
                          "createdTimestamp": "2023-01-22T09:00:00.316",
                          "createdBy": "HRT_ONLINE",
                          "updatedTimestamp": "2023-01-22T09:00:00.316",
                          "updatedBy": "HRT_ONLINE"
                      },
                      "_links": {
                          "citizen": {
                              "href": "http://localhost:8100/v1/citizens/ac100a58-8a21-1840-818a-2c58d96e007c"
                          }
                      }
                  }
              ],
              "emails": [],
              "_meta": {
                  "channel": "HRT_ONLINE",
                  "createdTimestamp": "2023-01-22T09:00:00.316",
                  "createdBy": "HRT_ONLINE",
                  "updatedTimestamp": "2023-01-22T09:00:00.316",
                  "updatedBy": "HRT_ONLINE"
              },
              "_links": {
                  "self": {
                      "href": "http://localhost:8100/v1/citizens/ac100a58-8a21-1840-818a-2c58d96e007c"
                  },
                  "citizen": {
                      "href": "http://localhost:8100/v1/citizens/ac100a58-8a21-1840-818a-2c58d96e007c"
                  }
              }
          },
          {
              "id": "ac100bcf-8a21-1839-818a-2c58dc96006f",
              "firstName": "John",
              "lastName": "Smith",
              "dateOfBirth": "1997-03-24",
              "addresses": [
                  {
                      "id": "ac100bcf-8a21-1839-818a-2c58dc96006f",
                      "type": "POSTAL",
                      "addressLine1": "Stella House",
                      "addressLine2": "Goldcrest Way",
                      "townOrCity": "Newcastle upon Tyne",
                      "country": "England",
                      "postcode": "NE15 8NY",
                      "_meta": {
                          "channel": "HRT_ONLINE",
                          "createdTimestamp": "2023-01-22T09:00:00.316",
                          "createdBy": "HRT_ONLINE",
                          "updatedTimestamp": "2023-01-22T09:00:00.316",
                          "updatedBy": "HRT_ONLINE"
                      },
                      "_links": {
                          "citizen": {
                              "href": "http://localhost:8100/v1/citizens/ac100bcf-8a21-1839-818a-2c58dc96006f"
                          }
                      }
                  }
              ],
              "emails": [],
              "_meta": {
                  "channel": "HRT_ONLINE",
                  "createdTimestamp": "2023-01-22T09:00:00.316",
                  "createdBy": "HRT_ONLINE",
                  "updatedTimestamp": "2023-01-22T09:00:00.316",
                  "updatedBy": "HRT_ONLINE"
              },
              "_links": {
                  "self": {
                      "href": "http://localhost:8100/v1/citizens/ac100bcf-8a21-1839-818a-2c58dc96006f"
                  },
                  "citizen": {
                      "href": "http://localhost:8100/v1/citizens/ac100bcf-8a21-1839-818a-2c58dc96006f"
                  }
              }
          },
          {
              "id": "ac100a58-8a21-1840-818a-2c58e1b2007f",
              "firstName": "John",
              "lastName": "Smith",
              "dateOfBirth": "1997-03-24",
              "addresses": [
                  {
                      "id": "ac100a58-8a21-1840-818a-2c58e1b2007f",
                      "type": "POSTAL",
                      "addressLine1": "Stella House",
                      "addressLine2": "Goldcrest Way",
                      "townOrCity": "Newcastle upon Tyne",
                      "country": "England",
                      "postcode": "NE15 8NY",
                      "_meta": {
                          "channel": "HRT_ONLINE",
                          "createdTimestamp": "2023-01-22T09:00:00.316",
                          "createdBy": "HRT_ONLINE",
                          "updatedTimestamp": "2023-01-22T09:00:00.316",
                          "updatedBy": "HRT_ONLINE"
                      },
                      "_links": {
                          "citizen": {
                              "href": "http://localhost:8100/v1/citizens/ac100a58-8a21-1840-818a-2c58e1b2007f"
                          }
                      }
                  }
              ],
              "emails": [],
              "_meta": {
                  "channel": "HRT_ONLINE",
                  "createdTimestamp": "2023-01-22T09:00:00.316",
                  "createdBy": "HRT_ONLINE",
                  "updatedTimestamp": "2023-01-22T09:00:00.316",
                  "updatedBy": "HRT_ONLINE"
              },
              "_links": {
                  "self": {
                      "href": "http://localhost:8100/v1/citizens/ac100a58-8a21-1840-818a-2c58e1b2007f"
                  },
                  "citizen": {
                      "href": "http://localhost:8100/v1/citizens/ac100a58-8a21-1840-818a-2c58e1b2007f"
                  }
              }
          },
          {
              "id": "ac100bcf-8a21-1839-818a-2c58e64f0072",
              "firstName": "John",
              "lastName": "Smith",
              "dateOfBirth": "1997-03-24",
              "addresses": [
                  {
                      "id": "ac100bcf-8a21-1839-818a-2c58e64f0072",
                      "type": "POSTAL",
                      "addressLine1": "Stella House",
                      "addressLine2": "Goldcrest Way",
                      "townOrCity": "Newcastle upon Tyne",
                      "country": "England",
                      "postcode": "NE15 8NY",
                      "_meta": {
                          "channel": "HRT_ONLINE",
                          "createdTimestamp": "2023-01-22T09:00:00.316",
                          "createdBy": "HRT_ONLINE",
                          "updatedTimestamp": "2023-01-22T09:00:00.316",
                          "updatedBy": "HRT_ONLINE"
                      },
                      "_links": {
                          "citizen": {
                              "href": "http://localhost:8100/v1/citizens/ac100bcf-8a21-1839-818a-2c58e64f0072"
                          }
                      }
                  }
              ],
              "emails": [],
              "_meta": {
                  "channel": "HRT_ONLINE",
                  "createdTimestamp": "2023-01-22T09:00:00.316",
                  "createdBy": "HRT_ONLINE",
                  "updatedTimestamp": "2023-01-22T09:00:00.316",
                  "updatedBy": "HRT_ONLINE"
              },
              "_links": {
                  "self": {
                      "href": "http://localhost:8100/v1/citizens/ac100bcf-8a21-1839-818a-2c58e64f0072"
                  },
                  "citizen": {
                      "href": "http://localhost:8100/v1/citizens/ac100bcf-8a21-1839-818a-2c58e64f0072"
                  }
              }
          }
      ]
  },
  "_links": {
      "first": {
          "href": "http://localhost:8100/v1/citizens?firstName=John&lastName=Smith&dateOfBirth=1997-03-24&addresses.postcode=NE158NY&page=0&size=50"
      },
      "self": {
          "href": "http://localhost:8100/v1/citizens?firstName=John&lastName=Smith&dateOfBirth=1997-03-24&addresses.postcode=NE158NY&page=0&size=50"
      },
      "next": {
          "href": "http://localhost:8100/v1/citizens?firstName=John&lastName=Smith&dateOfBirth=1997-03-24&addresses.postcode=NE158NY&page=1&size=50"
      },
      "last": {
          "href": "http://localhost:8100/v1/citizens?firstName=John&lastName=Smith&dateOfBirth=1997-03-24&addresses.postcode=NE158NY&page=10&size=50"
      },
      "profile": {
          "href": "http://localhost:8100/v1/profile/citizens"
      }
  },
  "page": {
      "size": 50,
      "totalElements": 501,
      "totalPages": 11,
      "number": 0
  }
}