// Jest Snapshot v1, https://goo.gl/fbAQLP

exports[`notification sendNotificationPost() should POST to notification API with valid request body 1`] = `
[
  [
    {
      "data": {
        "certificateType": "HRT_PPC",
        "method": "EMAIL",
        "purpose": "REISSUE",
      },
      "headers": {
        "header": "value",
      },
      "method": "POST",
      "responseType": "json",
      "url": "/v1/notifications?certificateId=certapix-idxx-xxxx-xxxx-xxxxxxxxxxxx",
    },
  ],
]
`;

exports[`notification sendNotificationPost() should POST to notification API with valid request body 2`] = `
[
  [
    {
      "data": {
        "certificateType": "HRT_PPC",
        "method": "POST",
        "purpose": "REISSUE",
      },
      "headers": {
        "header": "value",
      },
      "method": "POST",
      "responseType": "json",
      "url": "/v1/notifications?certificateId=certapix-idxx-xxxx-xxxx-xxxxxxxxxxxx",
    },
  ],
]
`;
